You are viewing a plain text version of this content. The canonical link for it is here.
Posted to builds@cassandra.apache.org by Apache Jenkins Server <je...@builds.apache.org> on 2022/02/18 00:21:45 UTC

Build complete: Cassandra-trunk #965 [UNSTABLE] adf2f4c83a2766ef8ebd20b35b49df50957bdf5e

-------------------------------------------------------------------------------
Build Cassandra-trunk #965 Still unstable
URL: https://ci-cassandra.apache.org/job/Cassandra-trunk/965/
-------------------------------------------------------------------------------
Changes:
[Aleksei Zotov] Fixed TestCqlshOutput failing tests


-------------------------------------------------------------------------------
Failed Tests:
15 tests failed.
FAILED:  dtest-novnode.jmx_test.TestJMX.test_table_metric_mbeans
FAILED:  dtest-novnode.read_repair_test.TestSpeculativeReadRepair.test_speculative_write
FAILED:  dtest-novnode.repair_tests.incremental_repair_test.TestIncRepair.test_repaired_tracking_with_partition_deletes
FAILED:  dtest-offheap.cqlsh_tests.test_cqlsh_copy.TestCqlshCopy.test_bulk_round_trip_default
FAILED:  org.apache.cassandra.distributed.test.repair.ForceRepairTest.forceWithDifference
FAILED:  org.apache.cassandra.db.compaction.SingleSSTableLCSTaskTest.uplevelDisabledTest
FAILED:  org.apache.cassandra.db.commitlog.CommitLogSegmentManagerCDCTest.testCompletedFlag
FAILED:  org.apache.cassandra.db.commitlog.GroupCommitLogTest.testHeaderOnlyFileFiltering[3]-compression
FAILED:  org.apache.cassandra.db.commitlog.GroupCommitLogTest.replayWithBadSyncMarkerCRC[3]-compression
FAILED:  org.apache.cassandra.net.ConnectionTest.testMessageDeliveryOnReconnect
FAILED:  org.apache.cassandra.db.lifecycle.LogTransactionTest.testGetTemporaryFilesSafeAfterObsoletion-compression
FAILED:  dtest-upgrade.upgrade_tests.upgrade_through_versions_test.TestProtoV3Upgrade_AllVersions_EndsAt_3_11_X.test_rolling_upgrade
FAILED:  dtest-upgrade.upgrade_tests.upgrade_through_versions_test.TestProtoV3Upgrade_AllVersions_EndsAt_3_11_X.test_rolling_upgrade_with_internode_ssl
FAILED:  dtest-upgrade.upgrade_tests.upgrade_through_versions_test.TestProtoV3Upgrade_AllVersions_RandomPartitioner_EndsAt_3_11_X_HEAD.test_rolling_upgrade
FAILED:  dtest-upgrade.upgrade_tests.upgrade_through_versions_test.TestProtoV3Upgrade_AllVersions_RandomPartitioner_EndsAt_3_11_X_HEAD.test_rolling_upgrade_with_internode_ssl

-------------------------------------------------------------------------------
For complete test report and logs see https://nightlies.apache.org/cassandra/Cassandra-trunk/965/