You are viewing a plain text version of this content. The canonical link for it is here.
Posted to builds@cassandra.apache.org by Apache Jenkins Server <je...@builds.apache.org> on 2025/03/24 20:16:34 UTC

Build complete: Cassandra-trunk #2079 [UNSTABLE] 9ac8a1fa98f0f96cf6f134769ed5debafdb90a7f

-------------------------------------------------------------------------------
  Build Cassandra-trunk #2079 Still Unstable
  URL: https://ci-cassandra.apache.org/job/Cassandra-trunk/2079/
  -------------------------------------------------------------------------------
  Changes:
  [Michael Semb Wever] Fix typo on architecture/overview.adoc


  -------------------------------------------------------------------------------
  Failed Tests:
  5 tests failed.
FAILED:  dtest-novnode.counter_test.TestCounters.Tests / dtest-novnode jdk11 11/64 / test_counter_node_down
FAILED:  dtest-upgrade-novnode-large.upgrade_tests.upgrade_through_versions_test.TestProtoV5Upgrade_AllVersions_EndsAt_Trunk_HEAD.Tests / dtest-upgrade-novnode-large jdk11 23/32 / test_parallel_upgrade_with_internode_ssl
FAILED:  dtest.bootstrap_test.TestBootstrap.Tests / dtest jdk11 20/64 / test_cleanup
FAILED:  org.apache.cassandra.fuzz.sai.MultiNodeSAITest.Tests / jvm-dtest jdk17 9/12 / indexOnlySaiTest-cassandra.testtag_IS_UNDEFINED
FAILED:  org.apache.cassandra.fuzz.sai.MultiNodeSAITest.Tests / jvm-dtest jdk11 9/12 / indexOnlySaiTest-cassandra.testtag_IS_UNDEFINED

  -------------------------------------------------------------------------------
  For complete test report and logs see https://nightlies.apache.org/cassandra/Cassandra-trunk/2079/