You are viewing a plain text version of this content. The canonical link for it is here.
Posted to builds@solr.apache.org by Apache Jenkins Server <je...@builds.apache.org> on 2024/02/23 02:28:54 UTC
[JENKINS] Lucene » Lucene-Solr-Tests-8.11 - Build # 571 - Unstable!
Build: https://ci-builds.apache.org/job/Lucene/job/Lucene-Solr-Tests-8.11/571/
1 tests failed.
FAILED: org.apache.solr.cloud.api.collections.ShardSplitTest.testSplitMixedReplicaTypes
Error Message:
Timeout occurred while waiting response from server at: http://127.0.0.1:38429/_/i
Stack Trace:
org.apache.solr.client.solrj.SolrServerException: Timeout occurred while waiting response from server at: http://127.0.0.1:38429/_/i
at __randomizedtesting.SeedInfo.seed([359286B6ADD41B85:8D51D216510FCEF0]:0)
at org.apache.solr.client.solrj.impl.HttpSolrClient.executeMethod(HttpSolrClient.java:692)
at org.apache.solr.client.solrj.impl.HttpSolrClient.request(HttpSolrClient.java:266)
at org.apache.solr.client.solrj.impl.HttpSolrClient.request(HttpSolrClient.java:248)
at org.apache.solr.client.solrj.impl.LBSolrClient.doRequest(LBSolrClient.java:369)
at org.apache.solr.client.solrj.impl.LBSolrClient.request(LBSolrClient.java:297)
at org.apache.solr.client.solrj.impl.BaseCloudSolrClient.sendRequest(BaseCloudSolrClient.java:1188)
at org.apache.solr.client.solrj.impl.BaseCloudSolrClient.requestWithRetryOnStaleState(BaseCloudSolrClient.java:934)
at org.apache.solr.client.solrj.impl.BaseCloudSolrClient.request(BaseCloudSolrClient.java:866)
at org.apache.solr.client.solrj.SolrRequest.process(SolrRequest.java:225)
at org.apache.solr.client.solrj.SolrRequest.process(SolrRequest.java:242)
at org.apache.solr.cloud.api.collections.ShardSplitTest.doSplitMixedReplicaTypes(ShardSplitTest.java:365)
at org.apache.solr.cloud.api.collections.ShardSplitTest.testSplitMixedReplicaTypes(ShardSplitTest.java:350)
at sun.reflect.NativeMethodAccessorImpl.invoke0(Native Method)
at sun.reflect.NativeMethodAccessorImpl.invoke(NativeMethodAccessorImpl.java:62)
at sun.reflect.DelegatingMethodAccessorImpl.invoke(DelegatingMethodAccessorImpl.java:43)
at java.lang.reflect.Method.invoke(Method.java:498)
at com.carrotsearch.randomizedtesting.RandomizedRunner.invoke(RandomizedRunner.java:1758)
at com.carrotsearch.randomizedtesting.RandomizedRunner$8.evaluate(RandomizedRunner.java:946)
at com.carrotsearch.randomizedtesting.RandomizedRunner$9.evaluate(RandomizedRunner.java:982)
at com.carrotsearch.randomizedtesting.RandomizedRunner$10.evaluate(RandomizedRunner.java:996)
at org.apache.solr.BaseDistributedSearchTestCase$ShardsRepeatRule$ShardsFixedStatement.callStatement(BaseDistributedSearchTestCase.java:1084)
at org.apache.solr.BaseDistributedSearchTestCase$ShardsRepeatRule$ShardsStatement.evaluate(BaseDistributedSearchTestCase.java:1055)
at com.carrotsearch.randomizedtesting.rules.SystemPropertiesRestoreRule$1.evaluate(SystemPropertiesRestoreRule.java:80)
at org.junit.rules.RunRules.evaluate(RunRules.java:20)
at org.apache.lucene.util.TestRuleSetupTeardownChained$1.evaluate(TestRuleSetupTeardownChained.java:49)
at org.apache.lucene.util.AbstractBeforeAfterRule$1.evaluate(AbstractBeforeAfterRule.java:45)
at org.apache.lucene.util.TestRuleThreadAndTestName$1.evaluate(TestRuleThreadAndTestName.java:48)
at org.apache.lucene.util.TestRuleIgnoreAfterMaxFailures$1.evaluate(TestRuleIgnoreAfterMaxFailures.java:64)
at org.apache.lucene.util.TestRuleMarkFailure$1.evaluate(TestRuleMarkFailure.java:47)
at org.junit.rules.RunRules.evaluate(RunRules.java:20)
at com.carrotsearch.randomizedtesting.rules.StatementAdapter.evaluate(StatementAdapter.java:36)
at com.carrotsearch.randomizedtesting.ThreadLeakControl$StatementRunner.run(ThreadLeakControl.java:390)
at com.carrotsearch.randomizedtesting.ThreadLeakControl.forkTimeoutingTask(ThreadLeakControl.java:843)
at com.carrotsearch.randomizedtesting.ThreadLeakControl$3.evaluate(ThreadLeakControl.java:490)
at com.carrotsearch.randomizedtesting.RandomizedRunner.runSingleTest(RandomizedRunner.java:955)
at com.carrotsearch.randomizedtesting.RandomizedRunner$5.evaluate(RandomizedRunner.java:840)
at com.carrotsearch.randomizedtesting.RandomizedRunner$6.evaluate(RandomizedRunner.java:891)
at com.carrotsearch.randomizedtesting.RandomizedRunner$7.evaluate(RandomizedRunner.java:902)
at com.carrotsearch.randomizedtesting.rules.StatementAdapter.evaluate(StatementAdapter.java:36)
at com.carrotsearch.randomizedtesting.rules.SystemPropertiesRestoreRule$1.evaluate(SystemPropertiesRestoreRule.java:80)
at org.junit.rules.RunRules.evaluate(RunRules.java:20)
at org.apache.lucene.util.AbstractBeforeAfterRule$1.evaluate(AbstractBeforeAfterRule.java:45)
at com.carrotsearch.randomizedtesting.rules.StatementAdapter.evaluate(StatementAdapter.java:36)
at org.apache.lucene.util.TestRuleStoreClassName$1.evaluate(TestRuleStoreClassName.java:41)
at com.carrotsearch.randomizedtesting.rules.NoShadowingOrOverridesOnMethodsRule$1.evaluate(NoShadowingOrOverridesOnMethodsRule.java:40)
at com.carrotsearch.randomizedtesting.rules.NoShadowingOrOverridesOnMethodsRule$1.evaluate(NoShadowingOrOverridesOnMethodsRule.java:40)
at com.carrotsearch.randomizedtesting.rules.StatementAdapter.evaluate(StatementAdapter.java:36)
at com.carrotsearch.randomizedtesting.rules.StatementAdapter.evaluate(StatementAdapter.java:36)
at com.carrotsearch.randomizedtesting.rules.StatementAdapter.evaluate(StatementAdapter.java:36)
at org.apache.lucene.util.TestRuleAssertionsRequired$1.evaluate(TestRuleAssertionsRequired.java:53)
at org.apache.lucene.util.TestRuleMarkFailure$1.evaluate(TestRuleMarkFailure.java:47)
at org.apache.lucene.util.TestRuleIgnoreAfterMaxFailures$1.evaluate(TestRuleIgnoreAfterMaxFailures.java:64)
at org.apache.lucene.util.TestRuleIgnoreTestSuites$1.evaluate(TestRuleIgnoreTestSuites.java:54)
at org.junit.rules.RunRules.evaluate(RunRules.java:20)
at com.carrotsearch.randomizedtesting.rules.StatementAdapter.evaluate(StatementAdapter.java:36)
at com.carrotsearch.randomizedtesting.ThreadLeakControl$StatementRunner.run(ThreadLeakControl.java:390)
at com.carrotsearch.randomizedtesting.ThreadLeakControl.lambda$forkTimeoutingTask$0(ThreadLeakControl.java:850)
at java.lang.Thread.run(Thread.java:750)
Caused by: java.net.SocketTimeoutException: Read timed out
at java.net.SocketInputStream.socketRead0(Native Method)
at java.net.SocketInputStream.socketRead(SocketInputStream.java:116)
at java.net.SocketInputStream.read(SocketInputStream.java:171)
at java.net.SocketInputStream.read(SocketInputStream.java:141)
at org.apache.http.impl.io.SessionInputBufferImpl.streamRead(SessionInputBufferImpl.java:137)
at org.apache.http.impl.io.SessionInputBufferImpl.fillBuffer(SessionInputBufferImpl.java:153)
at org.apache.http.impl.io.SessionInputBufferImpl.readLine(SessionInputBufferImpl.java:280)
at org.apache.http.impl.conn.DefaultHttpResponseParser.parseHead(DefaultHttpResponseParser.java:138)
at org.apache.http.impl.conn.DefaultHttpResponseParser.parseHead(DefaultHttpResponseParser.java:56)
at org.apache.http.impl.io.AbstractMessageParser.parse(AbstractMessageParser.java:259)
at org.apache.http.impl.DefaultBHttpClientConnection.receiveResponseHeader(DefaultBHttpClientConnection.java:163)
at org.apache.http.impl.conn.CPoolProxy.receiveResponseHeader(CPoolProxy.java:157)
at org.apache.http.protocol.HttpRequestExecutor.doReceiveResponse(HttpRequestExecutor.java:273)
at org.apache.http.protocol.HttpRequestExecutor.execute(HttpRequestExecutor.java:125)
at org.apache.http.impl.execchain.MainClientExec.execute(MainClientExec.java:272)
at org.apache.http.impl.execchain.ProtocolExec.execute(ProtocolExec.java:186)
at org.apache.http.impl.execchain.RetryExec.execute(RetryExec.java:89)
at org.apache.http.impl.execchain.RedirectExec.execute(RedirectExec.java:110)
at org.apache.http.impl.client.InternalHttpClient.doExecute(InternalHttpClient.java:185)
at org.apache.http.impl.client.CloseableHttpClient.execute(CloseableHttpClient.java:83)
at org.apache.http.impl.client.CloseableHttpClient.execute(CloseableHttpClient.java:56)
at org.apache.solr.client.solrj.impl.HttpSolrClient.executeMethod(HttpSolrClient.java:571)
... 57 more
Build Log:
[...truncated 15627 lines...]
[junit4] Suite: org.apache.solr.cloud.api.collections.ShardSplitTest
[junit4] 2> 1677590 INFO (SUITE-ShardSplitTest-seed#[359286B6ADD41B85]-worker) [ ] o.a.s.SolrTestCase Setting 'solr.default.confdir' system property to test-framework derived value of '/home/jenkins/jenkins-slave/workspace/Lucene/Lucene-Solr-Tests-8.11/solr/server/solr/configsets/_default/conf'
[junit4] 2> 1677590 INFO (SUITE-ShardSplitTest-seed#[359286B6ADD41B85]-worker) [ ] o.a.s.SolrTestCaseJ4 SecureRandom sanity checks: test.solr.allowed.securerandom=null & java.security.egd=file:/dev/./urandom
[junit4] 2> 1677591 INFO (SUITE-ShardSplitTest-seed#[359286B6ADD41B85]-worker) [ ] o.a.s.u.ErrorLogMuter Closing ErrorLogMuter-regex-390 after mutting 0 log messages
[junit4] 2> 1677591 INFO (SUITE-ShardSplitTest-seed#[359286B6ADD41B85]-worker) [ ] o.a.s.u.ErrorLogMuter Creating ErrorLogMuter-regex-391 for ERROR logs matching regex: ignore_exception
[junit4] 2> 1677592 INFO (SUITE-ShardSplitTest-seed#[359286B6ADD41B85]-worker) [ ] o.a.s.SolrTestCaseJ4 Created dataDir: /home/jenkins/jenkins-slave/workspace/Lucene/Lucene-Solr-Tests-8.11/solr/build/solr-core/test/J3/temp/solr.cloud.api.collections.ShardSplitTest_359286B6ADD41B85-001/data-dir-139-001
[junit4] 2> 1677592 INFO (SUITE-ShardSplitTest-seed#[359286B6ADD41B85]-worker) [ ] o.a.s.SolrTestCaseJ4 Using PointFields (NUMERIC_POINTS_SYSPROP=true) w/NUMERIC_DOCVALUES_SYSPROP=true
[junit4] 2> 1677593 INFO (SUITE-ShardSplitTest-seed#[359286B6ADD41B85]-worker) [ ] o.a.s.SolrTestCaseJ4 Randomized ssl (false) and clientAuth (false) via: @org.apache.solr.SolrTestCaseJ4$SuppressSSL(bugUrl=https://issues.apache.org/jira/browse/SOLR-5776)
[junit4] 2> 1677593 INFO (SUITE-ShardSplitTest-seed#[359286B6ADD41B85]-worker) [ ] o.a.s.BaseDistributedSearchTestCase Setting hostContext system property: /_/i
[junit4] IGNOR/A 0.00s J3 | ShardSplitTest.test
[junit4] > Assumption #1: 'nightly' test group is disabled (@Nightly())
[junit4] 2> 1677599 INFO (TEST-ShardSplitTest.testSplitMixedReplicaTypesLink-seed#[359286B6ADD41B85]) [ ] o.a.s.u.ErrorLogMuter Closing ErrorLogMuter-regex-391 after mutting 0 log messages
[junit4] 2> 1677599 INFO (TEST-ShardSplitTest.testSplitMixedReplicaTypesLink-seed#[359286B6ADD41B85]) [ ] o.a.s.u.ErrorLogMuter Creating ErrorLogMuter-regex-392 for ERROR logs matching regex: ignore_exception
[junit4] 2> 1677600 INFO (TEST-ShardSplitTest.testSplitMixedReplicaTypesLink-seed#[359286B6ADD41B85]) [ ] o.a.s.c.ZkTestServer STARTING ZK TEST SERVER
[junit4] 2> 1677600 INFO (ZkTestServer Run Thread) [ ] o.a.s.c.ZkTestServer client port: 0.0.0.0/0.0.0.0:0
[junit4] 2> 1677600 INFO (ZkTestServer Run Thread) [ ] o.a.s.c.ZkTestServer Starting server
[junit4] 2> 1677601 WARN (ZkTestServer Run Thread) [ ] o.a.z.s.ServerCnxnFactory maxCnxns is not configured, using default value 0.
[junit4] 2> 1677700 INFO (TEST-ShardSplitTest.testSplitMixedReplicaTypesLink-seed#[359286B6ADD41B85]) [ ] o.a.s.c.ZkTestServer start zk server on port: 37947
[junit4] 2> 1677700 INFO (TEST-ShardSplitTest.testSplitMixedReplicaTypesLink-seed#[359286B6ADD41B85]) [ ] o.a.s.c.ZkTestServer waitForServerUp: 127.0.0.1:37947
[junit4] 2> 1677700 INFO (TEST-ShardSplitTest.testSplitMixedReplicaTypesLink-seed#[359286B6ADD41B85]) [ ] o.a.s.c.ZkTestServer parse host and port list: 127.0.0.1:37947
[junit4] 2> 1677700 INFO (TEST-ShardSplitTest.testSplitMixedReplicaTypesLink-seed#[359286B6ADD41B85]) [ ] o.a.s.c.ZkTestServer connecting to 127.0.0.1 37947
[junit4] 2> 1677702 DEBUG (TEST-ShardSplitTest.testSplitMixedReplicaTypesLink-seed#[359286B6ADD41B85]) [ ] o.a.s.c.c.SolrZkClient Using default ZkCredentialsProvider
[junit4] 2> 1677703 INFO (TEST-ShardSplitTest.testSplitMixedReplicaTypesLink-seed#[359286B6ADD41B85]) [ ] o.a.s.c.c.ConnectionManager Waiting for client to connect to ZooKeeper
[junit4] 2> 1677711 DEBUG (TEST-ShardSplitTest.testSplitMixedReplicaTypesLink-seed#[359286B6ADD41B85]-EventThread) [ ] o.a.s.c.c.SolrZkClient Submitting job to respond to event WatchedEvent state:SyncConnected type:None path:null
[junit4] 2> 1677714 DEBUG (zkConnectionManagerCallback-15824-thread-1) [ ] o.a.s.c.c.ConnectionManager Watcher org.apache.solr.common.cloud.ConnectionManager@31e3eebe name: ZooKeeperConnection Watcher:127.0.0.1:37947 got event WatchedEvent state:SyncConnected type:None path:null path: null type: None
[junit4] 2> 1677714 INFO (zkConnectionManagerCallback-15824-thread-1) [ ] o.a.s.c.c.ConnectionManager zkClient has connected
[junit4] 2> 1677714 INFO (TEST-ShardSplitTest.testSplitMixedReplicaTypesLink-seed#[359286B6ADD41B85]) [ ] o.a.s.c.c.ConnectionManager Client is connected to ZooKeeper
[junit4] 2> 1677714 DEBUG (TEST-ShardSplitTest.testSplitMixedReplicaTypesLink-seed#[359286B6ADD41B85]) [ ] o.a.s.c.c.SolrZkClient Using default ZkACLProvider
[junit4] 2> 1677730 DEBUG (TEST-ShardSplitTest.testSplitMixedReplicaTypesLink-seed#[359286B6ADD41B85]) [ ] o.a.s.c.c.SolrZkClient makePath: /solr
[junit4] 2> 1677733 DEBUG (TEST-ShardSplitTest.testSplitMixedReplicaTypesLink-seed#[359286B6ADD41B85]) [ ] o.a.s.c.c.SolrZkClient Using default ZkCredentialsProvider
[junit4] 2> 1677736 INFO (TEST-ShardSplitTest.testSplitMixedReplicaTypesLink-seed#[359286B6ADD41B85]) [ ] o.a.s.c.c.ConnectionManager Waiting for client to connect to ZooKeeper
[junit4] 2> 1677741 DEBUG (TEST-ShardSplitTest.testSplitMixedReplicaTypesLink-seed#[359286B6ADD41B85]-EventThread) [ ] o.a.s.c.c.SolrZkClient Submitting job to respond to event WatchedEvent state:SyncConnected type:None path:null
[junit4] 2> 1677742 DEBUG (zkConnectionManagerCallback-15826-thread-1) [ ] o.a.s.c.c.ConnectionManager Watcher org.apache.solr.common.cloud.ConnectionManager@5211c84 name: ZooKeeperConnection Watcher:127.0.0.1:37947/solr got event WatchedEvent state:SyncConnected type:None path:null path: null type: None
[junit4] 2> 1677742 INFO (zkConnectionManagerCallback-15826-thread-1) [ ] o.a.s.c.c.ConnectionManager zkClient has connected
[junit4] 2> 1677742 INFO (TEST-ShardSplitTest.testSplitMixedReplicaTypesLink-seed#[359286B6ADD41B85]) [ ] o.a.s.c.c.ConnectionManager Client is connected to ZooKeeper
[junit4] 2> 1677742 DEBUG (TEST-ShardSplitTest.testSplitMixedReplicaTypesLink-seed#[359286B6ADD41B85]) [ ] o.a.s.c.c.SolrZkClient Using default ZkACLProvider
[junit4] 2> 1677748 DEBUG (TEST-ShardSplitTest.testSplitMixedReplicaTypesLink-seed#[359286B6ADD41B85]) [ ] o.a.s.c.c.SolrZkClient makePath: /clusterprops.json
[junit4] 2> 1677749 INFO (TEST-ShardSplitTest.testSplitMixedReplicaTypesLink-seed#[359286B6ADD41B85]) [ ] o.a.s.c.ZkTestServer put /home/jenkins/jenkins-slave/workspace/Lucene/Lucene-Solr-Tests-8.11/solr/core/src/test-files/solr/collection1/conf/solrconfig-tlog.xml to /configs/conf1/solrconfig.xml
[junit4] 2> 1677749 DEBUG (TEST-ShardSplitTest.testSplitMixedReplicaTypesLink-seed#[359286B6ADD41B85]) [ ] o.a.s.c.c.SolrZkClient makePath: /configs/conf1/solrconfig.xml
[junit4] 2> 1677750 INFO (TEST-ShardSplitTest.testSplitMixedReplicaTypesLink-seed#[359286B6ADD41B85]) [ ] o.a.s.c.ZkTestServer put /home/jenkins/jenkins-slave/workspace/Lucene/Lucene-Solr-Tests-8.11/solr/core/src/test-files/solr/collection1/conf/schema15.xml to /configs/conf1/schema.xml
[junit4] 2> 1677751 DEBUG (TEST-ShardSplitTest.testSplitMixedReplicaTypesLink-seed#[359286B6ADD41B85]) [ ] o.a.s.c.c.SolrZkClient makePath: /configs/conf1/schema.xml
[junit4] 2> 1677752 INFO (TEST-ShardSplitTest.testSplitMixedReplicaTypesLink-seed#[359286B6ADD41B85]) [ ] o.a.s.c.ZkTestServer put /home/jenkins/jenkins-slave/workspace/Lucene/Lucene-Solr-Tests-8.11/solr/core/src/test-files/solr/collection1/conf/solrconfig.snippet.randomindexconfig.xml to /configs/conf1/solrconfig.snippet.randomindexconfig.xml
[junit4] 2> 1677752 DEBUG (TEST-ShardSplitTest.testSplitMixedReplicaTypesLink-seed#[359286B6ADD41B85]) [ ] o.a.s.c.c.SolrZkClient makePath: /configs/conf1/solrconfig.snippet.randomindexconfig.xml
[junit4] 2> 1677752 INFO (TEST-ShardSplitTest.testSplitMixedReplicaTypesLink-seed#[359286B6ADD41B85]) [ ] o.a.s.c.ZkTestServer put /home/jenkins/jenkins-slave/workspace/Lucene/Lucene-Solr-Tests-8.11/solr/core/src/test-files/solr/collection1/conf/stopwords.txt to /configs/conf1/stopwords.txt
[junit4] 2> 1677752 DEBUG (TEST-ShardSplitTest.testSplitMixedReplicaTypesLink-seed#[359286B6ADD41B85]) [ ] o.a.s.c.c.SolrZkClient makePath: /configs/conf1/stopwords.txt
[junit4] 2> 1677753 INFO (TEST-ShardSplitTest.testSplitMixedReplicaTypesLink-seed#[359286B6ADD41B85]) [ ] o.a.s.c.ZkTestServer put /home/jenkins/jenkins-slave/workspace/Lucene/Lucene-Solr-Tests-8.11/solr/core/src/test-files/solr/collection1/conf/protwords.txt to /configs/conf1/protwords.txt
[junit4] 2> 1677753 DEBUG (TEST-ShardSplitTest.testSplitMixedReplicaTypesLink-seed#[359286B6ADD41B85]) [ ] o.a.s.c.c.SolrZkClient makePath: /configs/conf1/protwords.txt
[junit4] 2> 1677754 INFO (TEST-ShardSplitTest.testSplitMixedReplicaTypesLink-seed#[359286B6ADD41B85]) [ ] o.a.s.c.ZkTestServer put /home/jenkins/jenkins-slave/workspace/Lucene/Lucene-Solr-Tests-8.11/solr/core/src/test-files/solr/collection1/conf/currency.xml to /configs/conf1/currency.xml
[junit4] 2> 1677754 DEBUG (TEST-ShardSplitTest.testSplitMixedReplicaTypesLink-seed#[359286B6ADD41B85]) [ ] o.a.s.c.c.SolrZkClient makePath: /configs/conf1/currency.xml
[junit4] 2> 1677755 INFO (TEST-ShardSplitTest.testSplitMixedReplicaTypesLink-seed#[359286B6ADD41B85]) [ ] o.a.s.c.ZkTestServer put /home/jenkins/jenkins-slave/workspace/Lucene/Lucene-Solr-Tests-8.11/solr/core/src/test-files/solr/collection1/conf/enumsConfig.xml to /configs/conf1/enumsConfig.xml
[junit4] 2> 1677755 DEBUG (TEST-ShardSplitTest.testSplitMixedReplicaTypesLink-seed#[359286B6ADD41B85]) [ ] o.a.s.c.c.SolrZkClient makePath: /configs/conf1/enumsConfig.xml
[junit4] 2> 1677756 INFO (TEST-ShardSplitTest.testSplitMixedReplicaTypesLink-seed#[359286B6ADD41B85]) [ ] o.a.s.c.ZkTestServer put /home/jenkins/jenkins-slave/workspace/Lucene/Lucene-Solr-Tests-8.11/solr/core/src/test-files/solr/collection1/conf/open-exchange-rates.json to /configs/conf1/open-exchange-rates.json
[junit4] 2> 1677756 DEBUG (TEST-ShardSplitTest.testSplitMixedReplicaTypesLink-seed#[359286B6ADD41B85]) [ ] o.a.s.c.c.SolrZkClient makePath: /configs/conf1/open-exchange-rates.json
[junit4] 2> 1677757 INFO (TEST-ShardSplitTest.testSplitMixedReplicaTypesLink-seed#[359286B6ADD41B85]) [ ] o.a.s.c.ZkTestServer put /home/jenkins/jenkins-slave/workspace/Lucene/Lucene-Solr-Tests-8.11/solr/core/src/test-files/solr/collection1/conf/mapping-ISOLatin1Accent.txt to /configs/conf1/mapping-ISOLatin1Accent.txt
[junit4] 2> 1677757 DEBUG (TEST-ShardSplitTest.testSplitMixedReplicaTypesLink-seed#[359286B6ADD41B85]) [ ] o.a.s.c.c.SolrZkClient makePath: /configs/conf1/mapping-ISOLatin1Accent.txt
[junit4] 2> 1677758 INFO (TEST-ShardSplitTest.testSplitMixedReplicaTypesLink-seed#[359286B6ADD41B85]) [ ] o.a.s.c.ZkTestServer put /home/jenkins/jenkins-slave/workspace/Lucene/Lucene-Solr-Tests-8.11/solr/core/src/test-files/solr/collection1/conf/old_synonyms.txt to /configs/conf1/old_synonyms.txt
[junit4] 2> 1677758 DEBUG (TEST-ShardSplitTest.testSplitMixedReplicaTypesLink-seed#[359286B6ADD41B85]) [ ] o.a.s.c.c.SolrZkClient makePath: /configs/conf1/old_synonyms.txt
[junit4] 2> 1677759 INFO (TEST-ShardSplitTest.testSplitMixedReplicaTypesLink-seed#[359286B6ADD41B85]) [ ] o.a.s.c.ZkTestServer put /home/jenkins/jenkins-slave/workspace/Lucene/Lucene-Solr-Tests-8.11/solr/core/src/test-files/solr/collection1/conf/synonyms.txt to /configs/conf1/synonyms.txt
[junit4] 2> 1677759 DEBUG (TEST-ShardSplitTest.testSplitMixedReplicaTypesLink-seed#[359286B6ADD41B85]) [ ] o.a.s.c.c.SolrZkClient makePath: /configs/conf1/synonyms.txt
[junit4] 2> 1677759 INFO (TEST-ShardSplitTest.testSplitMixedReplicaTypesLink-seed#[359286B6ADD41B85]) [ ] o.a.s.c.AbstractFullDistribZkTestBase Will use NRT replicas unless explicitly asked otherwise
[junit4] 2> 1677948 INFO (TEST-ShardSplitTest.testSplitMixedReplicaTypesLink-seed#[359286B6ADD41B85]) [ ] o.a.s.c.s.e.JettySolrRunner Start Jetty (configured port=0, binding port=0)
[junit4] 2> 1677948 INFO (TEST-ShardSplitTest.testSplitMixedReplicaTypesLink-seed#[359286B6ADD41B85]) [ ] o.a.s.c.s.e.JettySolrRunner Trying to start Jetty on port 0 try number 2 ...
[junit4] 2> 1677948 INFO (TEST-ShardSplitTest.testSplitMixedReplicaTypesLink-seed#[359286B6ADD41B85]) [ ] o.e.j.s.Server jetty-9.4.53.v20231009; built: 2023-10-09T12:29:09.265Z; git: 27bde00a0b95a1d5bbee0eae7984f891d2d0f8c9; jvm 1.8.0_362-b09
[junit4] 2> 1677952 INFO (TEST-ShardSplitTest.testSplitMixedReplicaTypesLink-seed#[359286B6ADD41B85]) [ ] o.e.j.s.session DefaultSessionIdManager workerName=node0
[junit4] 2> 1677952 INFO (TEST-ShardSplitTest.testSplitMixedReplicaTypesLink-seed#[359286B6ADD41B85]) [ ] o.e.j.s.session No SessionScavenger set, using defaults
[junit4] 2> 1677953 INFO (TEST-ShardSplitTest.testSplitMixedReplicaTypesLink-seed#[359286B6ADD41B85]) [ ] o.e.j.s.session node0 Scavenging every 660000ms
[junit4] 2> 1677955 INFO (TEST-ShardSplitTest.testSplitMixedReplicaTypesLink-seed#[359286B6ADD41B85]) [ ] o.e.j.s.h.ContextHandler Started o.e.j.s.ServletContextHandler@1335087b{/_/i,null,AVAILABLE}
[junit4] 2> 1677955 INFO (TEST-ShardSplitTest.testSplitMixedReplicaTypesLink-seed#[359286B6ADD41B85]) [ ] o.e.j.s.AbstractConnector Started ServerConnector@7ce0e0a5{HTTP/1.1, (http/1.1, h2c)}{127.0.0.1:39431}
[junit4] 2> 1677955 INFO (TEST-ShardSplitTest.testSplitMixedReplicaTypesLink-seed#[359286B6ADD41B85]) [ ] o.e.j.s.Server Started @1677994ms
[junit4] 2> 1677955 INFO (TEST-ShardSplitTest.testSplitMixedReplicaTypesLink-seed#[359286B6ADD41B85]) [ ] o.a.s.c.s.e.JettySolrRunner Jetty properties: {solr.data.dir=/home/jenkins/jenkins-slave/workspace/Lucene/Lucene-Solr-Tests-8.11/solr/build/solr-core/test/J3/temp/solr.cloud.api.collections.ShardSplitTest_359286B6ADD41B85-001/tempDir-001/control/data, replicaType=NRT, hostContext=/_/i, hostPort=39431, coreRootDirectory=/home/jenkins/jenkins-slave/workspace/Lucene/Lucene-Solr-Tests-8.11/solr/build/solr-core/test/J3/temp/solr.cloud.api.collections.ShardSplitTest_359286B6ADD41B85-001/control-001/cores}
[junit4] 2> 1677955 ERROR (TEST-ShardSplitTest.testSplitMixedReplicaTypesLink-seed#[359286B6ADD41B85]) [ ] o.a.s.u.StartupLoggingUtils Missing Java Option solr.log.dir. Logging may be missing or incomplete.
[junit4] 2> 1677955 INFO (TEST-ShardSplitTest.testSplitMixedReplicaTypesLink-seed#[359286B6ADD41B85]) [ ] o.a.s.s.SolrDispatchFilter Using logger factory org.apache.logging.slf4j.Log4jLoggerFactory
[junit4] 2> 1677955 INFO (TEST-ShardSplitTest.testSplitMixedReplicaTypesLink-seed#[359286B6ADD41B85]) [ ] o.a.s.s.SolrDispatchFilter ___ _ Welcome to Apache Solr™ version 8.11.4
[junit4] 2> 1677955 INFO (TEST-ShardSplitTest.testSplitMixedReplicaTypesLink-seed#[359286B6ADD41B85]) [ ] o.a.s.s.SolrDispatchFilter / __| ___| |_ _ Starting in cloud mode on port null
[junit4] 2> 1677955 INFO (TEST-ShardSplitTest.testSplitMixedReplicaTypesLink-seed#[359286B6ADD41B85]) [ ] o.a.s.s.SolrDispatchFilter \__ \/ _ \ | '_| Install dir: /home/jenkins/jenkins-slave/workspace/Lucene/Lucene-Solr-Tests-8.11/solr
[junit4] 2> 1677955 INFO (TEST-ShardSplitTest.testSplitMixedReplicaTypesLink-seed#[359286B6ADD41B85]) [ ] o.a.s.s.SolrDispatchFilter |___/\___/_|_| Start time: 2024-02-23T01:49:52.290Z
[junit4] 2> 1677955 DEBUG (TEST-ShardSplitTest.testSplitMixedReplicaTypesLink-seed#[359286B6ADD41B85]) [ ] o.a.s.c.c.SolrZkClient Using default ZkCredentialsProvider
[junit4] 2> 1677960 INFO (TEST-ShardSplitTest.testSplitMixedReplicaTypesLink-seed#[359286B6ADD41B85]) [ ] o.a.s.c.c.ConnectionManager Waiting for client to connect to ZooKeeper
[junit4] 2> 1677960 DEBUG (TEST-ShardSplitTest.testSplitMixedReplicaTypesLink-seed#[359286B6ADD41B85]-EventThread) [ ] o.a.s.c.c.SolrZkClient Submitting job to respond to event WatchedEvent state:SyncConnected type:None path:null
[junit4] 2> 1677960 DEBUG (zkConnectionManagerCallback-15828-thread-1) [ ] o.a.s.c.c.ConnectionManager Watcher org.apache.solr.common.cloud.ConnectionManager@2434ca50 name: ZooKeeperConnection Watcher:127.0.0.1:37947/solr got event WatchedEvent state:SyncConnected type:None path:null path: null type: None
[junit4] 2> 1677960 INFO (zkConnectionManagerCallback-15828-thread-1) [ ] o.a.s.c.c.ConnectionManager zkClient has connected
[junit4] 2> 1677960 INFO (TEST-ShardSplitTest.testSplitMixedReplicaTypesLink-seed#[359286B6ADD41B85]) [ ] o.a.s.c.c.ConnectionManager Client is connected to ZooKeeper
[junit4] 2> 1677960 DEBUG (TEST-ShardSplitTest.testSplitMixedReplicaTypesLink-seed#[359286B6ADD41B85]) [ ] o.a.s.c.c.SolrZkClient Using default ZkACLProvider
[junit4] 2> 1677965 WARN (TEST-ShardSplitTest.testSplitMixedReplicaTypesLink-seed#[359286B6ADD41B85]-SendThread(127.0.0.1:37947)) [ ] o.a.z.ClientCnxn An exception was thrown while closing send thread for session 0x100a6a581240002.
[junit4] 2> => EndOfStreamException: Unable to read additional data from server sessionid 0x100a6a581240002, likely server has closed socket
[junit4] 2> at org.apache.zookeeper.ClientCnxnSocketNIO.doIO(ClientCnxnSocketNIO.java:77)
[junit4] 2> org.apache.zookeeper.ClientCnxn$EndOfStreamException: Unable to read additional data from server sessionid 0x100a6a581240002, likely server has closed socket
[junit4] 2> at org.apache.zookeeper.ClientCnxnSocketNIO.doIO(ClientCnxnSocketNIO.java:77) ~[zookeeper-3.6.2.jar:3.6.2]
[junit4] 2> at org.apache.zookeeper.ClientCnxnSocketNIO.doTransport(ClientCnxnSocketNIO.java:350) ~[zookeeper-3.6.2.jar:3.6.2]
[junit4] 2> at org.apache.zookeeper.ClientCnxn$SendThread.run(ClientCnxn.java:1275) [zookeeper-3.6.2.jar:3.6.2]
[junit4] 2> 1678065 DEBUG (TEST-ShardSplitTest.testSplitMixedReplicaTypesLink-seed#[359286B6ADD41B85]-EventThread) [ ] o.a.s.c.c.SolrZkClient Submitting job to respond to event WatchedEvent state:Closed type:None path:null
[junit4] 2> 1678065 INFO (TEST-ShardSplitTest.testSplitMixedReplicaTypesLink-seed#[359286B6ADD41B85]) [ ] o.a.s.s.SolrDispatchFilter Loading solr.xml from SolrHome (not found in ZooKeeper)
[junit4] 2> 1678065 INFO (TEST-ShardSplitTest.testSplitMixedReplicaTypesLink-seed#[359286B6ADD41B85]) [ ] o.a.s.c.SolrXmlConfig Loading container configuration from /home/jenkins/jenkins-slave/workspace/Lucene/Lucene-Solr-Tests-8.11/solr/build/solr-core/test/J3/temp/solr.cloud.api.collections.ShardSplitTest_359286B6ADD41B85-001/control-001/solr.xml
[junit4] 2> 1678068 INFO (TEST-ShardSplitTest.testSplitMixedReplicaTypesLink-seed#[359286B6ADD41B85]) [ ] o.a.s.c.SolrXmlConfig Configuration parameter autoReplicaFailoverWorkLoopDelay is ignored
[junit4] 2> 1678068 INFO (TEST-ShardSplitTest.testSplitMixedReplicaTypesLink-seed#[359286B6ADD41B85]) [ ] o.a.s.c.SolrXmlConfig Configuration parameter autoReplicaFailoverBadNodeExpiration is ignored
[junit4] 2> 1678070 INFO (TEST-ShardSplitTest.testSplitMixedReplicaTypesLink-seed#[359286B6ADD41B85]) [ ] o.a.s.c.SolrXmlConfig MBean server found: com.sun.jmx.mbeanserver.JmxMBeanServer@827d733, but no JMX reporters were configured - adding default JMX reporter.
[junit4] 2> 1679319 INFO (TEST-ShardSplitTest.testSplitMixedReplicaTypesLink-seed#[359286B6ADD41B85]) [ ] o.a.s.h.c.HttpShardHandlerFactory Host whitelist initialized: WhitelistHostChecker [whitelistHosts=null, whitelistHostCheckingEnabled=false]
[junit4] 2> 1679321 WARN (TEST-ShardSplitTest.testSplitMixedReplicaTypesLink-seed#[359286B6ADD41B85]) [ ] o.e.j.u.s.S.config Trusting all certificates configured for Client@5fefce44[provider=null,keyStore=null,trustStore=null]
[junit4] 2> 1679321 WARN (TEST-ShardSplitTest.testSplitMixedReplicaTypesLink-seed#[359286B6ADD41B85]) [ ] o.e.j.u.s.S.config No Client EndPointIdentificationAlgorithm configured for Client@5fefce44[provider=null,keyStore=null,trustStore=null]
[junit4] 2> 1679324 WARN (TEST-ShardSplitTest.testSplitMixedReplicaTypesLink-seed#[359286B6ADD41B85]) [ ] o.e.j.u.s.S.config Trusting all certificates configured for Client@7a4e1848[provider=null,keyStore=null,trustStore=null]
[junit4] 2> 1679325 WARN (TEST-ShardSplitTest.testSplitMixedReplicaTypesLink-seed#[359286B6ADD41B85]) [ ] o.e.j.u.s.S.config No Client EndPointIdentificationAlgorithm configured for Client@7a4e1848[provider=null,keyStore=null,trustStore=null]
[junit4] 2> 1679326 INFO (TEST-ShardSplitTest.testSplitMixedReplicaTypesLink-seed#[359286B6ADD41B85]) [ ] o.a.s.c.ZkContainer Zookeeper client=127.0.0.1:37947/solr
[junit4] 2> 1679326 DEBUG (TEST-ShardSplitTest.testSplitMixedReplicaTypesLink-seed#[359286B6ADD41B85]) [ ] o.a.s.c.c.SolrZkClient Using default ZkCredentialsProvider
[junit4] 2> 1679355 INFO (TEST-ShardSplitTest.testSplitMixedReplicaTypesLink-seed#[359286B6ADD41B85]) [ ] o.a.s.c.c.ConnectionManager Waiting for client to connect to ZooKeeper
[junit4] 2> 1679355 DEBUG (TEST-ShardSplitTest.testSplitMixedReplicaTypesLink-seed#[359286B6ADD41B85]-EventThread) [ ] o.a.s.c.c.SolrZkClient Submitting job to respond to event WatchedEvent state:SyncConnected type:None path:null
[junit4] 2> 1679355 DEBUG (zkConnectionManagerCallback-15839-thread-1) [ ] o.a.s.c.c.ConnectionManager Watcher org.apache.solr.common.cloud.ConnectionManager@1b97ce1e name: ZooKeeperConnection Watcher:127.0.0.1:37947 got event WatchedEvent state:SyncConnected type:None path:null path: null type: None
[junit4] 2> 1679355 INFO (zkConnectionManagerCallback-15839-thread-1) [ ] o.a.s.c.c.ConnectionManager zkClient has connected
[junit4] 2> 1679355 INFO (TEST-ShardSplitTest.testSplitMixedReplicaTypesLink-seed#[359286B6ADD41B85]) [ ] o.a.s.c.c.ConnectionManager Client is connected to ZooKeeper
[junit4] 2> 1679355 DEBUG (TEST-ShardSplitTest.testSplitMixedReplicaTypesLink-seed#[359286B6ADD41B85]) [ ] o.a.s.c.c.SolrZkClient Using default ZkACLProvider
[junit4] 2> 1679457 DEBUG (TEST-ShardSplitTest.testSplitMixedReplicaTypesLink-seed#[359286B6ADD41B85]-EventThread) [ ] o.a.s.c.c.SolrZkClient Submitting job to respond to event WatchedEvent state:Closed type:None path:null
[junit4] 2> 1679468 INFO (TEST-ShardSplitTest.testSplitMixedReplicaTypesLink-seed#[359286B6ADD41B85]) [n:127.0.0.1:39431__%2Fi ] o.a.s.c.c.ConnectionManager Waiting for client to connect to ZooKeeper
[junit4] 2> 1679468 DEBUG (TEST-ShardSplitTest.testSplitMixedReplicaTypesLink-seed#[359286B6ADD41B85]-EventThread) [ ] o.a.s.c.c.SolrZkClient Submitting job to respond to event WatchedEvent state:SyncConnected type:None path:null
[junit4] 2> 1679469 DEBUG (zkConnectionManagerCallback-15841-thread-1) [ ] o.a.s.c.c.ConnectionManager Watcher org.apache.solr.common.cloud.ConnectionManager@2951d8bb name: ZooKeeperConnection Watcher:127.0.0.1:37947/solr got event WatchedEvent state:SyncConnected type:None path:null path: null type: None
[junit4] 2> 1679469 INFO (zkConnectionManagerCallback-15841-thread-1) [ ] o.a.s.c.c.ConnectionManager zkClient has connected
[junit4] 2> 1679469 INFO (TEST-ShardSplitTest.testSplitMixedReplicaTypesLink-seed#[359286B6ADD41B85]) [n:127.0.0.1:39431__%2Fi ] o.a.s.c.c.ConnectionManager Client is connected to ZooKeeper
[junit4] 2> 1679471 DEBUG (TEST-ShardSplitTest.testSplitMixedReplicaTypesLink-seed#[359286B6ADD41B85]) [n:127.0.0.1:39431__%2Fi ] o.a.s.c.c.SolrZkClient makePath: /overseer/collection-map-running
[junit4] 2> 1679474 DEBUG (TEST-ShardSplitTest.testSplitMixedReplicaTypesLink-seed#[359286B6ADD41B85]) [n:127.0.0.1:39431__%2Fi ] o.a.s.c.c.SolrZkClient makePath: /overseer/collection-map-completed
[junit4] 2> 1679489 DEBUG (TEST-ShardSplitTest.testSplitMixedReplicaTypesLink-seed#[359286B6ADD41B85]) [n:127.0.0.1:39431__%2Fi ] o.a.s.c.c.SolrZkClient makePath: /overseer/collection-map-failure
[junit4] 2> 1679489 DEBUG (TEST-ShardSplitTest.testSplitMixedReplicaTypesLink-seed#[359286B6ADD41B85]) [n:127.0.0.1:39431__%2Fi ] o.a.s.c.c.SolrZkClient makePath: /overseer/async_ids
[junit4] 2> 1679490 DEBUG (TEST-ShardSplitTest.testSplitMixedReplicaTypesLink-seed#[359286B6ADD41B85]) [n:127.0.0.1:39431__%2Fi ] o.a.s.c.c.SolrZkClient makePath: /live_nodes
[junit4] 2> 1679491 DEBUG (TEST-ShardSplitTest.testSplitMixedReplicaTypesLink-seed#[359286B6ADD41B85]) [n:127.0.0.1:39431__%2Fi ] o.a.s.c.c.SolrZkClient makePath: /node_roles
[junit4] 2> 1679491 DEBUG (TEST-ShardSplitTest.testSplitMixedReplicaTypesLink-seed#[359286B6ADD41B85]) [n:127.0.0.1:39431__%2Fi ] o.a.s.c.c.SolrZkClient makePath: /node_roles/data
[junit4] 2> 1679492 DEBUG (TEST-ShardSplitTest.testSplitMixedReplicaTypesLink-seed#[359286B6ADD41B85]) [n:127.0.0.1:39431__%2Fi ] o.a.s.c.c.SolrZkClient makePath: /node_roles/data/on
[junit4] 2> 1679493 DEBUG (TEST-ShardSplitTest.testSplitMixedReplicaTypesLink-seed#[359286B6ADD41B85]) [n:127.0.0.1:39431__%2Fi ] o.a.s.c.c.SolrZkClient makePath: /node_roles/data/off
[junit4] 2> 1679494 DEBUG (TEST-ShardSplitTest.testSplitMixedReplicaTypesLink-seed#[359286B6ADD41B85]) [n:127.0.0.1:39431__%2Fi ] o.a.s.c.c.SolrZkClient makePath: /node_roles/overseer
[junit4] 2> 1679495 DEBUG (TEST-ShardSplitTest.testSplitMixedReplicaTypesLink-seed#[359286B6ADD41B85]) [n:127.0.0.1:39431__%2Fi ] o.a.s.c.c.SolrZkClient makePath: /node_roles/overseer/allowed
[junit4] 2> 1679496 DEBUG (TEST-ShardSplitTest.testSplitMixedReplicaTypesLink-seed#[359286B6ADD41B85]) [n:127.0.0.1:39431__%2Fi ] o.a.s.c.c.SolrZkClient makePath: /node_roles/overseer/preferred
[junit4] 2> 1679497 DEBUG (TEST-ShardSplitTest.testSplitMixedReplicaTypesLink-seed#[359286B6ADD41B85]) [n:127.0.0.1:39431__%2Fi ] o.a.s.c.c.SolrZkClient makePath: /node_roles/overseer/disallowed
[junit4] 2> 1679498 DEBUG (TEST-ShardSplitTest.testSplitMixedReplicaTypesLink-seed#[359286B6ADD41B85]) [n:127.0.0.1:39431__%2Fi ] o.a.s.c.c.SolrZkClient makePath: /node_roles/coordinator
[junit4] 2> 1679499 DEBUG (TEST-ShardSplitTest.testSplitMixedReplicaTypesLink-seed#[359286B6ADD41B85]) [n:127.0.0.1:39431__%2Fi ] o.a.s.c.c.SolrZkClient makePath: /node_roles/coordinator/on
[junit4] 2> 1679501 DEBUG (TEST-ShardSplitTest.testSplitMixedReplicaTypesLink-seed#[359286B6ADD41B85]) [n:127.0.0.1:39431__%2Fi ] o.a.s.c.c.SolrZkClient makePath: /node_roles/coordinator/off
[junit4] 2> 1679502 DEBUG (TEST-ShardSplitTest.testSplitMixedReplicaTypesLink-seed#[359286B6ADD41B85]) [n:127.0.0.1:39431__%2Fi ] o.a.s.c.c.SolrZkClient makePath: /aliases.json
[junit4] 2> 1679503 DEBUG (TEST-ShardSplitTest.testSplitMixedReplicaTypesLink-seed#[359286B6ADD41B85]) [n:127.0.0.1:39431__%2Fi ] o.a.s.c.c.SolrZkClient makePath: /autoscaling/events
[junit4] 2> 1679503 DEBUG (TEST-ShardSplitTest.testSplitMixedReplicaTypesLink-seed#[359286B6ADD41B85]) [n:127.0.0.1:39431__%2Fi ] o.a.s.c.c.SolrZkClient makePath: /autoscaling/triggerState
[junit4] 2> 1679504 DEBUG (TEST-ShardSplitTest.testSplitMixedReplicaTypesLink-seed#[359286B6ADD41B85]) [n:127.0.0.1:39431__%2Fi ] o.a.s.c.c.SolrZkClient makePath: /autoscaling/nodeAdded
[junit4] 2> 1679504 DEBUG (TEST-ShardSplitTest.testSplitMixedReplicaTypesLink-seed#[359286B6ADD41B85]) [n:127.0.0.1:39431__%2Fi ] o.a.s.c.c.SolrZkClient makePath: /autoscaling/nodeLost
[junit4] 2> 1679505 DEBUG (TEST-ShardSplitTest.testSplitMixedReplicaTypesLink-seed#[359286B6ADD41B85]) [n:127.0.0.1:39431__%2Fi ] o.a.s.c.c.SolrZkClient makePath: /clusterstate.json
[junit4] 2> 1679506 DEBUG (TEST-ShardSplitTest.testSplitMixedReplicaTypesLink-seed#[359286B6ADD41B85]) [n:127.0.0.1:39431__%2Fi ] o.a.s.c.c.SolrZkClient makePath: /autoscaling.json
[junit4] 2> 1679506 DEBUG (TEST-ShardSplitTest.testSplitMixedReplicaTypesLink-seed#[359286B6ADD41B85]) [n:127.0.0.1:39431__%2Fi ] o.a.s.c.c.SolrZkClient makePath: /security.json
[junit4] 2> 1679507 DEBUG (TEST-ShardSplitTest.testSplitMixedReplicaTypesLink-seed#[359286B6ADD41B85]) [n:127.0.0.1:39431__%2Fi ] o.a.s.c.c.SolrZkClient makePath: /configs/_default/protwords.txt
[junit4] 2> 1679509 DEBUG (TEST-ShardSplitTest.testSplitMixedReplicaTypesLink-seed#[359286B6ADD41B85]) [n:127.0.0.1:39431__%2Fi ] o.a.s.c.c.SolrZkClient makePath: /configs/_default/managed-schema
[junit4] 2> 1679510 DEBUG (TEST-ShardSplitTest.testSplitMixedReplicaTypesLink-seed#[359286B6ADD41B85]) [n:127.0.0.1:39431__%2Fi ] o.a.s.c.c.SolrZkClient makePath: /configs/_default/solrconfig.xml
[junit4] 2> 1679522 DEBUG (TEST-ShardSplitTest.testSplitMixedReplicaTypesLink-seed#[359286B6ADD41B85]) [n:127.0.0.1:39431__%2Fi ] o.a.s.c.c.SolrZkClient makePath: /configs/_default/synonyms.txt
[junit4] 2> 1679524 DEBUG (TEST-ShardSplitTest.testSplitMixedReplicaTypesLink-seed#[359286B6ADD41B85]) [n:127.0.0.1:39431__%2Fi ] o.a.s.c.c.SolrZkClient makePath: /configs/_default/lang/stopwords_it.txt
[junit4] 2> 1679528 DEBUG (TEST-ShardSplitTest.testSplitMixedReplicaTypesLink-seed#[359286B6ADD41B85]) [n:127.0.0.1:39431__%2Fi ] o.a.s.c.c.SolrZkClient makePath: /configs/_default/lang/stopwords_cz.txt
[junit4] 2> 1679530 DEBUG (TEST-ShardSplitTest.testSplitMixedReplicaTypesLink-seed#[359286B6ADD41B85]) [n:127.0.0.1:39431__%2Fi ] o.a.s.c.c.SolrZkClient makePath: /configs/_default/lang/stopwords_fr.txt
[junit4] 2> 1679533 DEBUG (TEST-ShardSplitTest.testSplitMixedReplicaTypesLink-seed#[359286B6ADD41B85]) [n:127.0.0.1:39431__%2Fi ] o.a.s.c.c.SolrZkClient makePath: /configs/_default/lang/stopwords_no.txt
[junit4] 2> 1679535 DEBUG (TEST-ShardSplitTest.testSplitMixedReplicaTypesLink-seed#[359286B6ADD41B85]) [n:127.0.0.1:39431__%2Fi ] o.a.s.c.c.SolrZkClient makePath: /configs/_default/lang/contractions_ca.txt
[junit4] 2> 1679536 DEBUG (TEST-ShardSplitTest.testSplitMixedReplicaTypesLink-seed#[359286B6ADD41B85]) [n:127.0.0.1:39431__%2Fi ] o.a.s.c.c.SolrZkClient makePath: /configs/_default/lang/stopwords_sv.txt
[junit4] 2> 1679537 DEBUG (TEST-ShardSplitTest.testSplitMixedReplicaTypesLink-seed#[359286B6ADD41B85]) [n:127.0.0.1:39431__%2Fi ] o.a.s.c.c.SolrZkClient makePath: /configs/_default/lang/stopwords_ca.txt
[junit4] 2> 1679538 DEBUG (TEST-ShardSplitTest.testSplitMixedReplicaTypesLink-seed#[359286B6ADD41B85]) [n:127.0.0.1:39431__%2Fi ] o.a.s.c.c.SolrZkClient makePath: /configs/_default/lang/stopwords_hu.txt
[junit4] 2> 1679540 DEBUG (TEST-ShardSplitTest.testSplitMixedReplicaTypesLink-seed#[359286B6ADD41B85]) [n:127.0.0.1:39431__%2Fi ] o.a.s.c.c.SolrZkClient makePath: /configs/_default/lang/stopwords_gl.txt
[junit4] 2> 1679541 DEBUG (TEST-ShardSplitTest.testSplitMixedReplicaTypesLink-seed#[359286B6ADD41B85]) [n:127.0.0.1:39431__%2Fi ] o.a.s.c.c.SolrZkClient makePath: /configs/_default/lang/stopwords_bg.txt
[junit4] 2> 1679542 DEBUG (TEST-ShardSplitTest.testSplitMixedReplicaTypesLink-seed#[359286B6ADD41B85]) [n:127.0.0.1:39431__%2Fi ] o.a.s.c.c.SolrZkClient makePath: /configs/_default/lang/stopwords_th.txt
[junit4] 2> 1679543 DEBUG (TEST-ShardSplitTest.testSplitMixedReplicaTypesLink-seed#[359286B6ADD41B85]) [n:127.0.0.1:39431__%2Fi ] o.a.s.c.c.SolrZkClient makePath: /configs/_default/lang/stopwords_ga.txt
[junit4] 2> 1679544 DEBUG (TEST-ShardSplitTest.testSplitMixedReplicaTypesLink-seed#[359286B6ADD41B85]) [n:127.0.0.1:39431__%2Fi ] o.a.s.c.c.SolrZkClient makePath: /configs/_default/lang/stopwords_da.txt
[junit4] 2> 1679546 DEBUG (TEST-ShardSplitTest.testSplitMixedReplicaTypesLink-seed#[359286B6ADD41B85]) [n:127.0.0.1:39431__%2Fi ] o.a.s.c.c.SolrZkClient makePath: /configs/_default/lang/stopwords_et.txt
[junit4] 2> 1679547 DEBUG (TEST-ShardSplitTest.testSplitMixedReplicaTypesLink-seed#[359286B6ADD41B85]) [n:127.0.0.1:39431__%2Fi ] o.a.s.c.c.SolrZkClient makePath: /configs/_default/lang/userdict_ja.txt
[junit4] 2> 1679548 DEBUG (TEST-ShardSplitTest.testSplitMixedReplicaTypesLink-seed#[359286B6ADD41B85]) [n:127.0.0.1:39431__%2Fi ] o.a.s.c.c.SolrZkClient makePath: /configs/_default/lang/contractions_ga.txt
[junit4] 2> 1679549 DEBUG (TEST-ShardSplitTest.testSplitMixedReplicaTypesLink-seed#[359286B6ADD41B85]) [n:127.0.0.1:39431__%2Fi ] o.a.s.c.c.SolrZkClient makePath: /configs/_default/lang/stopwords_id.txt
[junit4] 2> 1679551 DEBUG (TEST-ShardSplitTest.testSplitMixedReplicaTypesLink-seed#[359286B6ADD41B85]) [n:127.0.0.1:39431__%2Fi ] o.a.s.c.c.SolrZkClient makePath: /configs/_default/lang/stopwords_tr.txt
[junit4] 2> 1679552 DEBUG (TEST-ShardSplitTest.testSplitMixedReplicaTypesLink-seed#[359286B6ADD41B85]) [n:127.0.0.1:39431__%2Fi ] o.a.s.c.c.SolrZkClient makePath: /configs/_default/lang/stopwords_ja.txt
[junit4] 2> 1679554 DEBUG (TEST-ShardSplitTest.testSplitMixedReplicaTypesLink-seed#[359286B6ADD41B85]) [n:127.0.0.1:39431__%2Fi ] o.a.s.c.c.SolrZkClient makePath: /configs/_default/lang/stopwords_ar.txt
[junit4] 2> 1679556 DEBUG (TEST-ShardSplitTest.testSplitMixedReplicaTypesLink-seed#[359286B6ADD41B85]) [n:127.0.0.1:39431__%2Fi ] o.a.s.c.c.SolrZkClient makePath: /configs/_default/lang/stopwords_ru.txt
[junit4] 2> 1679557 DEBUG (TEST-ShardSplitTest.testSplitMixedReplicaTypesLink-seed#[359286B6ADD41B85]) [n:127.0.0.1:39431__%2Fi ] o.a.s.c.c.SolrZkClient makePath: /configs/_default/lang/hyphenations_ga.txt
[junit4] 2> 1679558 DEBUG (TEST-ShardSplitTest.testSplitMixedReplicaTypesLink-seed#[359286B6ADD41B85]) [n:127.0.0.1:39431__%2Fi ] o.a.s.c.c.SolrZkClient makePath: /configs/_default/lang/stopwords_de.txt
[junit4] 2> 1679560 DEBUG (TEST-ShardSplitTest.testSplitMixedReplicaTypesLink-seed#[359286B6ADD41B85]) [n:127.0.0.1:39431__%2Fi ] o.a.s.c.c.SolrZkClient makePath: /configs/_default/lang/stopwords_en.txt
[junit4] 2> 1679561 DEBUG (TEST-ShardSplitTest.testSplitMixedReplicaTypesLink-seed#[359286B6ADD41B85]) [n:127.0.0.1:39431__%2Fi ] o.a.s.c.c.SolrZkClient makePath: /configs/_default/lang/stemdict_nl.txt
[junit4] 2> 1679562 DEBUG (TEST-ShardSplitTest.testSplitMixedReplicaTypesLink-seed#[359286B6ADD41B85]) [n:127.0.0.1:39431__%2Fi ] o.a.s.c.c.SolrZkClient makePath: /configs/_default/lang/stopwords_ro.txt
[junit4] 2> 1679563 DEBUG (TEST-ShardSplitTest.testSplitMixedReplicaTypesLink-seed#[359286B6ADD41B85]) [n:127.0.0.1:39431__%2Fi ] o.a.s.c.c.SolrZkClient makePath: /configs/_default/lang/stopwords_hy.txt
[junit4] 2> 1679564 DEBUG (TEST-ShardSplitTest.testSplitMixedReplicaTypesLink-seed#[359286B6ADD41B85]) [n:127.0.0.1:39431__%2Fi ] o.a.s.c.c.SolrZkClient makePath: /configs/_default/lang/stopwords_eu.txt
[junit4] 2> 1679566 DEBUG (TEST-ShardSplitTest.testSplitMixedReplicaTypesLink-seed#[359286B6ADD41B85]) [n:127.0.0.1:39431__%2Fi ] o.a.s.c.c.SolrZkClient makePath: /configs/_default/lang/stopwords_hi.txt
[junit4] 2> 1679567 DEBUG (TEST-ShardSplitTest.testSplitMixedReplicaTypesLink-seed#[359286B6ADD41B85]) [n:127.0.0.1:39431__%2Fi ] o.a.s.c.c.SolrZkClient makePath: /configs/_default/lang/stoptags_ja.txt
[junit4] 2> 1679568 DEBUG (TEST-ShardSplitTest.testSplitMixedReplicaTypesLink-seed#[359286B6ADD41B85]) [n:127.0.0.1:39431__%2Fi ] o.a.s.c.c.SolrZkClient makePath: /configs/_default/lang/contractions_fr.txt
[junit4] 2> 1679569 DEBUG (TEST-ShardSplitTest.testSplitMixedReplicaTypesLink-seed#[359286B6ADD41B85]) [n:127.0.0.1:39431__%2Fi ] o.a.s.c.c.SolrZkClient makePath: /configs/_default/lang/stopwords_fi.txt
[junit4] 2> 1679571 DEBUG (TEST-ShardSplitTest.testSplitMixedReplicaTypesLink-seed#[359286B6ADD41B85]) [n:127.0.0.1:39431__%2Fi ] o.a.s.c.c.SolrZkClient makePath: /configs/_default/lang/stopwords_pt.txt
[junit4] 2> 1679572 DEBUG (TEST-ShardSplitTest.testSplitMixedReplicaTypesLink-seed#[359286B6ADD41B85]) [n:127.0.0.1:39431__%2Fi ] o.a.s.c.c.SolrZkClient makePath: /configs/_default/lang/stopwords_lv.txt
[junit4] 2> 1679573 DEBUG (TEST-ShardSplitTest.testSplitMixedReplicaTypesLink-seed#[359286B6ADD41B85]) [n:127.0.0.1:39431__%2Fi ] o.a.s.c.c.SolrZkClient makePath: /configs/_default/lang/stopwords_el.txt
[junit4] 2> 1679574 DEBUG (TEST-ShardSplitTest.testSplitMixedReplicaTypesLink-seed#[359286B6ADD41B85]) [n:127.0.0.1:39431__%2Fi ] o.a.s.c.c.SolrZkClient makePath: /configs/_default/lang/contractions_it.txt
[junit4] 2> 1679576 DEBUG (TEST-ShardSplitTest.testSplitMixedReplicaTypesLink-seed#[359286B6ADD41B85]) [n:127.0.0.1:39431__%2Fi ] o.a.s.c.c.SolrZkClient makePath: /configs/_default/lang/stopwords_nl.txt
[junit4] 2> 1679577 DEBUG (TEST-ShardSplitTest.testSplitMixedReplicaTypesLink-seed#[359286B6ADD41B85]) [n:127.0.0.1:39431__%2Fi ] o.a.s.c.c.SolrZkClient makePath: /configs/_default/lang/stopwords_es.txt
[junit4] 2> 1679579 DEBUG (TEST-ShardSplitTest.testSplitMixedReplicaTypesLink-seed#[359286B6ADD41B85]) [n:127.0.0.1:39431__%2Fi ] o.a.s.c.c.SolrZkClient makePath: /configs/_default/lang/stopwords_fa.txt
[junit4] 2> 1679580 DEBUG (TEST-ShardSplitTest.testSplitMixedReplicaTypesLink-seed#[359286B6ADD41B85]) [n:127.0.0.1:39431__%2Fi ] o.a.s.c.c.SolrZkClient makePath: /configs/_default/stopwords.txt
[junit4] 2> 1679581 WARN (TEST-ShardSplitTest.testSplitMixedReplicaTypesLink-seed#[359286B6ADD41B85]) [n:127.0.0.1:39431__%2Fi ] o.a.s.c.ZkController Contents of zookeeper /security.json are world-readable; consider setting up ACLs as described in https://solr.apache.org/guide/zookeeper-access-control.html
[junit4] 2> 1679581 DEBUG (TEST-ShardSplitTest.testSplitMixedReplicaTypesLink-seed#[359286B6ADD41B85]) [n:127.0.0.1:39431__%2Fi ] o.a.s.c.c.ZkStateReader Updating cluster state from ZooKeeper...
[junit4] 2> 1679582 DEBUG (TEST-ShardSplitTest.testSplitMixedReplicaTypesLink-seed#[359286B6ADD41B85]) [n:127.0.0.1:39431__%2Fi ] o.a.s.c.c.ZkStateReader Loaded cluster properties: {legacyCloud=true}
[junit4] 2> 1679582 DEBUG (TEST-ShardSplitTest.testSplitMixedReplicaTypesLink-seed#[359286B6ADD41B85]) [n:127.0.0.1:39431__%2Fi ] o.a.s.c.c.ZkStateReader Updated live nodes from ZooKeeper... [] -> []
[junit4] 2> 1679582 DEBUG (TEST-ShardSplitTest.testSplitMixedReplicaTypesLink-seed#[359286B6ADD41B85]) [n:127.0.0.1:39431__%2Fi ] o.a.s.c.c.ZkStateReader clusterStateSet: legacy [0] interesting [0] watched [0] lazy [2] total [2]
[junit4] 2> 1679583 DEBUG (TEST-ShardSplitTest.testSplitMixedReplicaTypesLink-seed#[359286B6ADD41B85]) [n:127.0.0.1:39431__%2Fi ] o.a.s.c.c.ZkStateReader$AliasesManager Checking ZK for most up to date Aliases /aliases.json
[junit4] 2> 1679583 DEBUG (TEST-ShardSplitTest.testSplitMixedReplicaTypesLink-seed#[359286B6ADD41B85]) [n:127.0.0.1:39431__%2Fi ] o.a.s.c.c.ZkStateReader$AliasesManager Aliases: cmp=-1, new definition is: Aliases{collectionAliases={}, collectionAliasProperties={}, zNodeVersion=0}
[junit4] 2> 1679584 DEBUG (TEST-ShardSplitTest.testSplitMixedReplicaTypesLink-seed#[359286B6ADD41B85]) [n:127.0.0.1:39431__%2Fi ] o.a.s.c.c.SolrZkClient makePath: /overseer_elect
[junit4] 2> 1679585 DEBUG (TEST-ShardSplitTest.testSplitMixedReplicaTypesLink-seed#[359286B6ADD41B85]) [n:127.0.0.1:39431__%2Fi ] o.a.s.c.c.SolrZkClient makePath: /overseer_elect/election
[junit4] 2> 1679586 INFO (TEST-ShardSplitTest.testSplitMixedReplicaTypesLink-seed#[359286B6ADD41B85]) [n:127.0.0.1:39431__%2Fi ] o.a.s.c.OverseerElectionContext I am going to be the leader 127.0.0.1:39431__%2Fi
[junit4] 2> 1679586 DEBUG (TEST-ShardSplitTest.testSplitMixedReplicaTypesLink-seed#[359286B6ADD41B85]) [n:127.0.0.1:39431__%2Fi ] o.a.s.c.c.SolrZkClient makePath: /overseer_elect/leader
[junit4] 2> 1679587 INFO (TEST-ShardSplitTest.testSplitMixedReplicaTypesLink-seed#[359286B6ADD41B85]) [n:127.0.0.1:39431__%2Fi ] o.a.s.c.Overseer Overseer (id=72240823804362756-127.0.0.1:39431__%2Fi-n_0000000000) starting
[junit4] 2> 1679588 DEBUG (TEST-ShardSplitTest.testSplitMixedReplicaTypesLink-seed#[359286B6ADD41B85]) [n:127.0.0.1:39431__%2Fi ] o.a.s.c.c.SolrZkClient makePath: /overseer/queue
[junit4] 2> 1679588 DEBUG (TEST-ShardSplitTest.testSplitMixedReplicaTypesLink-seed#[359286B6ADD41B85]) [n:127.0.0.1:39431__%2Fi ] o.a.s.c.c.SolrZkClient makePath: /overseer/queue-work
[junit4] 2> 1679590 DEBUG (TEST-ShardSplitTest.testSplitMixedReplicaTypesLink-seed#[359286B6ADD41B85]) [n:127.0.0.1:39431__%2Fi ] o.a.s.c.c.SolrZkClient makePath: /overseer/collection-queue-work
[junit4] 2> 1679592 DEBUG (OverseerCollectionConfigSetProcessor-72240823804362756-127.0.0.1:39431__%2Fi-n_0000000000) [n:127.0.0.1:39431__%2Fi ] o.a.s.c.OverseerTaskProcessor Process current queue of overseer operations
[junit4] 2> 1679592 INFO (OverseerStateUpdate-72240823804362756-127.0.0.1:39431__%2Fi-n_0000000000) [n:127.0.0.1:39431__%2Fi ] o.a.s.c.Overseer Starting to work on the main queue : 127.0.0.1:39431__%2Fi
[junit4] 2> 1679592 INFO (TEST-ShardSplitTest.testSplitMixedReplicaTypesLink-seed#[359286B6ADD41B85]) [n:127.0.0.1:39431__%2Fi ] o.a.s.c.ZkController Register node as live in ZooKeeper:/live_nodes/127.0.0.1:39431__%2Fi
[junit4] 2> 1679593 DEBUG (OverseerStateUpdate-72240823804362756-127.0.0.1:39431__%2Fi-n_0000000000) [n:127.0.0.1:39431__%2Fi ] o.a.s.c.c.ZkStateReader Updated live nodes from ZooKeeper... [] -> []
[junit4] 2> 1679593 DEBUG (TEST-ShardSplitTest.testSplitMixedReplicaTypesLink-seed#[359286B6ADD41B85]-EventThread) [ ] o.a.s.c.c.SolrZkClient Submitting job to respond to event WatchedEvent state:SyncConnected type:NodeChildrenChanged path:/live_nodes
[junit4] 2> 1679593 DEBUG (OverseerCollectionConfigSetProcessor-72240823804362756-127.0.0.1:39431__%2Fi-n_0000000000) [n:127.0.0.1:39431__%2Fi ] o.a.s.c.OverseerTaskProcessor Cleaning up work-queue. #Running tasks: 0 #Completed tasks: 0
[junit4] 2> 1679593 DEBUG (OverseerCollectionConfigSetProcessor-72240823804362756-127.0.0.1:39431__%2Fi-n_0000000000) [n:127.0.0.1:39431__%2Fi ] o.a.s.c.OverseerTaskProcessor RunningTasks: []
[junit4] 2> 1679593 DEBUG (OverseerCollectionConfigSetProcessor-72240823804362756-127.0.0.1:39431__%2Fi-n_0000000000) [n:127.0.0.1:39431__%2Fi ] o.a.s.c.OverseerTaskProcessor BlockedTasks: []
[junit4] 2> 1679593 DEBUG (zkCallback-15840-thread-1) [ ] o.a.s.c.c.ZkStateReader A live node change: [WatchedEvent state:SyncConnected type:NodeChildrenChanged path:/live_nodes], has occurred - updating... (live nodes size: [0])
[junit4] 2> 1679593 DEBUG (OverseerCollectionConfigSetProcessor-72240823804362756-127.0.0.1:39431__%2Fi-n_0000000000) [n:127.0.0.1:39431__%2Fi ] o.a.s.c.OverseerTaskProcessor CompletedTasks: []
[junit4] 2> 1679593 INFO (OverseerCollectionConfigSetProcessor-72240823804362756-127.0.0.1:39431__%2Fi-n_0000000000) [n:127.0.0.1:39431__%2Fi ] o.a.s.c.OverseerTaskProcessor RunningZKTasks: []
[junit4] 2> 1679593 DEBUG (OverseerStateUpdate-72240823804362756-127.0.0.1:39431__%2Fi-n_0000000000) [n:127.0.0.1:39431__%2Fi ] o.a.s.c.c.ZkStateReader clusterStateSet: legacy [0] interesting [0] watched [0] lazy [2] total [2]
[junit4] 2> 1679594 INFO (zkCallback-15840-thread-1) [ ] o.a.s.c.c.ZkStateReader Updated live nodes from ZooKeeper... (0) -> (1)
[junit4] 2> 1679594 DEBUG (zkCallback-15840-thread-1) [ ] o.a.s.c.c.ZkStateReader Updated live nodes from ZooKeeper... [] -> [127.0.0.1:39431__%2Fi]
[junit4] 2> 1679594 DEBUG (OverseerAutoScalingTriggerThread-72240823804362756-127.0.0.1:39431__%2Fi-n_0000000000) [ ] o.a.s.c.c.SolrZkClient makePath: /autoscaling/events/.scheduled_maintenance
[junit4] 2> 1679595 INFO (TEST-ShardSplitTest.testSplitMixedReplicaTypesLink-seed#[359286B6ADD41B85]) [n:127.0.0.1:39431__%2Fi ] o.a.s.c.ZkController non-data nodes now []
[junit4] 2> 1679596 DEBUG (OverseerAutoScalingTriggerThread-72240823804362756-127.0.0.1:39431__%2Fi-n_0000000000) [ ] o.a.s.c.c.SolrZkClient makePath: /autoscaling/events/.auto_add_replicas
[junit4] 2> 1679598 INFO (TEST-ShardSplitTest.testSplitMixedReplicaTypesLink-seed#[359286B6ADD41B85]) [n:127.0.0.1:39431__%2Fi ] o.a.s.p.PackageLoader /packages.json updated to version -1
[junit4] 2> 1679598 WARN (TEST-ShardSplitTest.testSplitMixedReplicaTypesLink-seed#[359286B6ADD41B85]) [n:127.0.0.1:39431__%2Fi ] o.a.s.c.CoreContainer Not all security plugins configured! authentication=disabled authorization=disabled. Solr is only as secure as you make it. Consider configuring authentication/authorization before exposing Solr to users internal or external. See https://s.apache.org/solrsecurity for more info
[junit4] 2> 1679627 INFO (TEST-ShardSplitTest.testSplitMixedReplicaTypesLink-seed#[359286B6ADD41B85]) [n:127.0.0.1:39431__%2Fi ] o.a.s.h.a.MetricsHistoryHandler No .system collection, keeping metrics history in memory.
[junit4] 2> 1679648 INFO (TEST-ShardSplitTest.testSplitMixedReplicaTypesLink-seed#[359286B6ADD41B85]) [n:127.0.0.1:39431__%2Fi ] o.a.s.m.r.SolrJmxReporter JMX monitoring for 'solr.node' (registry 'solr.node') enabled at server: com.sun.jmx.mbeanserver.JmxMBeanServer@827d733
[junit4] 2> 1679656 INFO (TEST-ShardSplitTest.testSplitMixedReplicaTypesLink-seed#[359286B6ADD41B85]) [n:127.0.0.1:39431__%2Fi ] o.a.s.m.r.SolrJmxReporter JMX monitoring for 'solr.jvm' (registry 'solr.jvm') enabled at server: com.sun.jmx.mbeanserver.JmxMBeanServer@827d733
[junit4] 2> 1679656 INFO (TEST-ShardSplitTest.testSplitMixedReplicaTypesLink-seed#[359286B6ADD41B85]) [n:127.0.0.1:39431__%2Fi ] o.a.s.m.r.SolrJmxReporter JMX monitoring for 'solr.jetty' (registry 'solr.jetty') enabled at server: com.sun.jmx.mbeanserver.JmxMBeanServer@827d733
[junit4] 2> 1679657 INFO (TEST-ShardSplitTest.testSplitMixedReplicaTypesLink-seed#[359286B6ADD41B85]) [n:127.0.0.1:39431__%2Fi ] o.a.s.c.CorePropertiesLocator Found 0 core definitions underneath /home/jenkins/jenkins-slave/workspace/Lucene/Lucene-Solr-Tests-8.11/solr/build/solr-core/test/J3/temp/solr.cloud.api.collections.ShardSplitTest_359286B6ADD41B85-001/control-001/cores
[junit4] 2> 1679670 DEBUG (TEST-ShardSplitTest.testSplitMixedReplicaTypesLink-seed#[359286B6ADD41B85]) [ ] o.a.s.c.c.SolrZkClient Using default ZkCredentialsProvider
[junit4] 2> 1679671 INFO (TEST-ShardSplitTest.testSplitMixedReplicaTypesLink-seed#[359286B6ADD41B85]) [ ] o.a.s.c.c.ConnectionManager Waiting for client to connect to ZooKeeper
[junit4] 2> 1679672 DEBUG (TEST-ShardSplitTest.testSplitMixedReplicaTypesLink-seed#[359286B6ADD41B85]-EventThread) [ ] o.a.s.c.c.SolrZkClient Submitting job to respond to event WatchedEvent state:SyncConnected type:None path:null
[junit4] 2> 1679672 DEBUG (zkConnectionManagerCallback-15858-thread-1) [ ] o.a.s.c.c.ConnectionManager Watcher org.apache.solr.common.cloud.ConnectionManager@18be0f55 name: ZooKeeperConnection Watcher:127.0.0.1:37947/solr got event WatchedEvent state:SyncConnected type:None path:null path: null type: None
[junit4] 2> 1679672 INFO (zkConnectionManagerCallback-15858-thread-1) [ ] o.a.s.c.c.ConnectionManager zkClient has connected
[junit4] 2> 1679672 INFO (TEST-ShardSplitTest.testSplitMixedReplicaTypesLink-seed#[359286B6ADD41B85]) [ ] o.a.s.c.c.ConnectionManager Client is connected to ZooKeeper
[junit4] 2> 1679672 DEBUG (TEST-ShardSplitTest.testSplitMixedReplicaTypesLink-seed#[359286B6ADD41B85]) [ ] o.a.s.c.c.SolrZkClient Using default ZkACLProvider
[junit4] 2> 1679672 DEBUG (TEST-ShardSplitTest.testSplitMixedReplicaTypesLink-seed#[359286B6ADD41B85]) [ ] o.a.s.c.c.ZkStateReader Updating cluster state from ZooKeeper...
[junit4] 2> 1679673 DEBUG (TEST-ShardSplitTest.testSplitMixedReplicaTypesLink-seed#[359286B6ADD41B85]) [ ] o.a.s.c.c.ZkStateReader Loaded cluster properties: {legacyCloud=true}
[junit4] 2> 1679673 INFO (TEST-ShardSplitTest.testSplitMixedReplicaTypesLink-seed#[359286B6ADD41B85]) [ ] o.a.s.c.c.ZkStateReader Updated live nodes from ZooKeeper... (0) -> (1)
[junit4] 2> 1679673 DEBUG (TEST-ShardSplitTest.testSplitMixedReplicaTypesLink-seed#[359286B6ADD41B85]) [ ] o.a.s.c.c.ZkStateReader Updated live nodes from ZooKeeper... [] -> [127.0.0.1:39431__%2Fi]
[junit4] 2> 1679674 DEBUG (TEST-ShardSplitTest.testSplitMixedReplicaTypesLink-seed#[359286B6ADD41B85]) [ ] o.a.s.c.c.ZkStateReader clusterStateSet: legacy [0] interesting [0] watched [0] lazy [2] total [2]
[junit4] 2> 1679674 DEBUG (TEST-ShardSplitTest.testSplitMixedReplicaTypesLink-seed#[359286B6ADD41B85]) [ ] o.a.s.c.c.ZkStateReader$AliasesManager Checking ZK for most up to date Aliases /aliases.json
[junit4] 2> 1679674 DEBUG (TEST-ShardSplitTest.testSplitMixedReplicaTypesLink-seed#[359286B6ADD41B85]) [ ] o.a.s.c.c.ZkStateReader$AliasesManager Aliases: cmp=-1, new definition is: Aliases{collectionAliases={}, collectionAliasProperties={}, zNodeVersion=0}
[junit4] 2> 1679674 INFO (TEST-ShardSplitTest.testSplitMixedReplicaTypesLink-seed#[359286B6ADD41B85]) [ ] o.a.s.c.s.i.ZkClientClusterStateProvider Cluster at 127.0.0.1:37947/solr ready
[junit4] 2> 1679676 INFO (qtp1670351794-28963) [n:127.0.0.1:39431__%2Fi ] o.a.s.s.HttpSolrCall HttpSolrCall.init(http://127.0.0.1:39431/_/i/admin/collections?action=CREATE&name=control_collection&collection.configName=conf1&createNodeSet=127.0.0.1%3A39431__%252Fi&numShards=1&nrtReplicas=1&wt=javabin&version=2)
[junit4] 2> 1679677 DEBUG (TEST-ShardSplitTest.testSplitMixedReplicaTypesLink-seed#[359286B6ADD41B85]-EventThread) [ ] o.a.s.c.c.SolrZkClient Submitting job to respond to event WatchedEvent state:SyncConnected type:NodeChildrenChanged path:/overseer/collection-queue-work
[junit4] 2> 1679678 DEBUG (TEST-ShardSplitTest.testSplitMixedReplicaTypesLink-seed#[359286B6ADD41B85]-EventThread) [ ] o.a.s.c.c.SolrZkClient Submitting job to respond to event WatchedEvent state:SyncConnected type:NodeChildrenChanged path:/overseer/collection-queue-work
[junit4] 2> 1679679 DEBUG (OverseerCollectionConfigSetProcessor-72240823804362756-127.0.0.1:39431__%2Fi-n_0000000000) [n:127.0.0.1:39431__%2Fi ] o.a.s.c.OverseerTaskProcessor Got 1 tasks from work-queue : [[org.apache.solr.cloud.OverseerTaskQueue$QueueEvent@2e684ecf]]
[junit4] 2> 1679679 DEBUG (OverseerCollectionConfigSetProcessor-72240823804362756-127.0.0.1:39431__%2Fi-n_0000000000) [n:127.0.0.1:39431__%2Fi ] o.a.s.c.OverseerTaskProcessor Marked task [/overseer/collection-queue-work/qn-0000000000] as running
[junit4] 2> 1679679 DEBUG (OverseerCollectionConfigSetProcessor-72240823804362756-127.0.0.1:39431__%2Fi-n_0000000000) [n:127.0.0.1:39431__%2Fi ] o.a.s.c.OverseerTaskProcessor Overseer Collection Message Handler: Get the message id: /overseer/collection-queue-work/qn-0000000000 message: {
[junit4] 2> "name":"control_collection",
[junit4] 2> "fromApi":"true",
[junit4] 2> "collection.configName":"conf1",
[junit4] 2> "numShards":"1",
[junit4] 2> "createNodeSet":"127.0.0.1:39431__%2Fi",
[junit4] 2> "nrtReplicas":"1",
[junit4] 2> "stateFormat":"2",
[junit4] 2> "replicationFactor":"1",
[junit4] 2> "operation":"create"}
[junit4] 2> 1679679 DEBUG (OverseerThreadFactory-15848-thread-1-processing-n:127.0.0.1:39431__%2Fi) [n:127.0.0.1:39431__%2Fi ] o.a.s.c.OverseerTaskProcessor Runner processing /overseer/collection-queue-work/qn-0000000000
[junit4] 2> 1679679 DEBUG (OverseerThreadFactory-15848-thread-1-processing-n:127.0.0.1:39431__%2Fi) [n:127.0.0.1:39431__%2Fi ] o.a.s.c.a.c.OverseerCollectionMessageHandler OverseerCollectionMessageHandler.processMessage : create , {
[junit4] 2> "name":"control_collection",
[junit4] 2> "fromApi":"true",
[junit4] 2> "collection.configName":"conf1",
[junit4] 2> "numShards":"1",
[junit4] 2> "createNodeSet":"127.0.0.1:39431__%2Fi",
[junit4] 2> "nrtReplicas":"1",
[junit4] 2> "stateFormat":"2",
[junit4] 2> "replicationFactor":"1",
[junit4] 2> "operation":"create"}
[junit4] 2> 1679679 DEBUG (OverseerThreadFactory-15848-thread-1-processing-n:127.0.0.1:39431__%2Fi) [n:127.0.0.1:39431__%2Fi ] o.a.s.c.c.ZkStateReader$AliasesManager Checking ZK for most up to date Aliases /aliases.json
[junit4] 2> 1679679 DEBUG (OverseerCollectionConfigSetProcessor-72240823804362756-127.0.0.1:39431__%2Fi-n_0000000000) [n:127.0.0.1:39431__%2Fi ] o.a.s.c.OverseerTaskProcessor Cleaning up work-queue. #Running tasks: 1 #Completed tasks: 0
[junit4] 2> 1679679 DEBUG (OverseerCollectionConfigSetProcessor-72240823804362756-127.0.0.1:39431__%2Fi-n_0000000000) [n:127.0.0.1:39431__%2Fi ] o.a.s.c.OverseerTaskProcessor RunningTasks: [/overseer/collection-queue-work/qn-0000000000]
[junit4] 2> 1679679 DEBUG (OverseerCollectionConfigSetProcessor-72240823804362756-127.0.0.1:39431__%2Fi-n_0000000000) [n:127.0.0.1:39431__%2Fi ] o.a.s.c.OverseerTaskProcessor BlockedTasks: []
[junit4] 2> 1679679 DEBUG (OverseerCollectionConfigSetProcessor-72240823804362756-127.0.0.1:39431__%2Fi-n_0000000000) [n:127.0.0.1:39431__%2Fi ] o.a.s.c.OverseerTaskProcessor CompletedTasks: []
[junit4] 2> 1679679 INFO (OverseerCollectionConfigSetProcessor-72240823804362756-127.0.0.1:39431__%2Fi-n_0000000000) [n:127.0.0.1:39431__%2Fi ] o.a.s.c.OverseerTaskProcessor RunningZKTasks: [/overseer/collection-queue-work/qn-0000000000]
[junit4] 2> 1679679 DEBUG (OverseerThreadFactory-15848-thread-1-processing-n:127.0.0.1:39431__%2Fi) [n:127.0.0.1:39431__%2Fi ] o.a.s.c.c.ZkStateReader$AliasesManager Aliases: cmp=0, not overwriting ZK version.
[junit4] 2> 1679679 INFO (OverseerThreadFactory-15848-thread-1-processing-n:127.0.0.1:39431__%2Fi) [n:127.0.0.1:39431__%2Fi ] o.a.s.c.a.c.CreateCollectionCmd Create collection control_collection
[junit4] 2> 1679680 DEBUG (OverseerThreadFactory-15848-thread-1-processing-n:127.0.0.1:39431__%2Fi) [n:127.0.0.1:39431__%2Fi ] o.a.s.c.a.c.OverseerCollectionMessageHandler creating collections conf node /collections/control_collection
[junit4] 2> 1679681 DEBUG (OverseerThreadFactory-15848-thread-1-processing-n:127.0.0.1:39431__%2Fi) [n:127.0.0.1:39431__%2Fi ] o.a.s.c.a.c.CreateCollectionCmd Check for collection zkNode: control_collection
[junit4] 2> 1679681 DEBUG (OverseerThreadFactory-15848-thread-1-processing-n:127.0.0.1:39431__%2Fi) [n:127.0.0.1:39431__%2Fi ] o.a.s.c.a.c.CreateCollectionCmd Collection zkNode exists
[junit4] 2> 1679682 DEBUG (TEST-ShardSplitTest.testSplitMixedReplicaTypesLink-seed#[359286B6ADD41B85]-EventThread) [ ] o.a.s.c.c.SolrZkClient Submitting job to respond to event WatchedEvent state:SyncConnected type:NodeChildrenChanged path:/overseer/queue
[junit4] 2> 1679683 DEBUG (OverseerStateUpdate-72240823804362756-127.0.0.1:39431__%2Fi-n_0000000000) [n:127.0.0.1:39431__%2Fi ] o.a.s.c.Overseer processMessage: queueSize: 1, message = {
[junit4] 2> "name":"control_collection",
[junit4] 2> "fromApi":"true",
[junit4] 2> "collection.configName":"conf1",
[junit4] 2> "numShards":"1",
[junit4] 2> "createNodeSet":"127.0.0.1:39431__%2Fi",
[junit4] 2> "nrtReplicas":"1",
[junit4] 2> "stateFormat":"2",
[junit4] 2> "replicationFactor":"1",
[junit4] 2> "operation":"create"} current state version: 0
[junit4] 2> 1679683 DEBUG (OverseerStateUpdate-72240823804362756-127.0.0.1:39431__%2Fi-n_0000000000) [n:127.0.0.1:39431__%2Fi ] o.a.s.c.o.ClusterStateMutator building a new cName: control_collection
[junit4] 2> 1679684 DEBUG (OverseerStateUpdate-72240823804362756-127.0.0.1:39431__%2Fi-n_0000000000) [n:127.0.0.1:39431__%2Fi ] o.a.s.c.o.ZkStateWriter going to create_collection /collections/control_collection/state.json
[junit4] 2> 1679684 DEBUG (TEST-ShardSplitTest.testSplitMixedReplicaTypesLink-seed#[359286B6ADD41B85]-EventThread) [ ] o.a.s.c.c.SolrZkClient Submitting job to respond to event WatchedEvent state:SyncConnected type:NodeChildrenChanged path:/overseer/queue
[junit4] 2> 1679784 DEBUG (OverseerThreadFactory-15848-thread-1-processing-n:127.0.0.1:39431__%2Fi) [n:127.0.0.1:39431__%2Fi ] o.a.s.c.a.c.CreateCollectionCmd Creating SolrCores for new collection control_collection, shardNames [shard1] , message : {
[junit4] 2> "name":"control_collection",
[junit4] 2> "fromApi":"true",
[junit4] 2> "collection.configName":"conf1",
[junit4] 2> "numShards":"1",
[junit4] 2> "createNodeSet":"127.0.0.1:39431__%2Fi",
[junit4] 2> "nrtReplicas":"1",
[junit4] 2> "stateFormat":"2",
[junit4] 2> "replicationFactor":"1",
[junit4] 2> "operation":"create"}
[junit4] 2> 1679785 DEBUG (OverseerThreadFactory-15848-thread-1-processing-n:127.0.0.1:39431__%2Fi) [n:127.0.0.1:39431__%2Fi ] o.a.s.c.a.c.CreateCollectionCmd Creating core control_collection_shard1_replica_n1 as part of shard shard1 of collection control_collection on 127.0.0.1:39431__%2Fi
[junit4] 2> 1679786 INFO (qtp1670351794-28965) [n:127.0.0.1:39431__%2Fi ] o.a.s.s.HttpSolrCall HttpSolrCall.init(http://127.0.0.1:39431/_/i/admin/cores?null)
[junit4] 2> 1679787 INFO (qtp1670351794-28965) [n:127.0.0.1:39431__%2Fi x:control_collection_shard1_replica_n1 ] o.a.s.h.a.CoreAdminOperation core create command qt=/admin/cores&collection.configName=conf1&newCollection=true&name=control_collection_shard1_replica_n1&action=CREATE&numShards=1&collection=control_collection&shard=shard1&wt=javabin&version=2&replicaType=NRT
[junit4] 2> 1679787 INFO (qtp1670351794-28965) [n:127.0.0.1:39431__%2Fi x:control_collection_shard1_replica_n1 ] o.a.s.c.TransientSolrCoreCacheDefault Allocating transient core cache for max 4 cores with initial capacity of 4
[junit4] 2> 1679792 DEBUG (TEST-ShardSplitTest.testSplitMixedReplicaTypesLink-seed#[359286B6ADD41B85]-EventThread) [ ] o.a.s.c.c.SolrZkClient Submitting job to respond to event WatchedEvent state:SyncConnected type:NodeChildrenChanged path:/overseer/queue
[junit4] 2> 1679793 DEBUG (OverseerStateUpdate-72240823804362756-127.0.0.1:39431__%2Fi-n_0000000000) [n:127.0.0.1:39431__%2Fi ] o.a.s.c.Overseer processMessage: queueSize: 1, message = {
[junit4] 2> "core":"control_collection_shard1_replica_n1",
[junit4] 2> "roles":null,
[junit4] 2> "node_name":"127.0.0.1:39431__%2Fi",
[junit4] 2> "base_url":"http://127.0.0.1:39431/_/i",
[junit4] 2> "numShards":"1",
[junit4] 2> "state":"down",
[junit4] 2> "shard":"shard1",
[junit4] 2> "collection":"control_collection",
[junit4] 2> "type":"NRT",
[junit4] 2> "operation":"state"} current state version: 0
[junit4] 2> 1679793 DEBUG (OverseerStateUpdate-72240823804362756-127.0.0.1:39431__%2Fi-n_0000000000) [n:127.0.0.1:39431__%2Fi ] o.a.s.c.o.ReplicaMutator Update state numShards=1 message={
[junit4] 2> "core":"control_collection_shard1_replica_n1",
[junit4] 2> "roles":null,
[junit4] 2> "node_name":"127.0.0.1:39431__%2Fi",
[junit4] 2> "base_url":"http://127.0.0.1:39431/_/i",
[junit4] 2> "numShards":"1",
[junit4] 2> "state":"down",
[junit4] 2> "shard":"shard1",
[junit4] 2> "collection":"control_collection",
[junit4] 2> "type":"NRT",
[junit4] 2> "operation":"state"}
[junit4] 2> 1679794 DEBUG (OverseerStateUpdate-72240823804362756-127.0.0.1:39431__%2Fi-n_0000000000) [n:127.0.0.1:39431__%2Fi ] o.a.s.c.o.ReplicaMutator Will update state for replica: core_node2:{
[junit4] 2> "core":"control_collection_shard1_replica_n1",
[junit4] 2> "node_name":"127.0.0.1:39431__%2Fi",
[junit4] 2> "base_url":"http://127.0.0.1:39431/_/i",
[junit4] 2> "state":"down",
[junit4] 2> "type":"NRT"}
[junit4] 2> 1679794 DEBUG (OverseerStateUpdate-72240823804362756-127.0.0.1:39431__%2Fi-n_0000000000) [n:127.0.0.1:39431__%2Fi ] o.a.s.c.o.ReplicaMutator Collection is now: DocCollection(control_collection//collections/control_collection/state.json/0 )={
[junit4] 2> "pullReplicas":"0",
[junit4] 2> "replicationFactor":"1",
[junit4] 2> "router":{"name":"compositeId"},
[junit4] 2> "maxShardsPerNode":"1",
[junit4] 2> "autoAddReplicas":"false",
[junit4] 2> "nrtReplicas":"1",
[junit4] 2> "tlogReplicas":"0",
[junit4] 2> "shards":{"shard1":{
[junit4] 2> "range":"80000000-7fffffff",
[junit4] 2> "state":"active",
[junit4] 2> "replicas":{"core_node2":{
[junit4] 2> "core":"control_collection_shard1_replica_n1",
[junit4] 2> "node_name":"127.0.0.1:39431__%2Fi",
[junit4] 2> "base_url":"http://127.0.0.1:39431/_/i",
[junit4] 2> "state":"down",
[junit4] 2> "type":"NRT"}}}}}
[junit4] 2> 1679895 DEBUG (OverseerStateUpdate-72240823804362756-127.0.0.1:39431__%2Fi-n_0000000000) [n:127.0.0.1:39431__%2Fi ] o.a.s.c.o.ZkStateWriter going to update_collection /collections/control_collection/state.json version: 0
[junit4] 2> 1679896 DEBUG (TEST-ShardSplitTest.testSplitMixedReplicaTypesLink-seed#[359286B6ADD41B85]-EventThread) [ ] o.a.s.c.c.SolrZkClient Submitting job to respond to event WatchedEvent state:SyncConnected type:NodeChildrenChanged path:/overseer/queue
[junit4] 2> 1680802 DEBUG (qtp1670351794-28965) [n:127.0.0.1:39431__%2Fi c:control_collection s:shard1 x:control_collection_shard1_replica_n1 ] o.a.s.c.c.ZkStateReader Loading collection config from: [/collections/control_collection]
[junit4] 2> 1680826 INFO (qtp1670351794-28965) [n:127.0.0.1:39431__%2Fi c:control_collection s:shard1 x:control_collection_shard1_replica_n1 ] o.a.s.c.SolrConfig Using Lucene MatchVersion: 8.11.4
[junit4] 2> 1680826 WARN (qtp1670351794-28965) [n:127.0.0.1:39431__%2Fi c:control_collection s:shard1 x:control_collection_shard1_replica_n1 ] o.a.s.c.SolrConfig solrconfig.xml: <jmx> is no longer supported, use solr.xml:/metrics/reporter section instead
[junit4] 2> 1680834 INFO (qtp1670351794-28965) [n:127.0.0.1:39431__%2Fi c:control_collection s:shard1 x:control_collection_shard1_replica_n1 ] o.a.s.s.IndexSchema Schema name=test
[junit4] 2> 1680841 INFO (qtp1670351794-28965) [n:127.0.0.1:39431__%2Fi c:control_collection s:shard1 x:control_collection_shard1_replica_n1 ] o.a.s.s.IndexSchema Loaded schema test/1.6 with uniqueid field id
[junit4] 2> 1680863 INFO (qtp1670351794-28965) [n:127.0.0.1:39431__%2Fi c:control_collection s:shard1 x:control_collection_shard1_replica_n1 ] o.a.s.c.CoreContainer Creating SolrCore 'control_collection_shard1_replica_n1' using configuration from configset conf1, trusted=true
[junit4] 2> 1680863 INFO (qtp1670351794-28965) [n:127.0.0.1:39431__%2Fi c:control_collection s:shard1 x:control_collection_shard1_replica_n1 ] o.a.s.m.r.SolrJmxReporter JMX monitoring for 'solr.core.control_collection.shard1.replica_n1' (registry 'solr.core.control_collection.shard1.replica_n1') enabled at server: com.sun.jmx.mbeanserver.JmxMBeanServer@827d733
[junit4] 2> 1680864 INFO (qtp1670351794-28965) [n:127.0.0.1:39431__%2Fi c:control_collection s:shard1 x:control_collection_shard1_replica_n1 ] o.a.s.c.SolrCore [[control_collection_shard1_replica_n1] ] Opening new SolrCore at [/home/jenkins/jenkins-slave/workspace/Lucene/Lucene-Solr-Tests-8.11/solr/build/solr-core/test/J3/temp/solr.cloud.api.collections.ShardSplitTest_359286B6ADD41B85-001/control-001/cores/control_collection_shard1_replica_n1], dataDir=[/home/jenkins/jenkins-slave/workspace/Lucene/Lucene-Solr-Tests-8.11/solr/build/solr-core/test/J3/temp/solr.cloud.api.collections.ShardSplitTest_359286B6ADD41B85-001/control-001/cores/control_collection_shard1_replica_n1/data/]
[junit4] 2> 1680867 INFO (qtp1670351794-28965) [n:127.0.0.1:39431__%2Fi c:control_collection s:shard1 x:control_collection_shard1_replica_n1 ] o.a.s.u.RandomMergePolicy RandomMergePolicy wrapping class org.apache.lucene.index.TieredMergePolicy: [TieredMergePolicy: maxMergeAtOnce=33, maxMergeAtOnceExplicit=11, maxMergedSegmentMB=104.0361328125, floorSegmentMB=0.3203125, forceMergeDeletesPctAllowed=10.250555167991072, segmentsPerTier=20.0, maxCFSSegmentSizeMB=8.796093022207999E12, noCFSRatio=1.0, deletesPctAllowed=22.100030970337766
[junit4] 2> 1680894 WARN (qtp1670351794-28965) [n:127.0.0.1:39431__%2Fi c:control_collection s:shard1 x:control_collection_shard1_replica_n1 ] o.a.s.c.RequestHandlers INVALID paramSet a in requestHandler {type = requestHandler,name = /dump,class = DumpRequestHandler,attributes = {initParams=a, name=/dump, class=DumpRequestHandler},args = {defaults={a=A,b=B}}}
[junit4] 2> 1680948 INFO (qtp1670351794-28965) [n:127.0.0.1:39431__%2Fi c:control_collection s:shard1 x:control_collection_shard1_replica_n1 ] o.a.s.u.UpdateHandler Using UpdateLog implementation: org.apache.solr.update.UpdateLog
[junit4] 2> 1680948 INFO (qtp1670351794-28965) [n:127.0.0.1:39431__%2Fi c:control_collection s:shard1 x:control_collection_shard1_replica_n1 ] o.a.s.u.UpdateLog Initializing UpdateLog: dataDir= defaultSyncLevel=FLUSH numRecordsToKeep=100 maxNumLogsToKeep=10 numVersionBuckets=65536
[junit4] 2> 1680950 INFO (qtp1670351794-28965) [n:127.0.0.1:39431__%2Fi c:control_collection s:shard1 x:control_collection_shard1_replica_n1 ] o.a.s.u.CommitTracker Hard AutoCommit: disabled
[junit4] 2> 1680950 INFO (qtp1670351794-28965) [n:127.0.0.1:39431__%2Fi c:control_collection s:shard1 x:control_collection_shard1_replica_n1 ] o.a.s.u.CommitTracker Soft AutoCommit: disabled
[junit4] 2> 1680951 INFO (qtp1670351794-28965) [n:127.0.0.1:39431__%2Fi c:control_collection s:shard1 x:control_collection_shard1_replica_n1 ] o.a.s.u.RandomMergePolicy RandomMergePolicy wrapping class org.apache.lucene.index.TieredMergePolicy: [TieredMergePolicy: maxMergeAtOnce=41, maxMergeAtOnceExplicit=11, maxMergedSegmentMB=74.5625, floorSegmentMB=0.478515625, forceMergeDeletesPctAllowed=19.588835191749812, segmentsPerTier=33.0, maxCFSSegmentSizeMB=8.796093022207999E12, noCFSRatio=0.0, deletesPctAllowed=22.406745190693222
[junit4] 2> 1680953 DEBUG (qtp1670351794-28965) [n:127.0.0.1:39431__%2Fi c:control_collection s:shard1 x:control_collection_shard1_replica_n1 ] o.a.s.c.c.ZkStateReader Loading collection config from: [/collections/control_collection]
[junit4] 2> 1680954 INFO (qtp1670351794-28965) [n:127.0.0.1:39431__%2Fi c:control_collection s:shard1 x:control_collection_shard1_replica_n1 ] o.a.s.r.ManagedResourceStorage Configured ZooKeeperStorageIO with znodeBase: /configs/conf1
[junit4] 2> 1680954 INFO (qtp1670351794-28965) [n:127.0.0.1:39431__%2Fi c:control_collection s:shard1 x:control_collection_shard1_replica_n1 ] o.a.s.r.ManagedResourceStorage Loaded null at path _rest_managed.json using ZooKeeperStorageIO:path=/configs/conf1
[junit4] 2> 1680954 INFO (qtp1670351794-28965) [n:127.0.0.1:39431__%2Fi c:control_collection s:shard1 x:control_collection_shard1_replica_n1 ] o.a.s.h.ReplicationHandler Commits will be reserved for 10000 ms
[junit4] 2> 1680954 INFO (qtp1670351794-28965) [n:127.0.0.1:39431__%2Fi c:control_collection s:shard1 x:control_collection_shard1_replica_n1 ] o.a.s.u.UpdateLog Could not find max version in index or recent updates, using new clock 1791652523188158464
[junit4] 2> 1680956 DEBUG (qtp1670351794-28965) [n:127.0.0.1:39431__%2Fi c:control_collection s:shard1 x:control_collection_shard1_replica_n1 ] o.a.s.c.c.ZkStateReader Waiting up to 60000ms for state org.apache.solr.cloud.ZkController$$Lambda$587/1200811495@65bce740
[junit4] 2> 1680957 DEBUG (qtp1670351794-28965) [n:127.0.0.1:39431__%2Fi c:control_collection s:shard1 x:control_collection_shard1_replica_n1 ] o.a.s.c.c.ZkStateReader Found org.apache.solr.cloud.ZkController$$Lambda$587/1200811495@65bce740 directly in clusterState
[junit4] 2> 1680957 DEBUG (qtp1670351794-28965) [n:127.0.0.1:39431__%2Fi c:control_collection s:shard1 x:control_collection_shard1_replica_n1 ] o.a.s.c.c.SolrZkClient makePath: /collections/control_collection/terms/shard1
[junit4] 2> 1680960 INFO (qtp1670351794-28965) [n:127.0.0.1:39431__%2Fi c:control_collection s:shard1 x:control_collection_shard1_replica_n1 ] o.a.s.c.ZkShardTerms Successful update of terms at /collections/control_collection/terms/shard1 to Terms{values={core_node2=0}, version=0}
[junit4] 2> 1680960 DEBUG (TEST-ShardSplitTest.testSplitMixedReplicaTypesLink-seed#[359286B6ADD41B85]-EventThread) [ ] o.a.s.c.c.SolrZkClient Submitting job to respond to event WatchedEvent state:SyncConnected type:NodeDataChanged path:/collections/control_collection/terms/shard1
[junit4] 2> 1680960 INFO (qtp1670351794-28965) [n:127.0.0.1:39431__%2Fi c:control_collection s:shard1 x:control_collection_shard1_replica_n1 ] o.a.s.c.ShardLeaderElectionContextBase make sure parent is created /collections/control_collection/leaders/shard1
[junit4] 2> 1680960 DEBUG (qtp1670351794-28965) [n:127.0.0.1:39431__%2Fi c:control_collection s:shard1 x:control_collection_shard1_replica_n1 ] o.a.s.c.c.SolrZkClient makePath: /collections/control_collection/leaders/shard1
[junit4] 2> 1680961 INFO (searcherExecutor-15860-thread-1-processing-n:127.0.0.1:39431__%2Fi x:control_collection_shard1_replica_n1 c:control_collection s:shard1) [n:127.0.0.1:39431__%2Fi c:control_collection s:shard1 x:control_collection_shard1_replica_n1 ] o.a.s.c.SolrCore [control_collection_shard1_replica_n1] Registered new searcher autowarm time: 0 ms
[junit4] 2> 1680961 DEBUG (qtp1670351794-28965) [n:127.0.0.1:39431__%2Fi c:control_collection s:shard1 x:control_collection_shard1_replica_n1 ] o.a.s.c.c.SolrZkClient makePath: /collections/control_collection/leader_elect/shard1/election
[junit4] 2> 1680963 INFO (qtp1670351794-28965) [n:127.0.0.1:39431__%2Fi c:control_collection s:shard1 x:control_collection_shard1_replica_n1 ] o.a.s.c.ShardLeaderElectionContext Enough replicas found to continue.
[junit4] 2> 1680963 INFO (qtp1670351794-28965) [n:127.0.0.1:39431__%2Fi c:control_collection s:shard1 x:control_collection_shard1_replica_n1 ] o.a.s.c.ShardLeaderElectionContext I may be the new leader - try and sync
[junit4] 2> 1680963 INFO (qtp1670351794-28965) [n:127.0.0.1:39431__%2Fi c:control_collection s:shard1 x:control_collection_shard1_replica_n1 ] o.a.s.c.SyncStrategy Sync replicas to http://127.0.0.1:39431/_/i/control_collection_shard1_replica_n1/
[junit4] 2> 1680964 INFO (qtp1670351794-28965) [n:127.0.0.1:39431__%2Fi c:control_collection s:shard1 x:control_collection_shard1_replica_n1 ] o.a.s.c.SyncStrategy Sync Success - now sync replicas to me
[junit4] 2> 1680964 INFO (qtp1670351794-28965) [n:127.0.0.1:39431__%2Fi c:control_collection s:shard1 x:control_collection_shard1_replica_n1 ] o.a.s.c.SyncStrategy http://127.0.0.1:39431/_/i/control_collection_shard1_replica_n1/ has no replicas
[junit4] 2> 1680964 INFO (qtp1670351794-28965) [n:127.0.0.1:39431__%2Fi c:control_collection s:shard1 x:control_collection_shard1_replica_n1 ] o.a.s.c.ShardLeaderElectionContextBase Creating leader registration node /collections/control_collection/leaders/shard1/leader after winning as /collections/control_collection/leader_elect/shard1/election/72240823804362756-core_node2-n_0000000000
[junit4] 2> 1680966 DEBUG (TEST-ShardSplitTest.testSplitMixedReplicaTypesLink-seed#[359286B6ADD41B85]-EventThread) [ ] o.a.s.c.c.SolrZkClient Submitting job to respond to event WatchedEvent state:SyncConnected type:NodeChildrenChanged path:/overseer/queue
[junit4] 2> 1680966 INFO (qtp1670351794-28965) [n:127.0.0.1:39431__%2Fi c:control_collection s:shard1 x:control_collection_shard1_replica_n1 ] o.a.s.c.ShardLeaderElectionContext I am the new leader: http://127.0.0.1:39431/_/i/control_collection_shard1_replica_n1/ shard1
[junit4] 2> 1680966 DEBUG (qtp1670351794-28965) [n:127.0.0.1:39431__%2Fi c:control_collection s:shard1 x:control_collection_shard1_replica_n1 ] o.a.s.c.c.ZkStateReader already watching , added to stateWatchers
[junit4] 2> 1680966 DEBUG (OverseerStateUpdate-72240823804362756-127.0.0.1:39431__%2Fi-n_0000000000) [n:127.0.0.1:39431__%2Fi ] o.a.s.c.Overseer processMessage: queueSize: 1, message = {
[junit4] 2> "operation":"leader",
[junit4] 2> "shard":"shard1",
[junit4] 2> "collection":"control_collection",
[junit4] 2> "node_name":"127.0.0.1:39431__%2Fi",
[junit4] 2> "base_url":"http://127.0.0.1:39431/_/i",
[junit4] 2> "core":"control_collection_shard1_replica_n1",
[junit4] 2> "state":"active"} current state version: 0
[junit4] 2> 1680967 DEBUG (qtp1670351794-28965) [n:127.0.0.1:39431__%2Fi c:control_collection s:shard1 x:control_collection_shard1_replica_n1 ] o.a.s.c.c.ZkStateReader Add data for [control_collection] ver [1]
[junit4] 2> 1680967 DEBUG (qtp1670351794-28965) [n:127.0.0.1:39431__%2Fi c:control_collection s:shard1 x:control_collection_shard1_replica_n1 ] o.a.s.c.c.ZkStateReader clusterStateSet: legacy [0] interesting [1] watched [1] lazy [2] total [2]
[junit4] 2> 1680968 DEBUG (qtp1670351794-28965) [n:127.0.0.1:39431__%2Fi c:control_collection s:shard1 x:control_collection_shard1_replica_n1 ] o.a.s.c.c.ZkStateReader updated per-replica states changed for: control_collection, ver: 0 , new vals: []
[junit4] 2> 1680969 DEBUG (qtp1670351794-28965) [n:127.0.0.1:39431__%2Fi c:control_collection s:shard1 x:control_collection_shard1_replica_n1 ] o.a.s.c.c.ZkStateReader clusterStateSet: legacy [0] interesting [1] watched [1] lazy [2] total [2]
[junit4] 2> 1680969 DEBUG (watches-15842-thread-1-processing-n:127.0.0.1:39431__%2Fi x:control_collection_shard1_replica_n1 c:control_collection s:shard1) [n:127.0.0.1:39431__%2Fi c:control_collection s:shard1 x:control_collection_shard1_replica_n1 ] o.a.s.c.c.ZkStateReader CollectionStatePredicate failed for control_collection, cversion : -1
[junit4] 2> 1680970 DEBUG (qtp1670351794-28965) [n:127.0.0.1:39431__%2Fi c:control_collection s:shard1 x:control_collection_shard1_replica_n1 ] o.a.s.c.c.ZkStateReader CollectionStatePredicate failed for control_collection, cversion : -1
[junit4] 2> 1680970 DEBUG (qtp1670351794-28965) [n:127.0.0.1:39431__%2Fi c:control_collection s:shard1 x:control_collection_shard1_replica_n1 ] o.a.s.c.c.ZkStateReader CollectionStatePredicate failed for control_collection, cversion : -1
[junit4] 2> 1680970 DEBUG (qtp1670351794-28965) [n:127.0.0.1:39431__%2Fi c:control_collection s:shard1 x:control_collection_shard1_replica_n1 ] o.a.s.c.c.ZkStateReader CollectionStatePredicate failed for control_collection, cversion : -1
[junit4] 2> 1680970 DEBUG (watches-15842-thread-2-processing-n:127.0.0.1:39431__%2Fi x:control_collection_shard1_replica_n1 c:control_collection s:shard1) [n:127.0.0.1:39431__%2Fi c:control_collection s:shard1 x:control_collection_shard1_replica_n1 ] o.a.s.c.c.ZkStateReader CollectionStatePredicate failed for control_collection, cversion : -1
[junit4] 2> 1681067 DEBUG (OverseerStateUpdate-72240823804362756-127.0.0.1:39431__%2Fi-n_0000000000) [n:127.0.0.1:39431__%2Fi ] o.a.s.c.o.ZkStateWriter going to update_collection /collections/control_collection/state.json version: 1
[junit4] 2> 1681068 DEBUG (TEST-ShardSplitTest.testSplitMixedReplicaTypesLink-seed#[359286B6ADD41B85]-EventThread) [ ] o.a.s.c.c.SolrZkClient Submitting job to respond to event WatchedEvent state:SyncConnected type:NodeDataChanged path:/collections/control_collection/state.json
[junit4] 2> 1681068 INFO (zkCallback-15840-thread-1) [ ] o.a.s.c.c.ZkStateReader A cluster state change: [WatchedEvent state:SyncConnected type:NodeDataChanged path:/collections/control_collection/state.json] for collection [control_collection] has occurred - updating... (live nodes size: [1])
[junit4] 2> 1681068 DEBUG (zkCallback-15840-thread-1) [ ] o.a.s.c.c.ZkStateReader Updating data for [control_collection] from [1] to [2]
[junit4] 2> 1681068 DEBUG (zkCallback-15840-thread-1) [ ] o.a.s.c.c.ZkStateReader clusterStateSet: legacy [0] interesting [1] watched [1] lazy [2] total [2]
[junit4] 2> 1681068 DEBUG (watches-15842-thread-2) [ ] o.a.s.c.c.ZkStateReader leader found for control_collection/shard1 to be core_node2:{
[junit4] 2> "core":"control_collection_shard1_replica_n1",
[junit4] 2> "node_name":"127.0.0.1:39431__%2Fi",
[junit4] 2> "base_url":"http://127.0.0.1:39431/_/i",
[junit4] 2> "state":"down",
[junit4] 2> "type":"NRT",
[junit4] 2> "leader":"true"}
[junit4] 2> 1681068 DEBUG (watches-15842-thread-2) [ ] o.a.s.c.c.ZkStateReader clusterStateSet: legacy [0] interesting [0] watched [0] lazy [2] total [2]
[junit4] 2> 1681068 DEBUG (TEST-ShardSplitTest.testSplitMixedReplicaTypesLink-seed#[359286B6ADD41B85]-EventThread) [ ] o.a.s.c.c.SolrZkClient Submitting job to respond to event WatchedEvent state:SyncConnected type:NodeChildrenChanged path:/overseer/queue
[junit4] 2> 1681069 INFO (qtp1670351794-28965) [n:127.0.0.1:39431__%2Fi c:control_collection s:shard1 x:control_collection_shard1_replica_n1 ] o.a.s.c.ZkController I am the leader, no recovery necessary
[junit4] 2> 1681069 DEBUG (TEST-ShardSplitTest.testSplitMixedReplicaTypesLink-seed#[359286B6ADD41B85]-EventThread) [ ] o.a.s.c.c.SolrZkClient Submitting job to respond to event WatchedEvent state:SyncConnected type:NodeChildrenChanged path:/overseer/queue
[junit4] 2> 1681069 DEBUG (qtp1670351794-28965) [n:127.0.0.1:39431__%2Fi c:control_collection s:shard1 x:control_collection_shard1_replica_n1 ] o.a.s.c.c.ZkStateReader Refreshing lazily-loaded state for collection control_collection
[junit4] 2> 1681070 DEBUG (qtp1670351794-28965) [n:127.0.0.1:39431__%2Fi c:control_collection s:shard1 x:control_collection_shard1_replica_n1 ] o.a.s.c.c.ZkStateReader already watching , added to stateWatchers
[junit4] 2> 1681070 DEBUG (OverseerStateUpdate-72240823804362756-127.0.0.1:39431__%2Fi-n_0000000000) [n:127.0.0.1:39431__%2Fi ] o.a.s.c.Overseer processMessage: queueSize: 1, message = {
[junit4] 2> "core":"control_collection_shard1_replica_n1",
[junit4] 2> "core_node_name":"core_node2",
[junit4] 2> "roles":null,
[junit4] 2> "node_name":"127.0.0.1:39431__%2Fi",
[junit4] 2> "base_url":"http://127.0.0.1:39431/_/i",
[junit4] 2> "numShards":"1",
[junit4] 2> "state":"active",
[junit4] 2> "shard":"shard1",
[junit4] 2> "collection":"control_collection",
[junit4] 2> "type":"NRT",
[junit4] 2> "operation":"state"} current state version: 0
[junit4] 2> 1681070 DEBUG (OverseerStateUpdate-72240823804362756-127.0.0.1:39431__%2Fi-n_0000000000) [n:127.0.0.1:39431__%2Fi ] o.a.s.c.o.ReplicaMutator Update state numShards=1 message={
[junit4] 2> "core":"control_collection_shard1_replica_n1",
[junit4] 2> "core_node_name":"core_node2",
[junit4] 2> "roles":null,
[junit4] 2> "node_name":"127.0.0.1:39431__%2Fi",
[junit4] 2> "base_url":"http://127.0.0.1:39431/_/i",
[junit4] 2> "numShards":"1",
[junit4] 2> "state":"active",
[junit4] 2> "shard":"shard1",
[junit4] 2> "collection":"control_collection",
[junit4] 2> "type":"NRT",
[junit4] 2> "operation":"state"}
[junit4] 2> 1681070 DEBUG (OverseerStateUpdate-72240823804362756-127.0.0.1:39431__%2Fi-n_0000000000) [n:127.0.0.1:39431__%2Fi ] o.a.s.c.o.ReplicaMutator Will update state for replica: core_node2:{
[junit4] 2> "core":"control_collection_shard1_replica_n1",
[junit4] 2> "node_name":"127.0.0.1:39431__%2Fi",
[junit4] 2> "base_url":"http://127.0.0.1:39431/_/i",
[junit4] 2> "state":"active",
[junit4] 2> "type":"NRT",
[junit4] 2> "leader":"true"}
[junit4] 2> 1681070 DEBUG (OverseerStateUpdate-72240823804362756-127.0.0.1:39431__%2Fi-n_0000000000) [n:127.0.0.1:39431__%2Fi ] o.a.s.c.o.ReplicaMutator Collection is now: DocCollection(control_collection//collections/control_collection/state.json/2 )={
[junit4] 2> "pullReplicas":"0",
[junit4] 2> "replicationFactor":"1",
[junit4] 2> "router":{"name":"compositeId"},
[junit4] 2> "maxShardsPerNode":"1",
[junit4] 2> "autoAddReplicas":"false",
[junit4] 2> "nrtReplicas":"1",
[junit4] 2> "tlogReplicas":"0",
[junit4] 2> "shards":{"shard1":{
[junit4] 2> "range":"80000000-7fffffff",
[junit4] 2> "state":"active",
[junit4] 2> "replicas":{"core_node2":{
[junit4] 2> "core":"control_collection_shard1_replica_n1",
[junit4] 2> "node_name":"127.0.0.1:39431__%2Fi",
[junit4]
[...truncated too long message...]
:None path:null
[junit4] 2> 1966340 DEBUG (closeThreadPool-17682-thread-2-EventThread) [ ] o.a.s.c.c.SolrZkClient Submitting job to respond to event WatchedEvent state:Closed type:None path:null
[junit4] 2> 1966340 DEBUG (closeThreadPool-17682-thread-2-EventThread) [ ] o.a.s.c.c.SolrZkClient Submitting job to respond to event WatchedEvent state:Closed type:None path:null
[junit4] 2> 1966340 DEBUG (closeThreadPool-17682-thread-2-EventThread) [ ] o.a.s.c.c.SolrZkClient Submitting job to respond to event WatchedEvent state:Closed type:None path:null
[junit4] 2> 1966340 INFO (closeThreadPool-17842-thread-7) [ ] o.e.j.s.AbstractConnector Stopped ServerConnector@76d086be{HTTP/1.1, (http/1.1, h2c)}{127.0.0.1:0}
[junit4] 2> 1966341 INFO (closeThreadPool-17842-thread-7) [ ] o.e.j.s.h.ContextHandler Stopped o.e.j.s.ServletContextHandler@395dc585{/_/i,null,STOPPED}
[junit4] 2> 1966341 INFO (closeThreadPool-17842-thread-7) [ ] o.e.j.s.session node0 Stopped scavenging
[junit4] 2> 1966343 INFO (TEST-ShardSplitTest.testSplitShardWithRuleLink-seed#[359286B6ADD41B85]) [ ] o.a.s.u.ErrorLogMuter Closing ErrorLogMuter-regex-406 after mutting 0 log messages
[junit4] 2> 1966343 INFO (TEST-ShardSplitTest.testSplitShardWithRuleLink-seed#[359286B6ADD41B85]) [ ] o.a.s.u.ErrorLogMuter Creating ErrorLogMuter-regex-407 for ERROR logs matching regex: ignore_exception
[junit4] 2> 1966343 INFO (TEST-ShardSplitTest.testSplitShardWithRuleLink-seed#[359286B6ADD41B85]) [ ] o.a.s.c.ZkTestServer Shutting down ZkTestServer.
[junit4] 2> 1966444 DEBUG (TEST-ShardSplitTest.testSplitShardWithRuleLink-seed#[359286B6ADD41B85]-EventThread) [ ] o.a.s.c.c.SolrZkClient Submitting job to respond to event WatchedEvent state:Closed type:None path:null
[junit4] 2> 1966545 DEBUG (TEST-ShardSplitTest.testSplitShardWithRuleLink-seed#[359286B6ADD41B85]-EventThread) [ ] o.a.s.c.c.SolrZkClient Submitting job to respond to event WatchedEvent state:Closed type:None path:null
[junit4] 2> 1966547 WARN (ZkTestServer Run Thread) [ ] o.a.s.c.ZkTestServer Watch limit violations:
[junit4] 2> Maximum concurrent create/delete watches above limit:
[junit4] 2>
[junit4] 2> 8 /solr/collections/shardSplitWithRule_link/terms/shard1_0
[junit4] 2> 8 /solr/collections/shardSplitWithRule_link/terms/shard1_1
[junit4] 2> 7 /solr/collections/collection1/state.json
[junit4] 2> 7 /solr/aliases.json
[junit4] 2> 5 /solr/packages.json
[junit4] 2> 5 /solr/collections/shardSplitWithRule_link/terms/shard1
[junit4] 2> 5 /solr/security.json
[junit4] 2> 5 /solr/configs/conf1
[junit4] 2> 5 /solr/collections/collection1/terms/shard1
[junit4] 2> 5 /solr/collections/collection1/terms/shard2
[junit4] 2> 4 /solr/collections/collection1/collectionprops.json
[junit4] 2> 4 /solr/collections/shardSplitWithRule_link/collectionprops.json
[junit4] 2> 2 /solr/collections/control_collection/terms/shard1
[junit4] 2>
[junit4] 2> Maximum concurrent data watches above limit:
[junit4] 2>
[junit4] 2> 65 /solr/clusterstate.json
[junit4] 2> 34 /solr/collections/shardSplitWithRule_link/state.json
[junit4] 2> 13 /solr/clusterprops.json
[junit4] 2> 7 /solr/collections/control_collection/state.json
[junit4] 2> 3 /solr/overseer_elect/election/72240841709387789-127.0.0.1:39429__%2Fi-n_0000000001
[junit4] 2>
[junit4] 2> Maximum concurrent children watches above limit:
[junit4] 2>
[junit4] 2> 72 /solr/collections/shardSplitWithRule_link/state.json
[junit4] 2> 61 /solr/overseer/queue
[junit4] 2> 35 /solr/live_nodes
[junit4] 2> 21 /solr/overseer/collection-queue-work
[junit4] 2> 13 /solr/collections
[junit4] 2> 2 /solr/collections/control_collection/state.json
[junit4] 2>
[junit4] 2> 1966555 INFO (TEST-ShardSplitTest.testSplitShardWithRuleLink-seed#[359286B6ADD41B85]) [ ] o.a.s.c.ZkTestServer waitForServerDown: 127.0.0.1:45835
[junit4] 2> 1966555 INFO (TEST-ShardSplitTest.testSplitShardWithRuleLink-seed#[359286B6ADD41B85]) [ ] o.a.s.c.ZkTestServer parse host and port list: 127.0.0.1:45835
[junit4] 2> 1966555 INFO (TEST-ShardSplitTest.testSplitShardWithRuleLink-seed#[359286B6ADD41B85]) [ ] o.a.s.c.ZkTestServer connecting to 127.0.0.1 45835
[junit4] IGNOR/A 0.00s J3 | ShardSplitTest.testSplitAfterFailedSplit2
[junit4] > Assumption #1: 'nightly' test group is disabled (@Nightly())
[junit4] IGNOR/A 0.00s J3 | ShardSplitTest.testSplitWithChaosMonkey
[junit4] > Assumption #1: 'nightly' test group is disabled (@Nightly())
[junit4] 2> 1966558 INFO (SUITE-ShardSplitTest-seed#[359286B6ADD41B85]-worker) [ ] o.a.s.u.ErrorLogMuter Closing ErrorLogMuter-regex-407 after mutting 0 log messages
[junit4] 2> 1966558 INFO (SUITE-ShardSplitTest-seed#[359286B6ADD41B85]-worker) [ ] o.a.s.u.ErrorLogMuter Creating ErrorLogMuter-regex-408 for ERROR logs matching regex: ignore_exception
[junit4] 2> NOTE: leaving temporary files on disk at: /home/jenkins/jenkins-slave/workspace/Lucene/Lucene-Solr-Tests-8.11/solr/build/solr-core/test/J3/temp/solr.cloud.api.collections.ShardSplitTest_359286B6ADD41B85-001
[junit4] 2> Feb 23, 2024 1:54:40 AM com.carrotsearch.randomizedtesting.ThreadLeakControl checkThreadLeaks
[junit4] 2> WARNING: Will linger awaiting termination of 1 leaked thread(s).
[junit4] 2> NOTE: test params are: codec=FastDecompressionCompressingStoredFieldsData(storedFieldsFormat=CompressingStoredFieldsFormat(compressionMode=FAST_DECOMPRESSION, chunkSize=73, maxDocsPerChunk=703, blockShift=16), termVectorsFormat=CompressingTermVectorsFormat(compressionMode=FAST_DECOMPRESSION, chunkSize=73, maxDocsPerChunk=703, blockSize=16)), sim=Asserting(RandomSimilarity(queryNorm=false): {}), locale=es-HN, timezone=America/Dawson
[junit4] 2> NOTE: Linux 4.15.0-213-generic amd64/Temurin 1.8.0_362 (64-bit)/cpus=4,threads=1,free=234729568,total=517472256
[junit4] 2> NOTE: All tests run in this JVM: [HdfsTlogReplayBufferedWhileIndexingTest, CheckHdfsIndexTest, TestHdfsUpdateLog, TestSolrCLIRunExample, PeerSyncWithBufferUpdatesTest, AnalysisErrorHandlingTest, DistributedFacetPivotLargeTest, TestGroupingSearch, DirectoryFactoryTest, TestPseudoReturnFields, AnalyticsQueryTest, TestMaxScoreQueryParser, DirectUpdateHandlerTest, RegexBytesRefFilterTest, CdcrWithNodesRestartsTest, TestManagedSynonymGraphFilterFactory, TestSearchPerf, TestEmbeddedSolrServerSchemaAPI, TestConfigSetsAPIExclusivity, SolrShardReporterTest, TestCollationFieldDocValues, DistributedQueueTest, CoreAdminRequestStatusTest, SolrMetricManagerTest, DebugComponentTest, HdfsRecoveryZkTest, TestNoOpRegenerator, TestLeaderElectionZkExpiry, DistributedQueryElevationComponentTest, CollectionPropsTest, TestDynamicFieldNamesIndexCorrectly, BackupRestoreApiErrorConditionsTest, TestQueryingOnDownCollection, TokenizerChainTest, OutOfBoxZkACLAndCredentialsProvidersTest, URLClassifyProcessorTest, HdfsCloudIncrementalBackupTest, TestSerializedLuceneMatchVersion, TestUseDocValuesAsStored, TestIBSimilarityFactory, SolrTestCaseJ4DeleteCoreTest, TestSubQueryTransformerDistrib, TestSuggestSpellingConverter, MultiAuthPluginTest, PingRequestHandlerTest, TriggerIntegrationTest, TestQuerySenderNoQuery, TransactionLogTest, TestBlendedInfixSuggestions, BufferStoreTest, TestExactStatsCache, TestTermsQParserPlugin, TestStandardQParsers, TestBooleanSimilarityFactory, TestFieldCollectionResource, TestSolrFieldCacheBean, TestNumericRangeQuery32, LeaderFailoverAfterPartitionTest, TestClusterStateMutator, TestMaxTokenLenTokenizer, TestUnifiedSolrHighlighterWithoutStoredId, BasicDistributedZkTest, QueryParsingTest, TestSolr4Spatial, JWTAuthPluginIntegrationTest, MetricTriggerTest, TestMergePolicyConfig, TestFastLRUCache, TestDeprecatedFilters, TestSnapshotCloudManager, CachingDirectoryFactoryTest, DateMathParserTest, ChangedSchemaMergeTest, SOLR749Test, PhrasesIdentificationComponentTest, TestHttpShardHandlerFactory, TermVectorComponentTest, StatsComponentTest, DeleteLastCustomShardedReplicaTest, FileUtilsTest, ResponseLogComponentTest, ConnectionManagerTest, RandomizedTaggerTest, RollingRestartTest, CloudExitableDirectoryReaderTest, TestFieldCacheSortRandom, TestSolrCoreSnapshots, BJQParserTest, SharedFSAutoReplicaFailoverTest, TestJsonRequest, BigEndianAscendingWordDeserializerTest, MultiSolrCloudTestCaseTest, TestChildDocTransformerHierarchy, TestAddFieldRealTimeGet, FacetPivot2CollectionsTest, TestCloudRecovery2, TestInfoStreamLogging, ScheduledTriggerIntegrationTest, ManagedSchemaRoundRobinCloudTest, TestFaceting, EnumFieldTest, TestAuthorizationFramework, StatelessScriptUpdateProcessorFactoryTest, AuthWithShardHandlerFactoryOverrideTest, SolrXmlInZkTest, TestStressUserVersions, SystemLogListenerTest, ZkCLITest, TestNestedDocsSort, CollectionsAPIDistributedZkTest, NodeLostTriggerTest, TestReqParamsAPI, MBeansHandlerTest, TestBulkSchemaConcurrent, AutoscalingHistoryHandlerTest, TestSimpleTrackingShardHandler, TestTolerantSearch, TestLuceneMatchVersion, TestWordDelimiterFilterFactory, TestEmbeddedSolrServerAdminHandler, TestEmbeddedSolrServerConstructors, AddReplicaTest, AliasIntegrationTest, BasicDistributedZk2Test, ChaosMonkeyNothingIsSafeWithPullReplicasTest, CleanupOldIndexTest, ConcurrentCreateRoutedAliasTest, DeleteStatusTest, DistribDocExpirationUpdateProcessorTest, LeaderElectionContextKeyTest, LeaderElectionIntegrationTest, ReindexCollectionTest, TestConfigSetsAPIZkFailure, TestDeleteCollectionOnDownNodes, TestDistributedMap, TestDownShardTolerantSearch, TestLeaderElectionWithEmptyReplica, TestStressCloudBlindAtomicUpdates, TestWithCollection, TestZkChroot, ZkFailoverTest, PurgeGraphTest, ShardSplitTest]
[junit4] Completed [631/959 (1!)] on J3 in 289.72s, 11 tests, 1 error, 3 skipped <<< FAILURES!
[...truncated 55370 lines...]