You are viewing a plain text version of this content. The canonical link for it is here.
Posted to commits@beam.apache.org by Apache Jenkins Server <je...@builds.apache.org> on 2017/09/18 07:15:35 UTC
Build failed in Jenkins: beam_PostCommit_Java_MavenInstall #4813
See <https://builds.apache.org/job/beam_PostCommit_Java_MavenInstall/4813/display/redirect>
------------------------------------------
[...truncated 3.63 MB...]
from apitools.base.protorpclite import message_types
File "<https://builds.apache.org/job/beam_PostCommit_Java_MavenInstall/ws/sdks/python/target/.tox/py27gcp/local/lib/python2.7/site-packages/apitools/base/protorpclite/message_types.py",> line 25, in <module>
from apitools.base.protorpclite import messages
File "<https://builds.apache.org/job/beam_PostCommit_Java_MavenInstall/ws/sdks/python/target/.tox/py27gcp/local/lib/python2.7/site-packages/apitools/base/protorpclite/messages.py",> line 1165, in <module>
class Field(six.with_metaclass(_FieldMeta, object)):
TypeError: Error when calling the metaclass bases
metaclass conflict: the metaclass of a derived class must be a (non-strict) subclass of the metaclasses of all its bases
ERROR: InvocationError: '<https://builds.apache.org/job/beam_PostCommit_Java_MavenInstall/ws/sdks/python/target/.tox/py27gcp/bin/python> apache_beam/examples/complete/autocomplete_test.py'
___________________________________ summary ____________________________________
ERROR: docs: commands failed
lint: commands succeeded
py27: commands succeeded
py27cython: commands succeeded
ERROR: py27gcp: commands failed
2017-09-18T07:14:25.132 [ERROR] Command execution failed.
org.apache.commons.exec.ExecuteException: Process exited with an error: 1 (Exit value: 1)
at org.apache.commons.exec.DefaultExecutor.executeInternal(DefaultExecutor.java:404)
at org.apache.commons.exec.DefaultExecutor.execute(DefaultExecutor.java:166)
at org.codehaus.mojo.exec.ExecMojo.executeCommandLine(ExecMojo.java:764)
at org.codehaus.mojo.exec.ExecMojo.executeCommandLine(ExecMojo.java:711)
at org.codehaus.mojo.exec.ExecMojo.execute(ExecMojo.java:289)
at org.apache.maven.plugin.DefaultBuildPluginManager.executeMojo(DefaultBuildPluginManager.java:134)
at org.apache.maven.lifecycle.internal.MojoExecutor.execute(MojoExecutor.java:208)
at org.apache.maven.lifecycle.internal.MojoExecutor.execute(MojoExecutor.java:153)
at org.apache.maven.lifecycle.internal.MojoExecutor.execute(MojoExecutor.java:145)
at org.apache.maven.lifecycle.internal.LifecycleModuleBuilder.buildProject(LifecycleModuleBuilder.java:116)
at org.apache.maven.lifecycle.internal.LifecycleModuleBuilder.buildProject(LifecycleModuleBuilder.java:80)
at org.apache.maven.lifecycle.internal.builder.singlethreaded.SingleThreadedBuilder.build(SingleThreadedBuilder.java:51)
at org.apache.maven.lifecycle.internal.LifecycleStarter.execute(LifecycleStarter.java:128)
at org.apache.maven.DefaultMaven.doExecute(DefaultMaven.java:307)
at org.apache.maven.DefaultMaven.doExecute(DefaultMaven.java:193)
at org.apache.maven.DefaultMaven.execute(DefaultMaven.java:106)
at org.jvnet.hudson.maven3.launcher.Maven33Launcher.main(Maven33Launcher.java:129)
at sun.reflect.NativeMethodAccessorImpl.invoke0(Native Method)
at sun.reflect.NativeMethodAccessorImpl.invoke(NativeMethodAccessorImpl.java:62)
at sun.reflect.DelegatingMethodAccessorImpl.invoke(DelegatingMethodAccessorImpl.java:43)
at java.lang.reflect.Method.invoke(Method.java:498)
at org.codehaus.plexus.classworlds.launcher.Launcher.launchStandard(Launcher.java:330)
at org.codehaus.plexus.classworlds.launcher.Launcher.launch(Launcher.java:238)
at jenkins.maven3.agent.Maven33Main.launch(Maven33Main.java:176)
at sun.reflect.NativeMethodAccessorImpl.invoke0(Native Method)
at sun.reflect.NativeMethodAccessorImpl.invoke(NativeMethodAccessorImpl.java:62)
at sun.reflect.DelegatingMethodAccessorImpl.invoke(DelegatingMethodAccessorImpl.java:43)
at java.lang.reflect.Method.invoke(Method.java:498)
at hudson.maven.Maven3Builder.call(Maven3Builder.java:139)
at hudson.maven.Maven3Builder.call(Maven3Builder.java:70)
at hudson.remoting.UserRequest.perform(UserRequest.java:153)
at hudson.remoting.UserRequest.perform(UserRequest.java:50)
at hudson.remoting.Request$2.run(Request.java:336)
at hudson.remoting.InterceptingExecutorService$1.call(InterceptingExecutorService.java:68)
at java.util.concurrent.FutureTask.run(FutureTask.java:266)
at java.util.concurrent.ThreadPoolExecutor.runWorker(ThreadPoolExecutor.java:1149)
at java.util.concurrent.ThreadPoolExecutor$Worker.run(ThreadPoolExecutor.java:624)
at java.lang.Thread.run(Thread.java:748)
[JENKINS] Archiving disabled
2017-09-18T07:14:26.597 [INFO]
2017-09-18T07:14:26.597 [INFO] ------------------------------------------------------------------------
2017-09-18T07:14:26.597 [INFO] Skipping Apache Beam :: Parent
2017-09-18T07:14:26.597 [INFO] This project has been banned from the build due to previous failures.
2017-09-18T07:14:26.598 [INFO] ------------------------------------------------------------------------
[JENKINS] Archiving disabled
[JENKINS] Archiving disabled
[JENKINS] Archiving disabled
[JENKINS] Archiving disabled
[JENKINS] Archiving disabled
[JENKINS] Archiving disabled
[JENKINS] Archiving disabled
[JENKINS] Archiving disabled
[JENKINS] Archiving disabled
[JENKINS] Archiving disabled
[JENKINS] Archiving disabled
[JENKINS] Archiving disabled
[JENKINS] Archiving disabled
[JENKINS] Archiving disabled
[JENKINS] Archiving disabled
[JENKINS] Archiving disabled
[JENKINS] Archiving disabled
[JENKINS] Archiving disabled
[JENKINS] Archiving disabled
[JENKINS] Archiving disabled
[JENKINS] Archiving disabled
[JENKINS] Archiving disabled
[JENKINS] Archiving disabled
[JENKINS] Archiving disabled
[JENKINS] Archiving disabled
[JENKINS] Archiving disabled
[JENKINS] Archiving disabled
[JENKINS] Archiving disabled
[JENKINS] Archiving disabled
[JENKINS] Archiving disabled
[JENKINS] Archiving disabled
[JENKINS] Archiving disabled
[JENKINS] Archiving disabled
[JENKINS] Archiving disabled
[JENKINS] Archiving disabled
[JENKINS] Archiving disabled
[JENKINS] Archiving disabled
[JENKINS] Archiving disabled
[JENKINS] Archiving disabled
[JENKINS] Archiving disabled
[JENKINS] Archiving disabled
[JENKINS] Archiving disabled
[JENKINS] Archiving disabled
[JENKINS] Archiving disabled
[JENKINS] Archiving disabled
[JENKINS] Archiving disabled
[JENKINS] Archiving disabled
[JENKINS] Archiving disabled
[JENKINS] Archiving disabled
[JENKINS] Archiving disabled
[JENKINS] Archiving disabled
[JENKINS] Archiving disabled
[JENKINS] Archiving disabled
[JENKINS] Archiving disabled
[JENKINS] Archiving disabled
[JENKINS] Archiving disabled
[JENKINS] Archiving disabled
[JENKINS] Archiving disabled
[JENKINS] Archiving disabled
[JENKINS] Archiving disabled
[JENKINS] Archiving disabled
[JENKINS] Archiving disabled
2017-09-18T07:15:22.304 [INFO] ------------------------------------------------------------------------
2017-09-18T07:15:22.305 [INFO] Reactor Summary:
2017-09-18T07:15:22.305 [INFO]
2017-09-18T07:15:22.305 [INFO] Apache Beam :: Parent .............................. SUCCESS [ 24.969 s]
2017-09-18T07:15:22.305 [INFO] Apache Beam :: SDKs :: Java :: Build Tools ......... SUCCESS [ 10.750 s]
2017-09-18T07:15:22.305 [INFO] Apache Beam :: SDKs ................................ SUCCESS [ 5.853 s]
2017-09-18T07:15:22.305 [INFO] Apache Beam :: SDKs :: Common ...................... SUCCESS [ 2.859 s]
2017-09-18T07:15:22.305 [INFO] Apache Beam :: SDKs :: Common :: Runner API ........ SUCCESS [ 28.028 s]
2017-09-18T07:15:22.305 [INFO] Apache Beam :: SDKs :: Common :: Fn API ............ SUCCESS [ 19.821 s]
2017-09-18T07:15:22.305 [INFO] Apache Beam :: SDKs :: Java ........................ SUCCESS [ 3.011 s]
2017-09-18T07:15:22.305 [INFO] Apache Beam :: SDKs :: Java :: Core ................ SUCCESS [02:54 min]
2017-09-18T07:15:22.305 [INFO] Apache Beam :: Runners ............................. SUCCESS [ 3.207 s]
2017-09-18T07:15:22.305 [INFO] Apache Beam :: Runners :: Core Construction Java ... SUCCESS [ 35.305 s]
2017-09-18T07:15:22.305 [INFO] Apache Beam :: Runners :: Core Java ................ SUCCESS [ 52.704 s]
2017-09-18T07:15:22.305 [INFO] Apache Beam :: Runners :: Direct Java .............. SUCCESS [04:02 min]
2017-09-18T07:15:22.305 [INFO] Apache Beam :: SDKs :: Java :: IO .................. SUCCESS [ 3.108 s]
2017-09-18T07:15:22.305 [INFO] Apache Beam :: SDKs :: Java :: IO :: AMQP .......... SUCCESS [ 22.260 s]
2017-09-18T07:15:22.305 [INFO] Apache Beam :: SDKs :: Java :: IO :: Common ........ SUCCESS [ 6.895 s]
2017-09-18T07:15:22.305 [INFO] Apache Beam :: SDKs :: Java :: IO :: Cassandra ..... SUCCESS [ 22.810 s]
2017-09-18T07:15:22.305 [INFO] Apache Beam :: SDKs :: Java :: IO :: Elasticsearch . SUCCESS [ 13.863 s]
2017-09-18T07:15:22.305 [INFO] Apache Beam :: SDKs :: Java :: IO :: Elasticsearch-Tests SUCCESS [ 4.241 s]
2017-09-18T07:15:22.305 [INFO] Apache Beam :: SDKs :: Java :: IO :: Elasticsearch-Tests :: Common SUCCESS [ 4.714 s]
2017-09-18T07:15:22.305 [INFO] Apache Beam :: SDKs :: Java :: IO :: Elasticsearch-Tests :: 2.x SUCCESS [ 22.236 s]
2017-09-18T07:15:22.305 [INFO] Apache Beam :: SDKs :: Java :: IO :: Elasticsearch-Tests :: 5.x SUCCESS [ 28.613 s]
2017-09-18T07:15:22.305 [INFO] Apache Beam :: SDKs :: Java :: Extensions .......... SUCCESS [ 2.973 s]
2017-09-18T07:15:22.305 [INFO] Apache Beam :: SDKs :: Java :: Extensions :: Google Cloud Platform Core SUCCESS [ 24.111 s]
2017-09-18T07:15:22.305 [INFO] Apache Beam :: SDKs :: Java :: Extensions :: Protobuf SUCCESS [ 18.909 s]
2017-09-18T07:15:22.305 [INFO] Apache Beam :: SDKs :: Java :: IO :: Google Cloud Platform SUCCESS [01:20 min]
2017-09-18T07:15:22.305 [INFO] Apache Beam :: SDKs :: Java :: IO :: Hadoop Common . SUCCESS [ 21.200 s]
2017-09-18T07:15:22.305 [INFO] Apache Beam :: SDKs :: Java :: IO :: Hadoop File System SUCCESS [ 33.098 s]
2017-09-18T07:15:22.305 [INFO] Apache Beam :: SDKs :: Java :: IO :: Hadoop ........ SUCCESS [ 5.227 s]
2017-09-18T07:15:22.305 [INFO] Apache Beam :: SDKs :: Java :: IO :: Hadoop :: input-format SUCCESS [ 19.741 s]
2017-09-18T07:15:22.305 [INFO] Apache Beam :: Runners :: Google Cloud Dataflow .... SUCCESS [07:36 min]
2017-09-18T07:15:22.305 [INFO] Apache Beam :: SDKs :: Java :: IO :: Hadoop :: jdk1.8-tests SUCCESS [01:16 min]
2017-09-18T07:15:22.306 [INFO] Apache Beam :: SDKs :: Java :: IO :: HBase ......... SUCCESS [01:31 min]
2017-09-18T07:15:22.306 [INFO] Apache Beam :: SDKs :: Java :: IO :: HCatalog ...... SUCCESS [01:07 min]
2017-09-18T07:15:22.306 [INFO] Apache Beam :: SDKs :: Java :: IO :: JDBC .......... SUCCESS [ 39.895 s]
2017-09-18T07:15:22.306 [INFO] Apache Beam :: SDKs :: Java :: IO :: JMS ........... SUCCESS [ 26.095 s]
2017-09-18T07:15:22.306 [INFO] Apache Beam :: SDKs :: Java :: IO :: Kafka ......... SUCCESS [ 30.088 s]
2017-09-18T07:15:22.306 [INFO] Apache Beam :: SDKs :: Java :: IO :: Kinesis ....... SUCCESS [ 29.029 s]
2017-09-18T07:15:22.306 [INFO] Apache Beam :: SDKs :: Java :: IO :: MongoDB ....... SUCCESS [ 45.349 s]
2017-09-18T07:15:22.306 [INFO] Apache Beam :: SDKs :: Java :: IO :: MQTT .......... SUCCESS [ 26.526 s]
2017-09-18T07:15:22.306 [INFO] Apache Beam :: SDKs :: Java :: IO :: Solr .......... SUCCESS [ 51.733 s]
2017-09-18T07:15:22.306 [INFO] Apache Beam :: SDKs :: Java :: IO :: Tika .......... SUCCESS [ 36.751 s]
2017-09-18T07:15:22.306 [INFO] Apache Beam :: SDKs :: Java :: IO :: XML ........... SUCCESS [ 31.174 s]
2017-09-18T07:15:22.306 [INFO] Apache Beam :: SDKs :: Java :: Maven Archetypes .... SUCCESS [ 2.690 s]
2017-09-18T07:15:22.306 [INFO] Apache Beam :: SDKs :: Java :: Maven Archetypes :: Starter SUCCESS [ 16.161 s]
2017-09-18T07:15:22.306 [INFO] Apache Beam :: Examples ............................ SUCCESS [ 2.993 s]
2017-09-18T07:15:22.306 [INFO] Apache Beam :: Examples :: Java .................... SUCCESS [06:42 min]
2017-09-18T07:15:22.306 [INFO] Apache Beam :: SDKs :: Java :: Maven Archetypes :: Examples SUCCESS [ 57.745 s]
2017-09-18T07:15:22.306 [INFO] Apache Beam :: Examples :: Java 8 .................. SUCCESS [ 40.190 s]
2017-09-18T07:15:22.306 [INFO] Apache Beam :: SDKs :: Java :: Maven Archetypes :: Examples - Java 8 SUCCESS [ 47.816 s]
2017-09-18T07:15:22.306 [INFO] Apache Beam :: SDKs :: Java :: Extensions :: Jackson SUCCESS [ 21.060 s]
2017-09-18T07:15:22.306 [INFO] Apache Beam :: SDKs :: Java :: Extensions :: Join library SUCCESS [ 25.435 s]
2017-09-18T07:15:22.306 [INFO] Apache Beam :: SDKs :: Java :: Extensions :: Sorter SUCCESS [ 35.834 s]
2017-09-18T07:15:22.306 [INFO] Apache Beam :: SDKs :: Java :: Extensions :: SQL ... SUCCESS [ 54.697 s]
2017-09-18T07:15:22.306 [INFO] Apache Beam :: SDKs :: Java :: Nexmark ............. SUCCESS [ 58.813 s]
2017-09-18T07:15:22.306 [INFO] Apache Beam :: SDKs :: Java :: Harness ............. SUCCESS [ 50.502 s]
2017-09-18T07:15:22.306 [INFO] Apache Beam :: SDKs :: Java :: Java 8 Tests ........ SUCCESS [ 14.580 s]
2017-09-18T07:15:22.306 [INFO] Apache Beam :: SDKs :: Python ...................... FAILURE [25:15 min]
2017-09-18T07:15:22.306 [INFO] Apache Beam :: Runners :: Flink .................... SKIPPED
2017-09-18T07:15:22.306 [INFO] Apache Beam :: Runners :: Spark .................... SKIPPED
2017-09-18T07:15:22.306 [INFO] Apache Beam :: Runners :: Apex ..................... SKIPPED
2017-09-18T07:15:22.306 [INFO] Apache Beam :: Runners :: Gearpump ................. SKIPPED
2017-09-18T07:15:22.306 [INFO] Apache Beam :: SDKs :: Java :: Aggregated Javadoc .. SKIPPED
2017-09-18T07:15:22.306 [INFO] ------------------------------------------------------------------------
2017-09-18T07:15:22.306 [INFO] BUILD FAILURE
2017-09-18T07:15:22.306 [INFO] ------------------------------------------------------------------------
2017-09-18T07:15:22.306 [INFO] Total time: 01:14 h
2017-09-18T07:15:22.306 [INFO] Finished at: 2017-09-18T07:15:22+00:00
2017-09-18T07:15:23.395 [INFO] Final Memory: 345M/2314M
2017-09-18T07:15:23.395 [INFO] ------------------------------------------------------------------------
2017-09-18T07:15:23.403 [ERROR] Failed to execute goal org.codehaus.mojo:exec-maven-plugin:1.5.0:exec (setuptools-test) on project beam-sdks-python: Command execution failed. Process exited with an error: 1 (Exit value: 1) -> [Help 1]
org.apache.maven.lifecycle.LifecycleExecutionException: Failed to execute goal org.codehaus.mojo:exec-maven-plugin:1.5.0:exec (setuptools-test) on project beam-sdks-python: Command execution failed.
at org.apache.maven.lifecycle.internal.MojoExecutor.execute(MojoExecutor.java:216)
at org.apache.maven.lifecycle.internal.MojoExecutor.execute(MojoExecutor.java:153)
at org.apache.maven.lifecycle.internal.MojoExecutor.execute(MojoExecutor.java:145)
at org.apache.maven.lifecycle.internal.LifecycleModuleBuilder.buildProject(LifecycleModuleBuilder.java:116)
at org.apache.maven.lifecycle.internal.LifecycleModuleBuilder.buildProject(LifecycleModuleBuilder.java:80)
at org.apache.maven.lifecycle.internal.builder.singlethreaded.SingleThreadedBuilder.build(SingleThreadedBuilder.java:51)
at org.apache.maven.lifecycle.internal.LifecycleStarter.execute(LifecycleStarter.java:128)
at org.apache.maven.DefaultMaven.doExecute(DefaultMaven.java:307)
at org.apache.maven.DefaultMaven.doExecute(DefaultMaven.java:193)
at org.apache.maven.DefaultMaven.execute(DefaultMaven.java:106)
at org.jvnet.hudson.maven3.launcher.Maven33Launcher.main(Maven33Launcher.java:129)
at sun.reflect.NativeMethodAccessorImpl.invoke0(Native Method)
at sun.reflect.NativeMethodAccessorImpl.invoke(NativeMethodAccessorImpl.java:62)
at sun.reflect.DelegatingMethodAccessorImpl.invoke(DelegatingMethodAccessorImpl.java:43)
at java.lang.reflect.Method.invoke(Method.java:498)
at org.codehaus.plexus.classworlds.launcher.Launcher.launchStandard(Launcher.java:330)
at org.codehaus.plexus.classworlds.launcher.Launcher.launch(Launcher.java:238)
at jenkins.maven3.agent.Maven33Main.launch(Maven33Main.java:176)
at sun.reflect.NativeMethodAccessorImpl.invoke0(Native Method)
at sun.reflect.NativeMethodAccessorImpl.invoke(NativeMethodAccessorImpl.java:62)
at sun.reflect.DelegatingMethodAccessorImpl.invoke(DelegatingMethodAccessorImpl.java:43)
at java.lang.reflect.Method.invoke(Method.java:498)
at hudson.maven.Maven3Builder.call(Maven3Builder.java:139)
at hudson.maven.Maven3Builder.call(Maven3Builder.java:70)
at hudson.remoting.UserRequest.perform(UserRequest.java:153)
at hudson.remoting.UserRequest.perform(UserRequest.java:50)
at hudson.remoting.Request$2.run(Request.java:336)
at hudson.remoting.InterceptingExecutorService$1.call(InterceptingExecutorService.java:68)
at java.util.concurrent.FutureTask.run(FutureTask.java:266)
at java.util.concurrent.ThreadPoolExecutor.runWorker(ThreadPoolExecutor.java:1149)
at java.util.concurrent.ThreadPoolExecutor$Worker.run(ThreadPoolExecutor.java:624)
at java.lang.Thread.run(Thread.java:748)
Caused by: org.apache.maven.plugin.MojoExecutionException: Command execution failed.
at org.codehaus.mojo.exec.ExecMojo.execute(ExecMojo.java:302)
at org.apache.maven.plugin.DefaultBuildPluginManager.executeMojo(DefaultBuildPluginManager.java:134)
at org.apache.maven.lifecycle.internal.MojoExecutor.execute(MojoExecutor.java:208)
... 31 more
Caused by: org.apache.commons.exec.ExecuteException: Process exited with an error: 1 (Exit value: 1)
at org.apache.commons.exec.DefaultExecutor.executeInternal(DefaultExecutor.java:404)
at org.apache.commons.exec.DefaultExecutor.execute(DefaultExecutor.java:166)
at org.codehaus.mojo.exec.ExecMojo.executeCommandLine(ExecMojo.java:764)
at org.codehaus.mojo.exec.ExecMojo.executeCommandLine(ExecMojo.java:711)
at org.codehaus.mojo.exec.ExecMojo.execute(ExecMojo.java:289)
... 33 more
2017-09-18T07:15:23.404 [ERROR]
2017-09-18T07:15:23.404 [ERROR] Re-run Maven using the -X switch to enable full debug logging.
2017-09-18T07:15:23.404 [ERROR]
2017-09-18T07:15:23.404 [ERROR] For more information about the errors and possible solutions, please read the following articles:
2017-09-18T07:15:23.404 [ERROR] [Help 1] http://cwiki.apache.org/confluence/display/MAVEN/MojoExecutionException
2017-09-18T07:15:23.404 [ERROR]
2017-09-18T07:15:23.404 [ERROR] After correcting the problems, you can resume the build with the command
2017-09-18T07:15:23.404 [ERROR] mvn <goals> -rf :beam-sdks-python
channel stopped
Build failed in Jenkins: beam_PostCommit_Java_MavenInstall #4816
Posted by Apache Jenkins Server <je...@builds.apache.org>.
See <https://builds.apache.org/job/beam_PostCommit_Java_MavenInstall/4816/display/redirect>
------------------------------------------
[...truncated 3.63 MB...]
File "<https://builds.apache.org/job/beam_PostCommit_Java_MavenInstall/ws/sdks/python/target/.tox/py27gcp/local/lib/python2.7/site-packages/apitools/base/protorpclite/message_types.py",> line 25, in <module>
from apitools.base.protorpclite import messages
File "<https://builds.apache.org/job/beam_PostCommit_Java_MavenInstall/ws/sdks/python/target/.tox/py27gcp/local/lib/python2.7/site-packages/apitools/base/protorpclite/messages.py",> line 1165, in <module>
class Field(six.with_metaclass(_FieldMeta, object)):
TypeError: Error when calling the metaclass bases
metaclass conflict: the metaclass of a derived class must be a (non-strict) subclass of the metaclasses of all its bases
ERROR: InvocationError: '<https://builds.apache.org/job/beam_PostCommit_Java_MavenInstall/ws/sdks/python/target/.tox/py27gcp/bin/python> apache_beam/examples/complete/autocomplete_test.py'
___________________________________ summary ____________________________________
ERROR: docs: commands failed
lint: commands succeeded
py27: commands succeeded
py27cython: commands succeeded
ERROR: py27gcp: commands failed
2017-09-18T19:36:14.056 [ERROR] Command execution failed.
org.apache.commons.exec.ExecuteException: Process exited with an error: 1 (Exit value: 1)
at org.apache.commons.exec.DefaultExecutor.executeInternal(DefaultExecutor.java:404)
at org.apache.commons.exec.DefaultExecutor.execute(DefaultExecutor.java:166)
at org.codehaus.mojo.exec.ExecMojo.executeCommandLine(ExecMojo.java:764)
at org.codehaus.mojo.exec.ExecMojo.executeCommandLine(ExecMojo.java:711)
at org.codehaus.mojo.exec.ExecMojo.execute(ExecMojo.java:289)
at org.apache.maven.plugin.DefaultBuildPluginManager.executeMojo(DefaultBuildPluginManager.java:134)
at org.apache.maven.lifecycle.internal.MojoExecutor.execute(MojoExecutor.java:208)
at org.apache.maven.lifecycle.internal.MojoExecutor.execute(MojoExecutor.java:153)
at org.apache.maven.lifecycle.internal.MojoExecutor.execute(MojoExecutor.java:145)
at org.apache.maven.lifecycle.internal.LifecycleModuleBuilder.buildProject(LifecycleModuleBuilder.java:116)
at org.apache.maven.lifecycle.internal.LifecycleModuleBuilder.buildProject(LifecycleModuleBuilder.java:80)
at org.apache.maven.lifecycle.internal.builder.singlethreaded.SingleThreadedBuilder.build(SingleThreadedBuilder.java:51)
at org.apache.maven.lifecycle.internal.LifecycleStarter.execute(LifecycleStarter.java:128)
at org.apache.maven.DefaultMaven.doExecute(DefaultMaven.java:307)
at org.apache.maven.DefaultMaven.doExecute(DefaultMaven.java:193)
at org.apache.maven.DefaultMaven.execute(DefaultMaven.java:106)
at org.jvnet.hudson.maven3.launcher.Maven33Launcher.main(Maven33Launcher.java:129)
at sun.reflect.NativeMethodAccessorImpl.invoke0(Native Method)
at sun.reflect.NativeMethodAccessorImpl.invoke(NativeMethodAccessorImpl.java:62)
at sun.reflect.DelegatingMethodAccessorImpl.invoke(DelegatingMethodAccessorImpl.java:43)
at java.lang.reflect.Method.invoke(Method.java:498)
at org.codehaus.plexus.classworlds.launcher.Launcher.launchStandard(Launcher.java:330)
at org.codehaus.plexus.classworlds.launcher.Launcher.launch(Launcher.java:238)
at jenkins.maven3.agent.Maven33Main.launch(Maven33Main.java:176)
at sun.reflect.NativeMethodAccessorImpl.invoke0(Native Method)
at sun.reflect.NativeMethodAccessorImpl.invoke(NativeMethodAccessorImpl.java:62)
at sun.reflect.DelegatingMethodAccessorImpl.invoke(DelegatingMethodAccessorImpl.java:43)
at java.lang.reflect.Method.invoke(Method.java:498)
at hudson.maven.Maven3Builder.call(Maven3Builder.java:139)
at hudson.maven.Maven3Builder.call(Maven3Builder.java:70)
at hudson.remoting.UserRequest.perform(UserRequest.java:153)
at hudson.remoting.UserRequest.perform(UserRequest.java:50)
at hudson.remoting.Request$2.run(Request.java:336)
at hudson.remoting.InterceptingExecutorService$1.call(InterceptingExecutorService.java:68)
at java.util.concurrent.FutureTask.run(FutureTask.java:266)
at java.util.concurrent.ThreadPoolExecutor.runWorker(ThreadPoolExecutor.java:1149)
at java.util.concurrent.ThreadPoolExecutor$Worker.run(ThreadPoolExecutor.java:624)
at java.lang.Thread.run(Thread.java:748)
[JENKINS] Archiving disabled
2017-09-18T19:36:14.985 [INFO]
2017-09-18T19:36:14.985 [INFO] ------------------------------------------------------------------------
2017-09-18T19:36:14.985 [INFO] Skipping Apache Beam :: Parent
2017-09-18T19:36:14.985 [INFO] This project has been banned from the build due to previous failures.
2017-09-18T19:36:14.985 [INFO] ------------------------------------------------------------------------
[JENKINS] Archiving disabled
[JENKINS] Archiving disabled
[JENKINS] Archiving disabled
[JENKINS] Archiving disabled
[JENKINS] Archiving disabled
[JENKINS] Archiving disabled
[JENKINS] Archiving disabled
[JENKINS] Archiving disabled
[JENKINS] Archiving disabled
[JENKINS] Archiving disabled
[JENKINS] Archiving disabled
[JENKINS] Archiving disabled
[JENKINS] Archiving disabled
[JENKINS] Archiving disabled
[JENKINS] Archiving disabled
[JENKINS] Archiving disabled
[JENKINS] Archiving disabled
[JENKINS] Archiving disabled
[JENKINS] Archiving disabled
[JENKINS] Archiving disabled
[JENKINS] Archiving disabled
[JENKINS] Archiving disabled
[JENKINS] Archiving disabled
[JENKINS] Archiving disabled
[JENKINS] Archiving disabled
[JENKINS] Archiving disabled
[JENKINS] Archiving disabled
[JENKINS] Archiving disabled
[JENKINS] Archiving disabled
[JENKINS] Archiving disabled
[JENKINS] Archiving disabled
[JENKINS] Archiving disabled
[JENKINS] Archiving disabled
[JENKINS] Archiving disabled
[JENKINS] Archiving disabled
[JENKINS] Archiving disabled
[JENKINS] Archiving disabled
[JENKINS] Archiving disabled
[JENKINS] Archiving disabled
[JENKINS] Archiving disabled
[JENKINS] Archiving disabled
[JENKINS] Archiving disabled
[JENKINS] Archiving disabled
[JENKINS] Archiving disabled
[JENKINS] Archiving disabled
[JENKINS] Archiving disabled
[JENKINS] Archiving disabled
[JENKINS] Archiving disabled
[JENKINS] Archiving disabled
[JENKINS] Archiving disabled
[JENKINS] Archiving disabled
[JENKINS] Archiving disabled
[JENKINS] Archiving disabled
[JENKINS] Archiving disabled
[JENKINS] Archiving disabled
[JENKINS] Archiving disabled
[JENKINS] Archiving disabled
[JENKINS] Archiving disabled
[JENKINS] Archiving disabled
[JENKINS] Archiving disabled
[JENKINS] Archiving disabled
[JENKINS] Archiving disabled
2017-09-18T19:37:18.506 [INFO] ------------------------------------------------------------------------
2017-09-18T19:37:18.506 [INFO] Reactor Summary:
2017-09-18T19:37:18.506 [INFO]
2017-09-18T19:37:18.506 [INFO] Apache Beam :: Parent .............................. SUCCESS [ 39.501 s]
2017-09-18T19:37:18.506 [INFO] Apache Beam :: SDKs :: Java :: Build Tools ......... SUCCESS [ 11.230 s]
2017-09-18T19:37:18.506 [INFO] Apache Beam :: SDKs ................................ SUCCESS [ 6.004 s]
2017-09-18T19:37:18.506 [INFO] Apache Beam :: SDKs :: Common ...................... SUCCESS [ 3.058 s]
2017-09-18T19:37:18.506 [INFO] Apache Beam :: SDKs :: Common :: Runner API ........ SUCCESS [ 37.146 s]
2017-09-18T19:37:18.506 [INFO] Apache Beam :: SDKs :: Common :: Fn API ............ SUCCESS [ 33.262 s]
2017-09-18T19:37:18.506 [INFO] Apache Beam :: SDKs :: Java ........................ SUCCESS [ 2.984 s]
2017-09-18T19:37:18.506 [INFO] Apache Beam :: SDKs :: Java :: Core ................ SUCCESS [02:53 min]
2017-09-18T19:37:18.506 [INFO] Apache Beam :: Runners ............................. SUCCESS [ 3.009 s]
2017-09-18T19:37:18.506 [INFO] Apache Beam :: Runners :: Core Construction Java ... SUCCESS [ 36.841 s]
2017-09-18T19:37:18.506 [INFO] Apache Beam :: Runners :: Core Java ................ SUCCESS [01:09 min]
2017-09-18T19:37:18.506 [INFO] Apache Beam :: Runners :: Direct Java .............. SUCCESS [05:03 min]
2017-09-18T19:37:18.506 [INFO] Apache Beam :: SDKs :: Java :: IO .................. SUCCESS [ 2.962 s]
2017-09-18T19:37:18.506 [INFO] Apache Beam :: SDKs :: Java :: IO :: AMQP .......... SUCCESS [ 41.510 s]
2017-09-18T19:37:18.506 [INFO] Apache Beam :: SDKs :: Java :: IO :: Common ........ SUCCESS [ 7.478 s]
2017-09-18T19:37:18.506 [INFO] Apache Beam :: SDKs :: Java :: IO :: Cassandra ..... SUCCESS [ 31.531 s]
2017-09-18T19:37:18.506 [INFO] Apache Beam :: SDKs :: Java :: IO :: Elasticsearch . SUCCESS [ 18.458 s]
2017-09-18T19:37:18.506 [INFO] Apache Beam :: SDKs :: Java :: IO :: Elasticsearch-Tests SUCCESS [ 4.508 s]
2017-09-18T19:37:18.506 [INFO] Apache Beam :: SDKs :: Java :: IO :: Elasticsearch-Tests :: Common SUCCESS [ 4.915 s]
2017-09-18T19:37:18.506 [INFO] Apache Beam :: SDKs :: Java :: IO :: Elasticsearch-Tests :: 2.x SUCCESS [ 28.702 s]
2017-09-18T19:37:18.506 [INFO] Apache Beam :: SDKs :: Java :: IO :: Elasticsearch-Tests :: 5.x SUCCESS [ 38.000 s]
2017-09-18T19:37:18.506 [INFO] Apache Beam :: SDKs :: Java :: Extensions .......... SUCCESS [ 2.958 s]
2017-09-18T19:37:18.506 [INFO] Apache Beam :: SDKs :: Java :: Extensions :: Google Cloud Platform Core SUCCESS [ 34.511 s]
2017-09-18T19:37:18.507 [INFO] Apache Beam :: SDKs :: Java :: Extensions :: Protobuf SUCCESS [ 36.153 s]
2017-09-18T19:37:18.507 [INFO] Apache Beam :: SDKs :: Java :: IO :: Google Cloud Platform SUCCESS [01:47 min]
2017-09-18T19:37:18.507 [INFO] Apache Beam :: SDKs :: Java :: IO :: Hadoop Common . SUCCESS [ 27.201 s]
2017-09-18T19:37:18.507 [INFO] Apache Beam :: SDKs :: Java :: IO :: Hadoop File System SUCCESS [ 54.899 s]
2017-09-18T19:37:18.507 [INFO] Apache Beam :: SDKs :: Java :: IO :: Hadoop ........ SUCCESS [ 5.407 s]
2017-09-18T19:37:18.507 [INFO] Apache Beam :: SDKs :: Java :: IO :: Hadoop :: input-format SUCCESS [ 27.772 s]
2017-09-18T19:37:18.507 [INFO] Apache Beam :: Runners :: Google Cloud Dataflow .... SUCCESS [06:39 min]
2017-09-18T19:37:18.507 [INFO] Apache Beam :: SDKs :: Java :: IO :: Hadoop :: jdk1.8-tests SUCCESS [01:42 min]
2017-09-18T19:37:18.507 [INFO] Apache Beam :: SDKs :: Java :: IO :: HBase ......... SUCCESS [01:54 min]
2017-09-18T19:37:18.507 [INFO] Apache Beam :: SDKs :: Java :: IO :: HCatalog ...... SUCCESS [01:15 min]
2017-09-18T19:37:18.507 [INFO] Apache Beam :: SDKs :: Java :: IO :: JDBC .......... SUCCESS [ 43.768 s]
2017-09-18T19:37:18.507 [INFO] Apache Beam :: SDKs :: Java :: IO :: JMS ........... SUCCESS [ 26.124 s]
2017-09-18T19:37:18.507 [INFO] Apache Beam :: SDKs :: Java :: IO :: Kafka ......... SUCCESS [ 32.993 s]
2017-09-18T19:37:18.507 [INFO] Apache Beam :: SDKs :: Java :: IO :: Kinesis ....... SUCCESS [ 30.247 s]
2017-09-18T19:37:18.507 [INFO] Apache Beam :: SDKs :: Java :: IO :: MongoDB ....... SUCCESS [ 49.871 s]
2017-09-18T19:37:18.507 [INFO] Apache Beam :: SDKs :: Java :: IO :: MQTT .......... SUCCESS [ 35.711 s]
2017-09-18T19:37:18.507 [INFO] Apache Beam :: SDKs :: Java :: IO :: Solr .......... SUCCESS [ 50.024 s]
2017-09-18T19:37:18.507 [INFO] Apache Beam :: SDKs :: Java :: IO :: Tika .......... SUCCESS [ 38.625 s]
2017-09-18T19:37:18.507 [INFO] Apache Beam :: SDKs :: Java :: IO :: XML ........... SUCCESS [ 32.688 s]
2017-09-18T19:37:18.507 [INFO] Apache Beam :: SDKs :: Java :: Maven Archetypes .... SUCCESS [ 2.564 s]
2017-09-18T19:37:18.507 [INFO] Apache Beam :: SDKs :: Java :: Maven Archetypes :: Starter SUCCESS [ 15.628 s]
2017-09-18T19:37:18.507 [INFO] Apache Beam :: Examples ............................ SUCCESS [ 3.061 s]
2017-09-18T19:37:18.507 [INFO] Apache Beam :: Examples :: Java .................... SUCCESS [08:00 min]
2017-09-18T19:37:18.507 [INFO] Apache Beam :: SDKs :: Java :: Maven Archetypes :: Examples SUCCESS [ 54.258 s]
2017-09-18T19:37:18.507 [INFO] Apache Beam :: Examples :: Java 8 .................. SUCCESS [ 46.887 s]
2017-09-18T19:37:18.507 [INFO] Apache Beam :: SDKs :: Java :: Maven Archetypes :: Examples - Java 8 SUCCESS [ 43.796 s]
2017-09-18T19:37:18.507 [INFO] Apache Beam :: SDKs :: Java :: Extensions :: Jackson SUCCESS [ 24.352 s]
2017-09-18T19:37:18.507 [INFO] Apache Beam :: SDKs :: Java :: Extensions :: Join library SUCCESS [ 23.464 s]
2017-09-18T19:37:18.507 [INFO] Apache Beam :: SDKs :: Java :: Extensions :: Sorter SUCCESS [ 52.183 s]
2017-09-18T19:37:18.507 [INFO] Apache Beam :: SDKs :: Java :: Extensions :: SQL ... SUCCESS [01:17 min]
2017-09-18T19:37:18.507 [INFO] Apache Beam :: SDKs :: Java :: Nexmark ............. SUCCESS [01:25 min]
2017-09-18T19:37:18.507 [INFO] Apache Beam :: SDKs :: Java :: Harness ............. SUCCESS [ 47.904 s]
2017-09-18T19:37:18.507 [INFO] Apache Beam :: SDKs :: Java :: Java 8 Tests ........ SUCCESS [ 20.118 s]
2017-09-18T19:37:18.507 [INFO] Apache Beam :: SDKs :: Python ...................... FAILURE [27:03 min]
2017-09-18T19:37:18.507 [INFO] Apache Beam :: Runners :: Flink .................... SKIPPED
2017-09-18T19:37:18.507 [INFO] Apache Beam :: Runners :: Spark .................... SKIPPED
2017-09-18T19:37:18.507 [INFO] Apache Beam :: Runners :: Apex ..................... SKIPPED
2017-09-18T19:37:18.507 [INFO] Apache Beam :: Runners :: Gearpump ................. SKIPPED
2017-09-18T19:37:18.507 [INFO] Apache Beam :: SDKs :: Java :: Aggregated Javadoc .. SKIPPED
2017-09-18T19:37:18.507 [INFO] ------------------------------------------------------------------------
2017-09-18T19:37:18.507 [INFO] BUILD FAILURE
2017-09-18T19:37:18.507 [INFO] ------------------------------------------------------------------------
2017-09-18T19:37:18.507 [INFO] Total time: 01:23 h
2017-09-18T19:37:18.508 [INFO] Finished at: 2017-09-18T19:37:18+00:00
2017-09-18T19:37:19.353 [INFO] Final Memory: 315M/1953M
2017-09-18T19:37:19.353 [INFO] ------------------------------------------------------------------------
2017-09-18T19:37:19.360 [ERROR] Failed to execute goal org.codehaus.mojo:exec-maven-plugin:1.5.0:exec (setuptools-test) on project beam-sdks-python: Command execution failed. Process exited with an error: 1 (Exit value: 1) -> [Help 1]
org.apache.maven.lifecycle.LifecycleExecutionException: Failed to execute goal org.codehaus.mojo:exec-maven-plugin:1.5.0:exec (setuptools-test) on project beam-sdks-python: Command execution failed.
at org.apache.maven.lifecycle.internal.MojoExecutor.execute(MojoExecutor.java:216)
at org.apache.maven.lifecycle.internal.MojoExecutor.execute(MojoExecutor.java:153)
at org.apache.maven.lifecycle.internal.MojoExecutor.execute(MojoExecutor.java:145)
at org.apache.maven.lifecycle.internal.LifecycleModuleBuilder.buildProject(LifecycleModuleBuilder.java:116)
at org.apache.maven.lifecycle.internal.LifecycleModuleBuilder.buildProject(LifecycleModuleBuilder.java:80)
at org.apache.maven.lifecycle.internal.builder.singlethreaded.SingleThreadedBuilder.build(SingleThreadedBuilder.java:51)
at org.apache.maven.lifecycle.internal.LifecycleStarter.execute(LifecycleStarter.java:128)
at org.apache.maven.DefaultMaven.doExecute(DefaultMaven.java:307)
at org.apache.maven.DefaultMaven.doExecute(DefaultMaven.java:193)
at org.apache.maven.DefaultMaven.execute(DefaultMaven.java:106)
at org.jvnet.hudson.maven3.launcher.Maven33Launcher.main(Maven33Launcher.java:129)
at sun.reflect.NativeMethodAccessorImpl.invoke0(Native Method)
at sun.reflect.NativeMethodAccessorImpl.invoke(NativeMethodAccessorImpl.java:62)
at sun.reflect.DelegatingMethodAccessorImpl.invoke(DelegatingMethodAccessorImpl.java:43)
at java.lang.reflect.Method.invoke(Method.java:498)
at org.codehaus.plexus.classworlds.launcher.Launcher.launchStandard(Launcher.java:330)
at org.codehaus.plexus.classworlds.launcher.Launcher.launch(Launcher.java:238)
at jenkins.maven3.agent.Maven33Main.launch(Maven33Main.java:176)
at sun.reflect.NativeMethodAccessorImpl.invoke0(Native Method)
at sun.reflect.NativeMethodAccessorImpl.invoke(NativeMethodAccessorImpl.java:62)
at sun.reflect.DelegatingMethodAccessorImpl.invoke(DelegatingMethodAccessorImpl.java:43)
at java.lang.reflect.Method.invoke(Method.java:498)
at hudson.maven.Maven3Builder.call(Maven3Builder.java:139)
at hudson.maven.Maven3Builder.call(Maven3Builder.java:70)
at hudson.remoting.UserRequest.perform(UserRequest.java:153)
at hudson.remoting.UserRequest.perform(UserRequest.java:50)
at hudson.remoting.Request$2.run(Request.java:336)
at hudson.remoting.InterceptingExecutorService$1.call(InterceptingExecutorService.java:68)
at java.util.concurrent.FutureTask.run(FutureTask.java:266)
at java.util.concurrent.ThreadPoolExecutor.runWorker(ThreadPoolExecutor.java:1149)
at java.util.concurrent.ThreadPoolExecutor$Worker.run(ThreadPoolExecutor.java:624)
at java.lang.Thread.run(Thread.java:748)
Caused by: org.apache.maven.plugin.MojoExecutionException: Command execution failed.
at org.codehaus.mojo.exec.ExecMojo.execute(ExecMojo.java:302)
at org.apache.maven.plugin.DefaultBuildPluginManager.executeMojo(DefaultBuildPluginManager.java:134)
at org.apache.maven.lifecycle.internal.MojoExecutor.execute(MojoExecutor.java:208)
... 31 more
Caused by: org.apache.commons.exec.ExecuteException: Process exited with an error: 1 (Exit value: 1)
at org.apache.commons.exec.DefaultExecutor.executeInternal(DefaultExecutor.java:404)
at org.apache.commons.exec.DefaultExecutor.execute(DefaultExecutor.java:166)
at org.codehaus.mojo.exec.ExecMojo.executeCommandLine(ExecMojo.java:764)
at org.codehaus.mojo.exec.ExecMojo.executeCommandLine(ExecMojo.java:711)
at org.codehaus.mojo.exec.ExecMojo.execute(ExecMojo.java:289)
... 33 more
2017-09-18T19:37:19.361 [ERROR]
2017-09-18T19:37:19.361 [ERROR] Re-run Maven using the -X switch to enable full debug logging.
2017-09-18T19:37:19.361 [ERROR]
2017-09-18T19:37:19.361 [ERROR] For more information about the errors and possible solutions, please read the following articles:
2017-09-18T19:37:19.361 [ERROR] [Help 1] http://cwiki.apache.org/confluence/display/MAVEN/MojoExecutionException
2017-09-18T19:37:19.361 [ERROR]
2017-09-18T19:37:19.361 [ERROR] After correcting the problems, you can resume the build with the command
2017-09-18T19:37:19.361 [ERROR] mvn <goals> -rf :beam-sdks-python
channel stopped
Not sending mail to unregistered user echauchot@gmail.com+jbonofre@apache.org
Build failed in Jenkins: beam_PostCommit_Java_MavenInstall #4815
Posted by Apache Jenkins Server <je...@builds.apache.org>.
See <https://builds.apache.org/job/beam_PostCommit_Java_MavenInstall/4815/display/redirect?page=changes>
Changes:
[echauchot] [BEAM-2957] Fix flaky ElasticsearchIOTest.testSplit in
------------------------------------------
[...truncated 3.63 MB...]
File "<https://builds.apache.org/job/beam_PostCommit_Java_MavenInstall/ws/sdks/python/target/.tox/py27gcp/local/lib/python2.7/site-packages/apitools/base/protorpclite/message_types.py",> line 25, in <module>
from apitools.base.protorpclite import messages
File "<https://builds.apache.org/job/beam_PostCommit_Java_MavenInstall/ws/sdks/python/target/.tox/py27gcp/local/lib/python2.7/site-packages/apitools/base/protorpclite/messages.py",> line 1165, in <module>
class Field(six.with_metaclass(_FieldMeta, object)):
TypeError: Error when calling the metaclass bases
metaclass conflict: the metaclass of a derived class must be a (non-strict) subclass of the metaclasses of all its bases
ERROR: InvocationError: '<https://builds.apache.org/job/beam_PostCommit_Java_MavenInstall/ws/sdks/python/target/.tox/py27gcp/bin/python> apache_beam/examples/complete/autocomplete_test.py'
___________________________________ summary ____________________________________
ERROR: docs: commands failed
lint: commands succeeded
py27: commands succeeded
py27cython: commands succeeded
ERROR: py27gcp: commands failed
2017-09-18T13:49:02.472 [ERROR] Command execution failed.
org.apache.commons.exec.ExecuteException: Process exited with an error: 1 (Exit value: 1)
at org.apache.commons.exec.DefaultExecutor.executeInternal(DefaultExecutor.java:404)
at org.apache.commons.exec.DefaultExecutor.execute(DefaultExecutor.java:166)
at org.codehaus.mojo.exec.ExecMojo.executeCommandLine(ExecMojo.java:764)
at org.codehaus.mojo.exec.ExecMojo.executeCommandLine(ExecMojo.java:711)
at org.codehaus.mojo.exec.ExecMojo.execute(ExecMojo.java:289)
at org.apache.maven.plugin.DefaultBuildPluginManager.executeMojo(DefaultBuildPluginManager.java:134)
at org.apache.maven.lifecycle.internal.MojoExecutor.execute(MojoExecutor.java:208)
at org.apache.maven.lifecycle.internal.MojoExecutor.execute(MojoExecutor.java:153)
at org.apache.maven.lifecycle.internal.MojoExecutor.execute(MojoExecutor.java:145)
at org.apache.maven.lifecycle.internal.LifecycleModuleBuilder.buildProject(LifecycleModuleBuilder.java:116)
at org.apache.maven.lifecycle.internal.LifecycleModuleBuilder.buildProject(LifecycleModuleBuilder.java:80)
at org.apache.maven.lifecycle.internal.builder.singlethreaded.SingleThreadedBuilder.build(SingleThreadedBuilder.java:51)
at org.apache.maven.lifecycle.internal.LifecycleStarter.execute(LifecycleStarter.java:128)
at org.apache.maven.DefaultMaven.doExecute(DefaultMaven.java:307)
at org.apache.maven.DefaultMaven.doExecute(DefaultMaven.java:193)
at org.apache.maven.DefaultMaven.execute(DefaultMaven.java:106)
at org.jvnet.hudson.maven3.launcher.Maven33Launcher.main(Maven33Launcher.java:129)
at sun.reflect.NativeMethodAccessorImpl.invoke0(Native Method)
at sun.reflect.NativeMethodAccessorImpl.invoke(NativeMethodAccessorImpl.java:62)
at sun.reflect.DelegatingMethodAccessorImpl.invoke(DelegatingMethodAccessorImpl.java:43)
at java.lang.reflect.Method.invoke(Method.java:498)
at org.codehaus.plexus.classworlds.launcher.Launcher.launchStandard(Launcher.java:330)
at org.codehaus.plexus.classworlds.launcher.Launcher.launch(Launcher.java:238)
at jenkins.maven3.agent.Maven33Main.launch(Maven33Main.java:176)
at sun.reflect.NativeMethodAccessorImpl.invoke0(Native Method)
at sun.reflect.NativeMethodAccessorImpl.invoke(NativeMethodAccessorImpl.java:62)
at sun.reflect.DelegatingMethodAccessorImpl.invoke(DelegatingMethodAccessorImpl.java:43)
at java.lang.reflect.Method.invoke(Method.java:498)
at hudson.maven.Maven3Builder.call(Maven3Builder.java:139)
at hudson.maven.Maven3Builder.call(Maven3Builder.java:70)
at hudson.remoting.UserRequest.perform(UserRequest.java:153)
at hudson.remoting.UserRequest.perform(UserRequest.java:50)
at hudson.remoting.Request$2.run(Request.java:336)
at hudson.remoting.InterceptingExecutorService$1.call(InterceptingExecutorService.java:68)
at java.util.concurrent.FutureTask.run(FutureTask.java:266)
at java.util.concurrent.ThreadPoolExecutor.runWorker(ThreadPoolExecutor.java:1149)
at java.util.concurrent.ThreadPoolExecutor$Worker.run(ThreadPoolExecutor.java:624)
at java.lang.Thread.run(Thread.java:748)
[JENKINS] Archiving disabled
2017-09-18T13:49:03.420 [INFO]
2017-09-18T13:49:03.420 [INFO] ------------------------------------------------------------------------
2017-09-18T13:49:03.420 [INFO] Skipping Apache Beam :: Parent
2017-09-18T13:49:03.420 [INFO] This project has been banned from the build due to previous failures.
2017-09-18T13:49:03.420 [INFO] ------------------------------------------------------------------------
[JENKINS] Archiving disabled
[JENKINS] Archiving disabled
[JENKINS] Archiving disabled
[JENKINS] Archiving disabled
[JENKINS] Archiving disabled
[JENKINS] Archiving disabled
[JENKINS] Archiving disabled
[JENKINS] Archiving disabled
[JENKINS] Archiving disabled
[JENKINS] Archiving disabled
[JENKINS] Archiving disabled
[JENKINS] Archiving disabled
[JENKINS] Archiving disabled
[JENKINS] Archiving disabled
[JENKINS] Archiving disabled
[JENKINS] Archiving disabled
[JENKINS] Archiving disabled
[JENKINS] Archiving disabled
[JENKINS] Archiving disabled
[JENKINS] Archiving disabled
[JENKINS] Archiving disabled
[JENKINS] Archiving disabled
[JENKINS] Archiving disabled
[JENKINS] Archiving disabled
[JENKINS] Archiving disabled
[JENKINS] Archiving disabled
[JENKINS] Archiving disabled
[JENKINS] Archiving disabled
[JENKINS] Archiving disabled
[JENKINS] Archiving disabled
[JENKINS] Archiving disabled
[JENKINS] Archiving disabled
[JENKINS] Archiving disabled
[JENKINS] Archiving disabled
[JENKINS] Archiving disabled
[JENKINS] Archiving disabled
[JENKINS] Archiving disabled
[JENKINS] Archiving disabled
[JENKINS] Archiving disabled
[JENKINS] Archiving disabled
[JENKINS] Archiving disabled
[JENKINS] Archiving disabled
[JENKINS] Archiving disabled
[JENKINS] Archiving disabled
[JENKINS] Archiving disabled
[JENKINS] Archiving disabled
[JENKINS] Archiving disabled
[JENKINS] Archiving disabled
[JENKINS] Archiving disabled
[JENKINS] Archiving disabled
[JENKINS] Archiving disabled
[JENKINS] Archiving disabled
[JENKINS] Archiving disabled
[JENKINS] Archiving disabled
[JENKINS] Archiving disabled
[JENKINS] Archiving disabled
[JENKINS] Archiving disabled
[JENKINS] Archiving disabled
[JENKINS] Archiving disabled
[JENKINS] Archiving disabled
[JENKINS] Archiving disabled
[JENKINS] Archiving disabled
2017-09-18T13:49:56.403 [INFO] ------------------------------------------------------------------------
2017-09-18T13:49:56.403 [INFO] Reactor Summary:
2017-09-18T13:49:56.403 [INFO]
2017-09-18T13:49:56.403 [INFO] Apache Beam :: Parent .............................. SUCCESS [ 31.871 s]
2017-09-18T13:49:56.403 [INFO] Apache Beam :: SDKs :: Java :: Build Tools ......... SUCCESS [ 10.638 s]
2017-09-18T13:49:56.403 [INFO] Apache Beam :: SDKs ................................ SUCCESS [ 5.830 s]
2017-09-18T13:49:56.403 [INFO] Apache Beam :: SDKs :: Common ...................... SUCCESS [ 2.892 s]
2017-09-18T13:49:56.403 [INFO] Apache Beam :: SDKs :: Common :: Runner API ........ SUCCESS [ 25.713 s]
2017-09-18T13:49:56.403 [INFO] Apache Beam :: SDKs :: Common :: Fn API ............ SUCCESS [ 16.087 s]
2017-09-18T13:49:56.404 [INFO] Apache Beam :: SDKs :: Java ........................ SUCCESS [ 3.027 s]
2017-09-18T13:49:56.404 [INFO] Apache Beam :: SDKs :: Java :: Core ................ SUCCESS [02:08 min]
2017-09-18T13:49:56.404 [INFO] Apache Beam :: Runners ............................. SUCCESS [ 3.395 s]
2017-09-18T13:49:56.404 [INFO] Apache Beam :: Runners :: Core Construction Java ... SUCCESS [ 25.198 s]
2017-09-18T13:49:56.404 [INFO] Apache Beam :: Runners :: Core Java ................ SUCCESS [ 41.184 s]
2017-09-18T13:49:56.404 [INFO] Apache Beam :: Runners :: Direct Java .............. SUCCESS [03:56 min]
2017-09-18T13:49:56.404 [INFO] Apache Beam :: SDKs :: Java :: IO .................. SUCCESS [ 3.078 s]
2017-09-18T13:49:56.404 [INFO] Apache Beam :: SDKs :: Java :: IO :: AMQP .......... SUCCESS [ 45.726 s]
2017-09-18T13:49:56.404 [INFO] Apache Beam :: SDKs :: Java :: IO :: Common ........ SUCCESS [ 7.134 s]
2017-09-18T13:49:56.404 [INFO] Apache Beam :: SDKs :: Java :: IO :: Cassandra ..... SUCCESS [ 30.483 s]
2017-09-18T13:49:56.404 [INFO] Apache Beam :: SDKs :: Java :: IO :: Elasticsearch . SUCCESS [ 26.529 s]
2017-09-18T13:49:56.404 [INFO] Apache Beam :: SDKs :: Java :: IO :: Elasticsearch-Tests SUCCESS [ 4.262 s]
2017-09-18T13:49:56.404 [INFO] Apache Beam :: SDKs :: Java :: IO :: Elasticsearch-Tests :: Common SUCCESS [ 4.687 s]
2017-09-18T13:49:56.404 [INFO] Apache Beam :: SDKs :: Java :: IO :: Elasticsearch-Tests :: 2.x SUCCESS [ 27.579 s]
2017-09-18T13:49:56.404 [INFO] Apache Beam :: SDKs :: Java :: IO :: Elasticsearch-Tests :: 5.x SUCCESS [ 42.971 s]
2017-09-18T13:49:56.404 [INFO] Apache Beam :: SDKs :: Java :: Extensions .......... SUCCESS [ 3.066 s]
2017-09-18T13:49:56.404 [INFO] Apache Beam :: SDKs :: Java :: Extensions :: Google Cloud Platform Core SUCCESS [ 35.236 s]
2017-09-18T13:49:56.404 [INFO] Apache Beam :: SDKs :: Java :: Extensions :: Protobuf SUCCESS [ 23.391 s]
2017-09-18T13:49:56.404 [INFO] Apache Beam :: SDKs :: Java :: IO :: Google Cloud Platform SUCCESS [01:42 min]
2017-09-18T13:49:56.404 [INFO] Apache Beam :: SDKs :: Java :: IO :: Hadoop Common . SUCCESS [ 38.411 s]
2017-09-18T13:49:56.404 [INFO] Apache Beam :: SDKs :: Java :: IO :: Hadoop File System SUCCESS [01:02 min]
2017-09-18T13:49:56.404 [INFO] Apache Beam :: SDKs :: Java :: IO :: Hadoop ........ SUCCESS [ 5.240 s]
2017-09-18T13:49:56.404 [INFO] Apache Beam :: SDKs :: Java :: IO :: Hadoop :: input-format SUCCESS [ 30.893 s]
2017-09-18T13:49:56.404 [INFO] Apache Beam :: Runners :: Google Cloud Dataflow .... SUCCESS [07:23 min]
2017-09-18T13:49:56.404 [INFO] Apache Beam :: SDKs :: Java :: IO :: Hadoop :: jdk1.8-tests SUCCESS [01:45 min]
2017-09-18T13:49:56.404 [INFO] Apache Beam :: SDKs :: Java :: IO :: HBase ......... SUCCESS [01:37 min]
2017-09-18T13:49:56.404 [INFO] Apache Beam :: SDKs :: Java :: IO :: HCatalog ...... SUCCESS [01:30 min]
2017-09-18T13:49:56.404 [INFO] Apache Beam :: SDKs :: Java :: IO :: JDBC .......... SUCCESS [ 45.757 s]
2017-09-18T13:49:56.404 [INFO] Apache Beam :: SDKs :: Java :: IO :: JMS ........... SUCCESS [ 28.124 s]
2017-09-18T13:49:56.404 [INFO] Apache Beam :: SDKs :: Java :: IO :: Kafka ......... SUCCESS [ 41.275 s]
2017-09-18T13:49:56.404 [INFO] Apache Beam :: SDKs :: Java :: IO :: Kinesis ....... SUCCESS [ 31.176 s]
2017-09-18T13:49:56.404 [INFO] Apache Beam :: SDKs :: Java :: IO :: MongoDB ....... SUCCESS [ 48.955 s]
2017-09-18T13:49:56.404 [INFO] Apache Beam :: SDKs :: Java :: IO :: MQTT .......... SUCCESS [ 34.762 s]
2017-09-18T13:49:56.404 [INFO] Apache Beam :: SDKs :: Java :: IO :: Solr .......... SUCCESS [ 49.039 s]
2017-09-18T13:49:56.404 [INFO] Apache Beam :: SDKs :: Java :: IO :: Tika .......... SUCCESS [ 39.766 s]
2017-09-18T13:49:56.404 [INFO] Apache Beam :: SDKs :: Java :: IO :: XML ........... SUCCESS [ 35.734 s]
2017-09-18T13:49:56.404 [INFO] Apache Beam :: SDKs :: Java :: Maven Archetypes .... SUCCESS [ 2.560 s]
2017-09-18T13:49:56.404 [INFO] Apache Beam :: SDKs :: Java :: Maven Archetypes :: Starter SUCCESS [ 17.672 s]
2017-09-18T13:49:56.404 [INFO] Apache Beam :: Examples ............................ SUCCESS [ 2.976 s]
2017-09-18T13:49:56.404 [INFO] Apache Beam :: Examples :: Java .................... SUCCESS [07:30 min]
2017-09-18T13:49:56.404 [INFO] Apache Beam :: SDKs :: Java :: Maven Archetypes :: Examples SUCCESS [01:00 min]
2017-09-18T13:49:56.404 [INFO] Apache Beam :: Examples :: Java 8 .................. SUCCESS [ 46.473 s]
2017-09-18T13:49:56.404 [INFO] Apache Beam :: SDKs :: Java :: Maven Archetypes :: Examples - Java 8 SUCCESS [ 46.946 s]
2017-09-18T13:49:56.404 [INFO] Apache Beam :: SDKs :: Java :: Extensions :: Jackson SUCCESS [ 24.477 s]
2017-09-18T13:49:56.404 [INFO] Apache Beam :: SDKs :: Java :: Extensions :: Join library SUCCESS [ 26.232 s]
2017-09-18T13:49:56.404 [INFO] Apache Beam :: SDKs :: Java :: Extensions :: Sorter SUCCESS [ 55.914 s]
2017-09-18T13:49:56.405 [INFO] Apache Beam :: SDKs :: Java :: Extensions :: SQL ... SUCCESS [01:10 min]
2017-09-18T13:49:56.405 [INFO] Apache Beam :: SDKs :: Java :: Nexmark ............. SUCCESS [01:31 min]
2017-09-18T13:49:56.405 [INFO] Apache Beam :: SDKs :: Java :: Harness ............. SUCCESS [ 45.796 s]
2017-09-18T13:49:56.405 [INFO] Apache Beam :: SDKs :: Java :: Java 8 Tests ........ SUCCESS [ 21.990 s]
2017-09-18T13:49:56.405 [INFO] Apache Beam :: SDKs :: Python ...................... FAILURE [26:06 min]
2017-09-18T13:49:56.405 [INFO] Apache Beam :: Runners :: Flink .................... SKIPPED
2017-09-18T13:49:56.405 [INFO] Apache Beam :: Runners :: Spark .................... SKIPPED
2017-09-18T13:49:56.405 [INFO] Apache Beam :: Runners :: Apex ..................... SKIPPED
2017-09-18T13:49:56.405 [INFO] Apache Beam :: Runners :: Gearpump ................. SKIPPED
2017-09-18T13:49:56.405 [INFO] Apache Beam :: SDKs :: Java :: Aggregated Javadoc .. SKIPPED
2017-09-18T13:49:56.405 [INFO] ------------------------------------------------------------------------
2017-09-18T13:49:56.405 [INFO] BUILD FAILURE
2017-09-18T13:49:56.405 [INFO] ------------------------------------------------------------------------
2017-09-18T13:49:56.405 [INFO] Total time: 01:19 h
2017-09-18T13:49:56.405 [INFO] Finished at: 2017-09-18T13:49:56+00:00
2017-09-18T13:49:57.552 [INFO] Final Memory: 328M/2134M
2017-09-18T13:49:57.553 [INFO] ------------------------------------------------------------------------
2017-09-18T13:49:57.563 [ERROR] Failed to execute goal org.codehaus.mojo:exec-maven-plugin:1.5.0:exec (setuptools-test) on project beam-sdks-python: Command execution failed. Process exited with an error: 1 (Exit value: 1) -> [Help 1]
org.apache.maven.lifecycle.LifecycleExecutionException: Failed to execute goal org.codehaus.mojo:exec-maven-plugin:1.5.0:exec (setuptools-test) on project beam-sdks-python: Command execution failed.
at org.apache.maven.lifecycle.internal.MojoExecutor.execute(MojoExecutor.java:216)
at org.apache.maven.lifecycle.internal.MojoExecutor.execute(MojoExecutor.java:153)
at org.apache.maven.lifecycle.internal.MojoExecutor.execute(MojoExecutor.java:145)
at org.apache.maven.lifecycle.internal.LifecycleModuleBuilder.buildProject(LifecycleModuleBuilder.java:116)
at org.apache.maven.lifecycle.internal.LifecycleModuleBuilder.buildProject(LifecycleModuleBuilder.java:80)
at org.apache.maven.lifecycle.internal.builder.singlethreaded.SingleThreadedBuilder.build(SingleThreadedBuilder.java:51)
at org.apache.maven.lifecycle.internal.LifecycleStarter.execute(LifecycleStarter.java:128)
at org.apache.maven.DefaultMaven.doExecute(DefaultMaven.java:307)
at org.apache.maven.DefaultMaven.doExecute(DefaultMaven.java:193)
at org.apache.maven.DefaultMaven.execute(DefaultMaven.java:106)
at org.jvnet.hudson.maven3.launcher.Maven33Launcher.main(Maven33Launcher.java:129)
at sun.reflect.NativeMethodAccessorImpl.invoke0(Native Method)
at sun.reflect.NativeMethodAccessorImpl.invoke(NativeMethodAccessorImpl.java:62)
at sun.reflect.DelegatingMethodAccessorImpl.invoke(DelegatingMethodAccessorImpl.java:43)
at java.lang.reflect.Method.invoke(Method.java:498)
at org.codehaus.plexus.classworlds.launcher.Launcher.launchStandard(Launcher.java:330)
at org.codehaus.plexus.classworlds.launcher.Launcher.launch(Launcher.java:238)
at jenkins.maven3.agent.Maven33Main.launch(Maven33Main.java:176)
at sun.reflect.NativeMethodAccessorImpl.invoke0(Native Method)
at sun.reflect.NativeMethodAccessorImpl.invoke(NativeMethodAccessorImpl.java:62)
at sun.reflect.DelegatingMethodAccessorImpl.invoke(DelegatingMethodAccessorImpl.java:43)
at java.lang.reflect.Method.invoke(Method.java:498)
at hudson.maven.Maven3Builder.call(Maven3Builder.java:139)
at hudson.maven.Maven3Builder.call(Maven3Builder.java:70)
at hudson.remoting.UserRequest.perform(UserRequest.java:153)
at hudson.remoting.UserRequest.perform(UserRequest.java:50)
at hudson.remoting.Request$2.run(Request.java:336)
at hudson.remoting.InterceptingExecutorService$1.call(InterceptingExecutorService.java:68)
at java.util.concurrent.FutureTask.run(FutureTask.java:266)
at java.util.concurrent.ThreadPoolExecutor.runWorker(ThreadPoolExecutor.java:1149)
at java.util.concurrent.ThreadPoolExecutor$Worker.run(ThreadPoolExecutor.java:624)
at java.lang.Thread.run(Thread.java:748)
Caused by: org.apache.maven.plugin.MojoExecutionException: Command execution failed.
at org.codehaus.mojo.exec.ExecMojo.execute(ExecMojo.java:302)
at org.apache.maven.plugin.DefaultBuildPluginManager.executeMojo(DefaultBuildPluginManager.java:134)
at org.apache.maven.lifecycle.internal.MojoExecutor.execute(MojoExecutor.java:208)
... 31 more
Caused by: org.apache.commons.exec.ExecuteException: Process exited with an error: 1 (Exit value: 1)
at org.apache.commons.exec.DefaultExecutor.executeInternal(DefaultExecutor.java:404)
at org.apache.commons.exec.DefaultExecutor.execute(DefaultExecutor.java:166)
at org.codehaus.mojo.exec.ExecMojo.executeCommandLine(ExecMojo.java:764)
at org.codehaus.mojo.exec.ExecMojo.executeCommandLine(ExecMojo.java:711)
at org.codehaus.mojo.exec.ExecMojo.execute(ExecMojo.java:289)
... 33 more
2017-09-18T13:49:57.563 [ERROR]
2017-09-18T13:49:57.563 [ERROR] Re-run Maven using the -X switch to enable full debug logging.
2017-09-18T13:49:57.563 [ERROR]
2017-09-18T13:49:57.564 [ERROR] For more information about the errors and possible solutions, please read the following articles:
2017-09-18T13:49:57.564 [ERROR] [Help 1] http://cwiki.apache.org/confluence/display/MAVEN/MojoExecutionException
2017-09-18T13:49:57.564 [ERROR]
2017-09-18T13:49:57.564 [ERROR] After correcting the problems, you can resume the build with the command
2017-09-18T13:49:57.564 [ERROR] mvn <goals> -rf :beam-sdks-python
channel stopped
Not sending mail to unregistered user echauchot@gmail.com+jbonofre@apache.org
Build failed in Jenkins: beam_PostCommit_Java_MavenInstall #4814
Posted by Apache Jenkins Server <je...@builds.apache.org>.
See <https://builds.apache.org/job/beam_PostCommit_Java_MavenInstall/4814/display/redirect>
------------------------------------------
[...truncated 3.63 MB...]
from apitools.base.protorpclite import message_types
File "<https://builds.apache.org/job/beam_PostCommit_Java_MavenInstall/ws/sdks/python/target/.tox/py27gcp/local/lib/python2.7/site-packages/apitools/base/protorpclite/message_types.py",> line 25, in <module>
from apitools.base.protorpclite import messages
File "<https://builds.apache.org/job/beam_PostCommit_Java_MavenInstall/ws/sdks/python/target/.tox/py27gcp/local/lib/python2.7/site-packages/apitools/base/protorpclite/messages.py",> line 1165, in <module>
class Field(six.with_metaclass(_FieldMeta, object)):
TypeError: Error when calling the metaclass bases
metaclass conflict: the metaclass of a derived class must be a (non-strict) subclass of the metaclasses of all its bases
ERROR: InvocationError: '<https://builds.apache.org/job/beam_PostCommit_Java_MavenInstall/ws/sdks/python/target/.tox/py27gcp/bin/python> apache_beam/examples/complete/autocomplete_test.py'
___________________________________ summary ____________________________________
ERROR: docs: commands failed
lint: commands succeeded
py27: commands succeeded
py27cython: commands succeeded
ERROR: py27gcp: commands failed
2017-09-18T13:17:10.064 [ERROR] Command execution failed.
org.apache.commons.exec.ExecuteException: Process exited with an error: 1 (Exit value: 1)
at org.apache.commons.exec.DefaultExecutor.executeInternal(DefaultExecutor.java:404)
at org.apache.commons.exec.DefaultExecutor.execute(DefaultExecutor.java:166)
at org.codehaus.mojo.exec.ExecMojo.executeCommandLine(ExecMojo.java:764)
at org.codehaus.mojo.exec.ExecMojo.executeCommandLine(ExecMojo.java:711)
at org.codehaus.mojo.exec.ExecMojo.execute(ExecMojo.java:289)
at org.apache.maven.plugin.DefaultBuildPluginManager.executeMojo(DefaultBuildPluginManager.java:134)
at org.apache.maven.lifecycle.internal.MojoExecutor.execute(MojoExecutor.java:208)
at org.apache.maven.lifecycle.internal.MojoExecutor.execute(MojoExecutor.java:153)
at org.apache.maven.lifecycle.internal.MojoExecutor.execute(MojoExecutor.java:145)
at org.apache.maven.lifecycle.internal.LifecycleModuleBuilder.buildProject(LifecycleModuleBuilder.java:116)
at org.apache.maven.lifecycle.internal.LifecycleModuleBuilder.buildProject(LifecycleModuleBuilder.java:80)
at org.apache.maven.lifecycle.internal.builder.singlethreaded.SingleThreadedBuilder.build(SingleThreadedBuilder.java:51)
at org.apache.maven.lifecycle.internal.LifecycleStarter.execute(LifecycleStarter.java:128)
at org.apache.maven.DefaultMaven.doExecute(DefaultMaven.java:307)
at org.apache.maven.DefaultMaven.doExecute(DefaultMaven.java:193)
at org.apache.maven.DefaultMaven.execute(DefaultMaven.java:106)
at org.jvnet.hudson.maven3.launcher.Maven33Launcher.main(Maven33Launcher.java:129)
at sun.reflect.NativeMethodAccessorImpl.invoke0(Native Method)
at sun.reflect.NativeMethodAccessorImpl.invoke(NativeMethodAccessorImpl.java:62)
at sun.reflect.DelegatingMethodAccessorImpl.invoke(DelegatingMethodAccessorImpl.java:43)
at java.lang.reflect.Method.invoke(Method.java:498)
at org.codehaus.plexus.classworlds.launcher.Launcher.launchStandard(Launcher.java:330)
at org.codehaus.plexus.classworlds.launcher.Launcher.launch(Launcher.java:238)
at jenkins.maven3.agent.Maven33Main.launch(Maven33Main.java:176)
at sun.reflect.NativeMethodAccessorImpl.invoke0(Native Method)
at sun.reflect.NativeMethodAccessorImpl.invoke(NativeMethodAccessorImpl.java:62)
at sun.reflect.DelegatingMethodAccessorImpl.invoke(DelegatingMethodAccessorImpl.java:43)
at java.lang.reflect.Method.invoke(Method.java:498)
at hudson.maven.Maven3Builder.call(Maven3Builder.java:139)
at hudson.maven.Maven3Builder.call(Maven3Builder.java:70)
at hudson.remoting.UserRequest.perform(UserRequest.java:153)
at hudson.remoting.UserRequest.perform(UserRequest.java:50)
at hudson.remoting.Request$2.run(Request.java:336)
at hudson.remoting.InterceptingExecutorService$1.call(InterceptingExecutorService.java:68)
at java.util.concurrent.FutureTask.run(FutureTask.java:266)
at java.util.concurrent.ThreadPoolExecutor.runWorker(ThreadPoolExecutor.java:1149)
at java.util.concurrent.ThreadPoolExecutor$Worker.run(ThreadPoolExecutor.java:624)
at java.lang.Thread.run(Thread.java:748)
[JENKINS] Archiving disabled
2017-09-18T13:17:11.060 [INFO]
2017-09-18T13:17:11.060 [INFO] ------------------------------------------------------------------------
2017-09-18T13:17:11.060 [INFO] Skipping Apache Beam :: Parent
2017-09-18T13:17:11.060 [INFO] This project has been banned from the build due to previous failures.
2017-09-18T13:17:11.060 [INFO] ------------------------------------------------------------------------
[JENKINS] Archiving disabled
[JENKINS] Archiving disabled
[JENKINS] Archiving disabled
[JENKINS] Archiving disabled
[JENKINS] Archiving disabled
[JENKINS] Archiving disabled
[JENKINS] Archiving disabled
[JENKINS] Archiving disabled
[JENKINS] Archiving disabled
[JENKINS] Archiving disabled
[JENKINS] Archiving disabled
[JENKINS] Archiving disabled
[JENKINS] Archiving disabled
[JENKINS] Archiving disabled
[JENKINS] Archiving disabled
[JENKINS] Archiving disabled
[JENKINS] Archiving disabled
[JENKINS] Archiving disabled
[JENKINS] Archiving disabled
[JENKINS] Archiving disabled
[JENKINS] Archiving disabled
[JENKINS] Archiving disabled
[JENKINS] Archiving disabled
[JENKINS] Archiving disabled
[JENKINS] Archiving disabled
[JENKINS] Archiving disabled
[JENKINS] Archiving disabled
[JENKINS] Archiving disabled
[JENKINS] Archiving disabled
[JENKINS] Archiving disabled
[JENKINS] Archiving disabled
[JENKINS] Archiving disabled
[JENKINS] Archiving disabled
[JENKINS] Archiving disabled
[JENKINS] Archiving disabled
[JENKINS] Archiving disabled
[JENKINS] Archiving disabled
[JENKINS] Archiving disabled
[JENKINS] Archiving disabled
[JENKINS] Archiving disabled
[JENKINS] Archiving disabled
[JENKINS] Archiving disabled
[JENKINS] Archiving disabled
[JENKINS] Archiving disabled
[JENKINS] Archiving disabled
[JENKINS] Archiving disabled
[JENKINS] Archiving disabled
[JENKINS] Archiving disabled
[JENKINS] Archiving disabled
[JENKINS] Archiving disabled
[JENKINS] Archiving disabled
[JENKINS] Archiving disabled
[JENKINS] Archiving disabled
[JENKINS] Archiving disabled
[JENKINS] Archiving disabled
[JENKINS] Archiving disabled
[JENKINS] Archiving disabled
[JENKINS] Archiving disabled
[JENKINS] Archiving disabled
[JENKINS] Archiving disabled
[JENKINS] Archiving disabled
[JENKINS] Archiving disabled
2017-09-18T13:18:05.244 [INFO] ------------------------------------------------------------------------
2017-09-18T13:18:05.244 [INFO] Reactor Summary:
2017-09-18T13:18:05.244 [INFO]
2017-09-18T13:18:05.244 [INFO] Apache Beam :: Parent .............................. SUCCESS [ 34.117 s]
2017-09-18T13:18:05.244 [INFO] Apache Beam :: SDKs :: Java :: Build Tools ......... SUCCESS [ 10.795 s]
2017-09-18T13:18:05.244 [INFO] Apache Beam :: SDKs ................................ SUCCESS [ 5.627 s]
2017-09-18T13:18:05.244 [INFO] Apache Beam :: SDKs :: Common ...................... SUCCESS [ 3.446 s]
2017-09-18T13:18:05.244 [INFO] Apache Beam :: SDKs :: Common :: Runner API ........ SUCCESS [ 30.660 s]
2017-09-18T13:18:05.244 [INFO] Apache Beam :: SDKs :: Common :: Fn API ............ SUCCESS [ 19.693 s]
2017-09-18T13:18:05.245 [INFO] Apache Beam :: SDKs :: Java ........................ SUCCESS [ 3.082 s]
2017-09-18T13:18:05.245 [INFO] Apache Beam :: SDKs :: Java :: Core ................ SUCCESS [03:18 min]
2017-09-18T13:18:05.245 [INFO] Apache Beam :: Runners ............................. SUCCESS [ 3.172 s]
2017-09-18T13:18:05.245 [INFO] Apache Beam :: Runners :: Core Construction Java ... SUCCESS [ 35.562 s]
2017-09-18T13:18:05.245 [INFO] Apache Beam :: Runners :: Core Java ................ SUCCESS [ 53.603 s]
2017-09-18T13:18:05.245 [INFO] Apache Beam :: Runners :: Direct Java .............. SUCCESS [04:25 min]
2017-09-18T13:18:05.245 [INFO] Apache Beam :: SDKs :: Java :: IO .................. SUCCESS [ 3.127 s]
2017-09-18T13:18:05.245 [INFO] Apache Beam :: SDKs :: Java :: IO :: AMQP .......... SUCCESS [ 38.196 s]
2017-09-18T13:18:05.245 [INFO] Apache Beam :: SDKs :: Java :: IO :: Common ........ SUCCESS [ 6.926 s]
2017-09-18T13:18:05.245 [INFO] Apache Beam :: SDKs :: Java :: IO :: Cassandra ..... SUCCESS [ 30.425 s]
2017-09-18T13:18:05.245 [INFO] Apache Beam :: SDKs :: Java :: IO :: Elasticsearch . SUCCESS [ 16.921 s]
2017-09-18T13:18:05.245 [INFO] Apache Beam :: SDKs :: Java :: IO :: Elasticsearch-Tests SUCCESS [ 15.911 s]
2017-09-18T13:18:05.245 [INFO] Apache Beam :: SDKs :: Java :: IO :: Elasticsearch-Tests :: Common SUCCESS [ 6.357 s]
2017-09-18T13:18:05.245 [INFO] Apache Beam :: SDKs :: Java :: IO :: Elasticsearch-Tests :: 2.x SUCCESS [ 27.573 s]
2017-09-18T13:18:05.245 [INFO] Apache Beam :: SDKs :: Java :: IO :: Elasticsearch-Tests :: 5.x SUCCESS [ 36.696 s]
2017-09-18T13:18:05.245 [INFO] Apache Beam :: SDKs :: Java :: Extensions .......... SUCCESS [ 2.903 s]
2017-09-18T13:18:05.245 [INFO] Apache Beam :: SDKs :: Java :: Extensions :: Google Cloud Platform Core SUCCESS [ 31.165 s]
2017-09-18T13:18:05.245 [INFO] Apache Beam :: SDKs :: Java :: Extensions :: Protobuf SUCCESS [ 24.878 s]
2017-09-18T13:18:05.245 [INFO] Apache Beam :: SDKs :: Java :: IO :: Google Cloud Platform SUCCESS [01:35 min]
2017-09-18T13:18:05.245 [INFO] Apache Beam :: SDKs :: Java :: IO :: Hadoop Common . SUCCESS [ 20.362 s]
2017-09-18T13:18:05.245 [INFO] Apache Beam :: SDKs :: Java :: IO :: Hadoop File System SUCCESS [ 35.276 s]
2017-09-18T13:18:05.245 [INFO] Apache Beam :: SDKs :: Java :: IO :: Hadoop ........ SUCCESS [ 5.668 s]
2017-09-18T13:18:05.245 [INFO] Apache Beam :: SDKs :: Java :: IO :: Hadoop :: input-format SUCCESS [ 19.984 s]
2017-09-18T13:18:05.245 [INFO] Apache Beam :: Runners :: Google Cloud Dataflow .... SUCCESS [07:08 min]
2017-09-18T13:18:05.245 [INFO] Apache Beam :: SDKs :: Java :: IO :: Hadoop :: jdk1.8-tests SUCCESS [01:35 min]
2017-09-18T13:18:05.245 [INFO] Apache Beam :: SDKs :: Java :: IO :: HBase ......... SUCCESS [01:36 min]
2017-09-18T13:18:05.245 [INFO] Apache Beam :: SDKs :: Java :: IO :: HCatalog ...... SUCCESS [01:08 min]
2017-09-18T13:18:05.245 [INFO] Apache Beam :: SDKs :: Java :: IO :: JDBC .......... SUCCESS [ 54.719 s]
2017-09-18T13:18:05.245 [INFO] Apache Beam :: SDKs :: Java :: IO :: JMS ........... SUCCESS [ 25.640 s]
2017-09-18T13:18:05.245 [INFO] Apache Beam :: SDKs :: Java :: IO :: Kafka ......... SUCCESS [ 32.814 s]
2017-09-18T13:18:05.245 [INFO] Apache Beam :: SDKs :: Java :: IO :: Kinesis ....... SUCCESS [ 28.117 s]
2017-09-18T13:18:05.245 [INFO] Apache Beam :: SDKs :: Java :: IO :: MongoDB ....... SUCCESS [ 45.090 s]
2017-09-18T13:18:05.245 [INFO] Apache Beam :: SDKs :: Java :: IO :: MQTT .......... SUCCESS [ 21.290 s]
2017-09-18T13:18:05.245 [INFO] Apache Beam :: SDKs :: Java :: IO :: Solr .......... SUCCESS [ 41.273 s]
2017-09-18T13:18:05.245 [INFO] Apache Beam :: SDKs :: Java :: IO :: Tika .......... SUCCESS [ 34.617 s]
2017-09-18T13:18:05.245 [INFO] Apache Beam :: SDKs :: Java :: IO :: XML ........... SUCCESS [ 32.832 s]
2017-09-18T13:18:05.245 [INFO] Apache Beam :: SDKs :: Java :: Maven Archetypes .... SUCCESS [ 2.735 s]
2017-09-18T13:18:05.245 [INFO] Apache Beam :: SDKs :: Java :: Maven Archetypes :: Starter SUCCESS [ 17.931 s]
2017-09-18T13:18:05.245 [INFO] Apache Beam :: Examples ............................ SUCCESS [ 3.045 s]
2017-09-18T13:18:05.245 [INFO] Apache Beam :: Examples :: Java .................... SUCCESS [06:55 min]
2017-09-18T13:18:05.245 [INFO] Apache Beam :: SDKs :: Java :: Maven Archetypes :: Examples SUCCESS [ 41.711 s]
2017-09-18T13:18:05.245 [INFO] Apache Beam :: Examples :: Java 8 .................. SUCCESS [ 50.775 s]
2017-09-18T13:18:05.245 [INFO] Apache Beam :: SDKs :: Java :: Maven Archetypes :: Examples - Java 8 SUCCESS [ 32.327 s]
2017-09-18T13:18:05.245 [INFO] Apache Beam :: SDKs :: Java :: Extensions :: Jackson SUCCESS [ 14.783 s]
2017-09-18T13:18:05.245 [INFO] Apache Beam :: SDKs :: Java :: Extensions :: Join library SUCCESS [ 18.007 s]
2017-09-18T13:18:05.245 [INFO] Apache Beam :: SDKs :: Java :: Extensions :: Sorter SUCCESS [ 33.086 s]
2017-09-18T13:18:05.245 [INFO] Apache Beam :: SDKs :: Java :: Extensions :: SQL ... SUCCESS [01:09 min]
2017-09-18T13:18:05.245 [INFO] Apache Beam :: SDKs :: Java :: Nexmark ............. SUCCESS [01:12 min]
2017-09-18T13:18:05.245 [INFO] Apache Beam :: SDKs :: Java :: Harness ............. SUCCESS [ 48.624 s]
2017-09-18T13:18:05.246 [INFO] Apache Beam :: SDKs :: Java :: Java 8 Tests ........ SUCCESS [ 22.650 s]
2017-09-18T13:18:05.246 [INFO] Apache Beam :: SDKs :: Python ...................... FAILURE [25:18 min]
2017-09-18T13:18:05.246 [INFO] Apache Beam :: Runners :: Flink .................... SKIPPED
2017-09-18T13:18:05.246 [INFO] Apache Beam :: Runners :: Spark .................... SKIPPED
2017-09-18T13:18:05.246 [INFO] Apache Beam :: Runners :: Apex ..................... SKIPPED
2017-09-18T13:18:05.246 [INFO] Apache Beam :: Runners :: Gearpump ................. SKIPPED
2017-09-18T13:18:05.246 [INFO] Apache Beam :: SDKs :: Java :: Aggregated Javadoc .. SKIPPED
2017-09-18T13:18:05.246 [INFO] ------------------------------------------------------------------------
2017-09-18T13:18:05.246 [INFO] BUILD FAILURE
2017-09-18T13:18:05.246 [INFO] ------------------------------------------------------------------------
2017-09-18T13:18:05.246 [INFO] Total time: 01:16 h
2017-09-18T13:18:05.246 [INFO] Finished at: 2017-09-18T13:18:05+00:00
2017-09-18T13:18:06.236 [INFO] Final Memory: 344M/2040M
2017-09-18T13:18:06.236 [INFO] ------------------------------------------------------------------------
2017-09-18T13:18:06.244 [ERROR] Failed to execute goal org.codehaus.mojo:exec-maven-plugin:1.5.0:exec (setuptools-test) on project beam-sdks-python: Command execution failed. Process exited with an error: 1 (Exit value: 1) -> [Help 1]
org.apache.maven.lifecycle.LifecycleExecutionException: Failed to execute goal org.codehaus.mojo:exec-maven-plugin:1.5.0:exec (setuptools-test) on project beam-sdks-python: Command execution failed.
at org.apache.maven.lifecycle.internal.MojoExecutor.execute(MojoExecutor.java:216)
at org.apache.maven.lifecycle.internal.MojoExecutor.execute(MojoExecutor.java:153)
at org.apache.maven.lifecycle.internal.MojoExecutor.execute(MojoExecutor.java:145)
at org.apache.maven.lifecycle.internal.LifecycleModuleBuilder.buildProject(LifecycleModuleBuilder.java:116)
at org.apache.maven.lifecycle.internal.LifecycleModuleBuilder.buildProject(LifecycleModuleBuilder.java:80)
at org.apache.maven.lifecycle.internal.builder.singlethreaded.SingleThreadedBuilder.build(SingleThreadedBuilder.java:51)
at org.apache.maven.lifecycle.internal.LifecycleStarter.execute(LifecycleStarter.java:128)
at org.apache.maven.DefaultMaven.doExecute(DefaultMaven.java:307)
at org.apache.maven.DefaultMaven.doExecute(DefaultMaven.java:193)
at org.apache.maven.DefaultMaven.execute(DefaultMaven.java:106)
at org.jvnet.hudson.maven3.launcher.Maven33Launcher.main(Maven33Launcher.java:129)
at sun.reflect.NativeMethodAccessorImpl.invoke0(Native Method)
at sun.reflect.NativeMethodAccessorImpl.invoke(NativeMethodAccessorImpl.java:62)
at sun.reflect.DelegatingMethodAccessorImpl.invoke(DelegatingMethodAccessorImpl.java:43)
at java.lang.reflect.Method.invoke(Method.java:498)
at org.codehaus.plexus.classworlds.launcher.Launcher.launchStandard(Launcher.java:330)
at org.codehaus.plexus.classworlds.launcher.Launcher.launch(Launcher.java:238)
at jenkins.maven3.agent.Maven33Main.launch(Maven33Main.java:176)
at sun.reflect.NativeMethodAccessorImpl.invoke0(Native Method)
at sun.reflect.NativeMethodAccessorImpl.invoke(NativeMethodAccessorImpl.java:62)
at sun.reflect.DelegatingMethodAccessorImpl.invoke(DelegatingMethodAccessorImpl.java:43)
at java.lang.reflect.Method.invoke(Method.java:498)
at hudson.maven.Maven3Builder.call(Maven3Builder.java:139)
at hudson.maven.Maven3Builder.call(Maven3Builder.java:70)
at hudson.remoting.UserRequest.perform(UserRequest.java:153)
at hudson.remoting.UserRequest.perform(UserRequest.java:50)
at hudson.remoting.Request$2.run(Request.java:336)
at hudson.remoting.InterceptingExecutorService$1.call(InterceptingExecutorService.java:68)
at java.util.concurrent.FutureTask.run(FutureTask.java:266)
at java.util.concurrent.ThreadPoolExecutor.runWorker(ThreadPoolExecutor.java:1149)
at java.util.concurrent.ThreadPoolExecutor$Worker.run(ThreadPoolExecutor.java:624)
at java.lang.Thread.run(Thread.java:748)
Caused by: org.apache.maven.plugin.MojoExecutionException: Command execution failed.
at org.codehaus.mojo.exec.ExecMojo.execute(ExecMojo.java:302)
at org.apache.maven.plugin.DefaultBuildPluginManager.executeMojo(DefaultBuildPluginManager.java:134)
at org.apache.maven.lifecycle.internal.MojoExecutor.execute(MojoExecutor.java:208)
... 31 more
Caused by: org.apache.commons.exec.ExecuteException: Process exited with an error: 1 (Exit value: 1)
at org.apache.commons.exec.DefaultExecutor.executeInternal(DefaultExecutor.java:404)
at org.apache.commons.exec.DefaultExecutor.execute(DefaultExecutor.java:166)
at org.codehaus.mojo.exec.ExecMojo.executeCommandLine(ExecMojo.java:764)
at org.codehaus.mojo.exec.ExecMojo.executeCommandLine(ExecMojo.java:711)
at org.codehaus.mojo.exec.ExecMojo.execute(ExecMojo.java:289)
... 33 more
2017-09-18T13:18:06.244 [ERROR]
2017-09-18T13:18:06.244 [ERROR] Re-run Maven using the -X switch to enable full debug logging.
2017-09-18T13:18:06.244 [ERROR]
2017-09-18T13:18:06.244 [ERROR] For more information about the errors and possible solutions, please read the following articles:
2017-09-18T13:18:06.245 [ERROR] [Help 1] http://cwiki.apache.org/confluence/display/MAVEN/MojoExecutionException
2017-09-18T13:18:06.245 [ERROR]
2017-09-18T13:18:06.245 [ERROR] After correcting the problems, you can resume the build with the command
2017-09-18T13:18:06.245 [ERROR] mvn <goals> -rf :beam-sdks-python
channel stopped