You are viewing a plain text version of this content. The canonical link for it is here.
Posted to notifications@maven.apache.org by Apache Jenkins Server <je...@builds.apache.org> on 2020/04/07 16:29:20 UTC

Build failed in Jenkins: Maven TLP » maven-checkstyle-plugin » MCHECKSTYLE-289 #29

See https://builds.apache.org/job/maven-box/job/maven-checkstyle-plugin/job/MCHECKSTYLE-289/29/

Changes:

* exclude broken jenkins-win-he-de-1 node

All tests passed

Build log:
[...truncated 6125 lines...]
[INFO] ------------------------------------------------------------------------
[INFO] Total time:  06:08 min
[INFO] Finished at: 2020-04-07T09:27:13-07:00
[INFO] ------------------------------------------------------------------------
[INFO] [jenkins-event-spy] Generated F:\jenkins\jenkins-slave\workspace\heckstyle-plugin_MCHECKSTYLE-289@3@2@tmp\withMaven8c6d78a0\maven-spy-20200407-092103-93215460329849533331006.log
[ERROR] Failed to execute goal org.apache.maven.plugins:maven-invoker-plugin:3.2.1:verify (integration-test) on project maven-checkstyle-plugin: 1 build failed. See console output above for details. -> [Help 1]
org.apache.maven.lifecycle.LifecycleExecutionException: Failed to execute goal org.apache.maven.plugins:maven-invoker-plugin:3.2.1:verify (integration-test) on project maven-checkstyle-plugin: 1 build failed. See console output above for details.
    at org.apache.maven.lifecycle.internal.MojoExecutor.execute (MojoExecutor.java:215)
    at org.apache.maven.lifecycle.internal.MojoExecutor.execute (MojoExecutor.java:156)
    at org.apache.maven.lifecycle.internal.MojoExecutor.execute (MojoExecutor.java:148)
    at org.apache.maven.lifecycle.internal.LifecycleModuleBuilder.buildProject (LifecycleModuleBuilder.java:117)
    at org.apache.maven.lifecycle.internal.LifecycleModuleBuilder.buildProject (LifecycleModuleBuilder.java:81)
    at org.apache.maven.lifecycle.internal.builder.singlethreaded.SingleThreadedBuilder.build (SingleThreadedBuilder.java:56)
    at org.apache.maven.lifecycle.internal.LifecycleStarter.execute (LifecycleStarter.java:128)
    at org.apache.maven.DefaultMaven.doExecute (DefaultMaven.java:305)
    at org.apache.maven.DefaultMaven.doExecute (DefaultMaven.java:192)
    at org.apache.maven.DefaultMaven.execute (DefaultMaven.java:105)
    at org.apache.maven.cli.MavenCli.execute (MavenCli.java:956)
    at org.apache.maven.cli.MavenCli.doMain (MavenCli.java:288)
    at org.apache.maven.cli.MavenCli.main (MavenCli.java:192)
    at jdk.internal.reflect.NativeMethodAccessorImpl.invoke0 (Native Method)
    at jdk.internal.reflect.NativeMethodAccessorImpl.invoke (NativeMethodAccessorImpl.java:62)
    at jdk.internal.reflect.DelegatingMethodAccessorImpl.invoke (DelegatingMethodAccessorImpl.java:43)
    at java.lang.reflect.Method.invoke (Method.java:567)
    at org.codehaus.plexus.classworlds.launcher.Launcher.launchEnhanced (Launcher.java:282)
    at org.codehaus.plexus.classworlds.launcher.Launcher.launch (Launcher.java:225)
    at org.codehaus.plexus.classworlds.launcher.Launcher.mainWithExitCode (Launcher.java:406)
    at org.codehaus.plexus.classworlds.launcher.Launcher.main (Launcher.java:347)
Caused by: org.apache.maven.plugin.MojoFailureException: 1 build failed. See console output above for details.
    at org.apache.maven.plugins.invoker.InvokerSession.handleFailures (InvokerSession.java:259)
    at org.apache.maven.plugins.invoker.VerifyMojo.execute (VerifyMojo.java:140)
    at org.apache.maven.plugin.DefaultBuildPluginManager.executeMojo (DefaultBuildPluginManager.java:137)
    at org.apache.maven.lifecycle.internal.MojoExecutor.execute (MojoExecutor.java:210)
    at org.apache.maven.lifecycle.internal.MojoExecutor.execute (MojoExecutor.java:156)
    at org.apache.maven.lifecycle.internal.MojoExecutor.execute (MojoExecutor.java:148)
    at org.apache.maven.lifecycle.internal.LifecycleModuleBuilder.buildProject (LifecycleModuleBuilder.java:117)
    at org.apache.maven.lifecycle.internal.LifecycleModuleBuilder.buildProject (LifecycleModuleBuilder.java:81)
    at org.apache.maven.lifecycle.internal.builder.singlethreaded.SingleThreadedBuilder.build (SingleThreadedBuilder.java:56)
    at org.apache.maven.lifecycle.internal.LifecycleStarter.execute (LifecycleStarter.java:128)
    at org.apache.maven.DefaultMaven.doExecute (DefaultMaven.java:305)
    at org.apache.maven.DefaultMaven.doExecute (DefaultMaven.java:192)
    at org.apache.maven.DefaultMaven.execute (DefaultMaven.java:105)
    at org.apache.maven.cli.MavenCli.execute (MavenCli.java:956)
    at org.apache.maven.cli.MavenCli.doMain (MavenCli.java:288)
    at org.apache.maven.cli.MavenCli.main (MavenCli.java:192)
    at jdk.internal.reflect.NativeMethodAccessorImpl.invoke0 (Native Method)
    at jdk.internal.reflect.NativeMethodAccessorImpl.invoke (NativeMethodAccessorImpl.java:62)
    at jdk.internal.reflect.DelegatingMethodAccessorImpl.invoke (DelegatingMethodAccessorImpl.java:43)
    at java.lang.reflect.Method.invoke (Method.java:567)
    at org.codehaus.plexus.classworlds.launcher.Launcher.launchEnhanced (Launcher.java:282)
    at org.codehaus.plexus.classworlds.launcher.Launcher.launch (Launcher.java:225)
    at org.codehaus.plexus.classworlds.launcher.Launcher.mainWithExitCode (Launcher.java:406)
    at org.codehaus.plexus.classworlds.launcher.Launcher.main (Launcher.java:347)
[ERROR] 
[ERROR] Re-run Maven using the -X switch to enable full debug logging.
[ERROR] 
[ERROR] For more information about the errors and possible solutions, please read the following articles:
[ERROR] [Help 1] http://cwiki.apache.org/confluence/display/MAVEN/MojoFailureException
[Pipeline] }
[Pipeline] // dir
[Pipeline] }
[withMaven] junitPublisher - Archive test results for Maven artifact org.apache.maven.plugins:maven-checkstyle-plugin:maven-plugin:3.1.2-SNAPSHOT generated by maven-surefire-plugin:test (default-test): windows-jdk13-m3.6.x_build\target\surefire-reports\*.xml
Recording test results
[withMaven] openTasksPublisher - Scan Tasks for Maven artifact org.apache.maven.plugins:maven-checkstyle-plugin:maven-plugin:3.1.2-SNAPSHOT in source directory windows-jdk13-m3.6.x_build\src\main\java
[TASKS] Scanning folder 'f:\jenkins\jenkins-slave\workspace\heckstyle-plugin_MCHECKSTYLE-289@3@2' for files matching the pattern 'windows-jdk13-m3.6.x_build\src\main\java\**\*' - excludes: null
[TASKS] Found 21 files to scan for tasks
[TASKS] Found 5 open tasks.
Skipping warnings blame since pipelines do not have an SCM link.%n
[TASKS] Computing warning deltas based on reference build #4
[withMaven] invokerPublisher - Archive invoker results for Maven artifact MavenArtifact{org.apache.maven.plugins:maven-checkstyle-plugin:maven-plugin:3.1.2-SNAPSHOT(version: 3.1.2-SNAPSHOT, snapshot:false) } generated by PluginInvocation{org.apache.maven.plugins:maven-invoker-plugin:3.2.1@integration-test  integration-test}: windows-jdk13-m3.6.x_build\target\invoker-reports\*.xml
[INFO] run post-build script verify.groovy
[INFO]   The post-build script did not succeed. f:\jenkins\jenkins-slave\workspace\heckstyle-plugin_MCHECKSTYLE-289@2\windows-jdk14-m3.6.x_build\target\it\MCHECKSTYLE-289\target\site\checkstyle.html (The system cannot find the path specified)
[INFO]           MCHECKSTYLE-289\pom.xml .......................... FAILED (7.8 s)
[INFO] Building: MCHECKSTYLE-295\pom.xml
[INFO] run post-build script verify.groovy
[INFO]           MCHECKSTYLE-295\pom.xml .......................... SUCCESS (5.4 s)
[INFO] Building: MCHECKSTYLE-332_cache-checker\pom.xml
[INFO] run post-build script verify.groovy
[INFO]           MCHECKSTYLE-332_cache-checker\pom.xml ............ SUCCESS (5.4 s)
[INFO] Building: MCHECKSTYLE-337\pom.xml
[withMaven] Publishers: Generated Artifacts Publisher: 14 ms, Junit Publisher: 230 ms, Open Task Scanner Publisher: 196 ms, Invoker Publisher: 16693 ms
[Pipeline] // withMaven
[Pipeline] cleanWs
[WS-CLEANUP] Deleting project workspace...
[WS-CLEANUP] Deferred wipeout is used...
[WS-CLEANUP] done
[Pipeline] cleanWs
[WS-CLEANUP] Deleting project workspace...
[WS-CLEANUP] Deferred wipeout is used...
[WS-CLEANUP] done
[Pipeline] }
[Pipeline] // stage
[Pipeline] }
[Pipeline] // ws
[Pipeline] }
[Pipeline] // node
[Pipeline] }
Failed in branch windows-jdk13-m3.6.x_build
[INFO] run post-build script verify.groovy
[INFO]           MCHECKSTYLE-337\pom.xml .......................... SUCCESS (9.4 s)
[INFO] Building: MCHECKSTYLE-338\pom.xml
[INFO] run post-build script verify.groovy
[INFO]           MCHECKSTYLE-338\pom.xml .......................... SUCCESS (8.6 s)
[INFO] Building: MCHECKSTYLE-347\pom.xml
[INFO] run post-build script verify.groovy
[INFO]           MCHECKSTYLE-347\pom.xml .......................... SUCCESS (3.8 s)
[INFO] Building: MCHECKSTYLE-357\pom.xml
[INFO] run post-build script verify.groovy
[INFO]           MCHECKSTYLE-357\pom.xml .......................... SUCCESS (7.9 s)
[INFO] Building: MCHECKSTYLE-357-with-header-override\pom.xml
[INFO] run post-build script verify.groovy
[INFO]           MCHECKSTYLE-357-with-header-override\pom.xml ..... SUCCESS (10.1 s)
[INFO] Building: MCHECKSTYLE-365\pom.xml
[INFO] run post-build script verify.groovy
[INFO]           MCHECKSTYLE-365\pom.xml .......................... SUCCESS (7.7 s)
[INFO] Building: MCHECKSTYLE-371\pom.xml
[INFO] run post-build script verify.groovy
[INFO]           MCHECKSTYLE-371\pom.xml .......................... SUCCESS (5.8 s)
[INFO] Building: MCHECKSTYLE-54\pom.xml
[INFO] run pre-build script setup.groovy
[INFO] run post-build script verify.groovy
[INFO]           MCHECKSTYLE-54\pom.xml ........................... SUCCESS (5.7 s)
[INFO] Building: MCHECKSTYLE-70-multi-sourcefolder\pom.xml
[INFO] run post-build script verify.groovy
[INFO]           MCHECKSTYLE-70-multi-sourcefolder\pom.xml ........ SUCCESS (9.1 s)
[INFO] Building: minimal-pom\pom.xml
[INFO] run post-build script verify.bsh
[INFO]           minimal-pom\pom.xml .............................. SUCCESS (8.3 s)
[INFO] Building: multi-modules\pom.xml
[INFO]           multi-modules\pom.xml ............................ SUCCESS (6.0 s)
[INFO] Building: multi-modules-aggregate\pom.xml
[INFO] run post-build script verify.groovy
[INFO]           multi-modules-aggregate\pom.xml .................. SUCCESS (5.8 s)
[INFO] Building: multimoduleproject\pom.xml
[INFO]           multimoduleproject\pom.xml ....................... SUCCESS (4.3 s)
[INFO] 
[INFO] --- maven-checkstyle-plugin:3.0.0:check (checkstyle-check) @ maven-checkstyle-plugin ---
[INFO] There is 1 error reported by Checkstyle 6.18 with config/maven_checks.xml ruleset.
[INFO] Ignored 1 error, 0 violation remaining.
[INFO] 
[INFO] --- maven-invoker-plugin:3.2.1:verify (integration-test) @ maven-checkstyle-plugin ---
[INFO] -------------------------------------------------
[INFO] Build Summary:
[INFO]   Passed: 45, Failed: 1, Errors: 0, Skipped: 0
[INFO] -------------------------------------------------
[ERROR] The following builds failed:
[ERROR] *  MCHECKSTYLE-289\pom.xml
[INFO] -------------------------------------------------
[INFO] ------------------------------------------------------------------------
[INFO] BUILD FAILURE
[INFO] ------------------------------------------------------------------------
[INFO] Total time:  06:05 min
[INFO] Finished at: 2020-04-07T09:29:02-07:00
[INFO] ------------------------------------------------------------------------
[INFO] [jenkins-event-spy] Generated F:\jenkins\jenkins-slave\workspace\heckstyle-plugin_MCHECKSTYLE-289@2@tmp\withMaven6121cb40\maven-spy-20200407-092257-18912160970170838211956.log
[ERROR] Failed to execute goal org.apache.maven.plugins:maven-invoker-plugin:3.2.1:verify (integration-test) on project maven-checkstyle-plugin: 1 build failed. See console output above for details. -> [Help 1]
org.apache.maven.lifecycle.LifecycleExecutionException: Failed to execute goal org.apache.maven.plugins:maven-invoker-plugin:3.2.1:verify (integration-test) on project maven-checkstyle-plugin: 1 build failed. See console output above for details.
    at org.apache.maven.lifecycle.internal.MojoExecutor.execute (MojoExecutor.java:215)
    at org.apache.maven.lifecycle.internal.MojoExecutor.execute (MojoExecutor.java:156)
    at org.apache.maven.lifecycle.internal.MojoExecutor.execute (MojoExecutor.java:148)
    at org.apache.maven.lifecycle.internal.LifecycleModuleBuilder.buildProject (LifecycleModuleBuilder.java:117)
    at org.apache.maven.lifecycle.internal.LifecycleModuleBuilder.buildProject (LifecycleModuleBuilder.java:81)
    at org.apache.maven.lifecycle.internal.builder.singlethreaded.SingleThreadedBuilder.build (SingleThreadedBuilder.java:56)
    at org.apache.maven.lifecycle.internal.LifecycleStarter.execute (LifecycleStarter.java:128)
    at org.apache.maven.DefaultMaven.doExecute (DefaultMaven.java:305)
    at org.apache.maven.DefaultMaven.doExecute (DefaultMaven.java:192)
    at org.apache.maven.DefaultMaven.execute (DefaultMaven.java:105)
    at org.apache.maven.cli.MavenCli.execute (MavenCli.java:956)
    at org.apache.maven.cli.MavenCli.doMain (MavenCli.java:288)
    at org.apache.maven.cli.MavenCli.main (MavenCli.java:192)
    at jdk.internal.reflect.NativeMethodAccessorImpl.invoke0 (Native Method)
    at jdk.internal.reflect.NativeMethodAccessorImpl.invoke (NativeMethodAccessorImpl.java:62)
    at jdk.internal.reflect.DelegatingMethodAccessorImpl.invoke (DelegatingMethodAccessorImpl.java:43)
    at java.lang.reflect.Method.invoke (Method.java:567)
    at org.codehaus.plexus.classworlds.launcher.Launcher.launchEnhanced (Launcher.java:282)
    at org.codehaus.plexus.classworlds.launcher.Launcher.launch (Launcher.java:225)
    at org.codehaus.plexus.classworlds.launcher.Launcher.mainWithExitCode (Launcher.java:406)
    at org.codehaus.plexus.classworlds.launcher.Launcher.main (Launcher.java:347)
Caused by: org.apache.maven.plugin.MojoFailureException: 1 build failed. See console output above for details.
    at org.apache.maven.plugins.invoker.InvokerSession.handleFailures (InvokerSession.java:259)
    at org.apache.maven.plugins.invoker.VerifyMojo.execute (VerifyMojo.java:140)
    at org.apache.maven.plugin.DefaultBuildPluginManager.executeMojo (DefaultBuildPluginManager.java:137)
    at org.apache.maven.lifecycle.internal.MojoExecutor.execute (MojoExecutor.java:210)
    at org.apache.maven.lifecycle.internal.MojoExecutor.execute (MojoExecutor.java:156)
    at org.apache.maven.lifecycle.internal.MojoExecutor.execute (MojoExecutor.java:148)
    at org.apache.maven.lifecycle.internal.LifecycleModuleBuilder.buildProject (LifecycleModuleBuilder.java:117)
    at org.apache.maven.lifecycle.internal.LifecycleModuleBuilder.buildProject (LifecycleModuleBuilder.java:81)
    at org.apache.maven.lifecycle.internal.builder.singlethreaded.SingleThreadedBuilder.build (SingleThreadedBuilder.java:56)
    at org.apache.maven.lifecycle.internal.LifecycleStarter.execute (LifecycleStarter.java:128)
    at org.apache.maven.DefaultMaven.doExecute (DefaultMaven.java:305)
    at org.apache.maven.DefaultMaven.doExecute (DefaultMaven.java:192)
    at org.apache.maven.DefaultMaven.execute (DefaultMaven.java:105)
    at org.apache.maven.cli.MavenCli.execute (MavenCli.java:956)
    at org.apache.maven.cli.MavenCli.doMain (MavenCli.java:288)
    at org.apache.maven.cli.MavenCli.main (MavenCli.java:192)
    at jdk.internal.reflect.NativeMethodAccessorImpl.invoke0 (Native Method)
    at jdk.internal.reflect.NativeMethodAccessorImpl.invoke (NativeMethodAccessorImpl.java:62)
    at jdk.internal.reflect.DelegatingMethodAccessorImpl.invoke (DelegatingMethodAccessorImpl.java:43)
    at java.lang.reflect.Method.invoke (Method.java:567)
    at org.codehaus.plexus.classworlds.launcher.Launcher.launchEnhanced (Launcher.java:282)
    at org.codehaus.plexus.classworlds.launcher.Launcher.launch (Launcher.java:225)
    at org.codehaus.plexus.classworlds.launcher.Launcher.mainWithExitCode (Launcher.java:406)
    at org.codehaus.plexus.classworlds.launcher.Launcher.main (Launcher.java:347)
[ERROR] 
[ERROR] Re-run Maven using the -X switch to enable full debug logging.
[ERROR] 
[ERROR] For more information about the errors and possible solutions, please read the following articles:
[ERROR] [Help 1] http://cwiki.apache.org/confluence/display/MAVEN/MojoFailureException
[Pipeline] }
[Pipeline] // dir
[Pipeline] }
[withMaven] junitPublisher - Archive test results for Maven artifact org.apache.maven.plugins:maven-checkstyle-plugin:maven-plugin:3.1.2-SNAPSHOT generated by maven-surefire-plugin:test (default-test): windows-jdk14-m3.6.x_build\target\surefire-reports\*.xml
Recording test results
[withMaven] openTasksPublisher - Scan Tasks for Maven artifact org.apache.maven.plugins:maven-checkstyle-plugin:maven-plugin:3.1.2-SNAPSHOT in source directory windows-jdk14-m3.6.x_build\src\main\java
[TASKS] Scanning folder 'f:\jenkins\jenkins-slave\workspace\heckstyle-plugin_MCHECKSTYLE-289@2' for files matching the pattern 'windows-jdk14-m3.6.x_build\src\main\java\**\*' - excludes: null
[TASKS] Found 21 files to scan for tasks
[TASKS] Found 5 open tasks.
Skipping warnings blame since pipelines do not have an SCM link.%n
[TASKS] Computing warning deltas based on reference build #4
[withMaven] invokerPublisher - Archive invoker results for Maven artifact MavenArtifact{org.apache.maven.plugins:maven-checkstyle-plugin:maven-plugin:3.1.2-SNAPSHOT(version: 3.1.2-SNAPSHOT, snapshot:false) } generated by PluginInvocation{org.apache.maven.plugins:maven-invoker-plugin:3.2.1@integration-test  integration-test}: windows-jdk14-m3.6.x_build\target\invoker-reports\*.xml
[withMaven] Publishers: Generated Artifacts Publisher: 14 ms, Junit Publisher: 302 ms, Open Task Scanner Publisher: 138 ms, Invoker Publisher: 15871 ms, Pipeline Graph Publisher: 1 ms
[Pipeline] // withMaven
[Pipeline] cleanWs
[WS-CLEANUP] Deleting project workspace...
[WS-CLEANUP] Deferred wipeout is used...
[WS-CLEANUP] done
[Pipeline] cleanWs
[WS-CLEANUP] Deleting project workspace...
[WS-CLEANUP] Deferred wipeout is used...
[WS-CLEANUP] done
[Pipeline] }
[Pipeline] // stage
[Pipeline] }
[Pipeline] // ws
[Pipeline] }
[Pipeline] // node
[Pipeline] }
Failed in branch windows-jdk14-m3.6.x_build
[Pipeline] // parallel
[Pipeline] stage
[Pipeline] { (Notifications)
[Pipeline] echo
Build result: FAILURE
[Pipeline] jiraIssueSelector
[Pipeline] echo
The authors of changes [rfscholte].
[Pipeline] echo
Sending email ...
[Pipeline] emailext

Build failed in Jenkins: Maven TLP » maven-checkstyle-plugin » MCHECKSTYLE-289 #31

Posted by Apache Jenkins Server <je...@builds.apache.org>.
See https://builds.apache.org/job/maven-box/job/maven-checkstyle-plugin/job/MCHECKSTYLE-289/31/

Changes:

* Use Java 7 JDK for all released Maven versions and 8 for planned 3.7.x
* Exclude H23
* [INFRA-20239] H23 should be ok now
* Revert: Use Java 7 JDK for all released Maven versions (135a0e16) due to
* Update Maven versions
* There's no M3.6.3 for Windows

All tests passed

Build log:
[...truncated 6119 lines...]
[ERROR] [Help 1] http://cwiki.apache.org/confluence/display/MAVEN/MojoFailureException
[Pipeline] }
[Pipeline] // dir
[Pipeline] }
[withMaven] junitPublisher - Archive test results for Maven artifact org.apache.maven.plugins:maven-checkstyle-plugin:maven-plugin:3.1.2-SNAPSHOT generated by maven-surefire-plugin:test (default-test): windows-jdk13-m3.6.x_build\target\surefire-reports\*.xml
Recording test results
[withMaven] openTasksPublisher - Scan Tasks for Maven artifact org.apache.maven.plugins:maven-checkstyle-plugin:maven-plugin:3.1.2-SNAPSHOT in source directory windows-jdk13-m3.6.x_build\src\main\java
[TASKS] Scanning folder 'f:\jenkins\jenkins-slave\workspace\heckstyle-plugin_MCHECKSTYLE-289@2' for files matching the pattern 'windows-jdk13-m3.6.x_build\src\main\java\**\*' - excludes: null
[TASKS] Found 21 files to scan for tasks
[TASKS] Found 5 open tasks.
Skipping warnings blame since pipelines do not have an SCM link.%n
[TASKS] Computing warning deltas based on reference build #4
[withMaven] invokerPublisher - Archive invoker results for Maven artifact MavenArtifact{org.apache.maven.plugins:maven-checkstyle-plugin:maven-plugin:3.1.2-SNAPSHOT(version: 3.1.2-SNAPSHOT, snapshot:false) } generated by PluginInvocation{org.apache.maven.plugins:maven-invoker-plugin:3.2.1@integration-test  integration-test}: windows-jdk13-m3.6.x_build\target\invoker-reports\*.xml
[INFO] run post-build script verify.groovy
[INFO]           MCHECKSTYLE-169\pom.xml .......................... SUCCESS (4.6 s)
[INFO] Building: MCHECKSTYLE-172\pom.xml
[INFO] run post-build script verify.groovy
[INFO]           MCHECKSTYLE-172\pom.xml .......................... SUCCESS (5.9 s)
[INFO] Building: MCHECKSTYLE-173-with-charset\pom.xml
[INFO]           MCHECKSTYLE-173-with-charset\pom.xml ............. SUCCESS (8.0 s)
[INFO] Building: MCHECKSTYLE-173-without-charset\pom.xml
[withMaven] Publishers: Generated Artifacts Publisher: 21 ms, Junit Publisher: 273 ms, Open Task Scanner Publisher: 113 ms, Invoker Publisher: 16992 ms
[Pipeline] // withMaven
[Pipeline] cleanWs
[WS-CLEANUP] Deleting project workspace...
[WS-CLEANUP] Deferred wipeout is used...
[WS-CLEANUP] done
[Pipeline] cleanWs
[WS-CLEANUP] Deleting project workspace...
[WS-CLEANUP] Deferred wipeout is used...
[WS-CLEANUP] done
[Pipeline] }
[Pipeline] // stage
[Pipeline] }
[Pipeline] // ws
[Pipeline] }
[Pipeline] // node
[Pipeline] }
Failed in branch windows-jdk13-m3.6.x_build
[INFO]           MCHECKSTYLE-173-without-charset\pom.xml .......... SUCCESS (6.3 s)
[INFO] Building: MCHECKSTYLE-193\pom.xml
[INFO]           MCHECKSTYLE-193\pom.xml .......................... SUCCESS (4.7 s)
[INFO] Building: MCHECKSTYLE-214-basedir-resource\pom.xml
[INFO] run post-build script verify.groovy
[INFO]           MCHECKSTYLE-214-basedir-resource\pom.xml ......... SUCCESS (4.3 s)
[INFO] Building: MCHECKSTYLE-219-no-license_failure\pom.xml
[INFO] run post-build script verify.groovy
[INFO]           MCHECKSTYLE-219-no-license_failure\pom.xml ....... SUCCESS (5.1 s)
[INFO] Building: MCHECKSTYLE-219-no-license_success\pom.xml
[INFO] run post-build script verify.groovy
[INFO]           MCHECKSTYLE-219-no-license_success\pom.xml ....... SUCCESS (5.2 s)
[INFO] Building: MCHECKSTYLE-220\pom.xml
[INFO] run post-build script verify.groovy
[INFO]           MCHECKSTYLE-220\pom.xml .......................... SUCCESS (5.4 s)
[INFO] Building: MCHECKSTYLE-222-no-resources\pom.xml
[INFO] run post-build script verify.groovy
[INFO]           MCHECKSTYLE-222-no-resources\pom.xml ............. SUCCESS (3.6 s)
[INFO] Building: MCHECKSTYLE-222-resources\pom.xml
[INFO] run post-build script verify.groovy
[INFO]           MCHECKSTYLE-222-resources\pom.xml ................ SUCCESS (4.1 s)
[INFO] Building: MCHECKSTYLE-222-testResources\pom.xml
[INFO] run post-build script verify.groovy
[INFO]           MCHECKSTYLE-222-testResources\pom.xml ............ SUCCESS (4.1 s)
[INFO] Building: MCHECKSTYLE-224\pom.xml
[INFO] run post-build script verify.groovy
[INFO]           MCHECKSTYLE-224\pom.xml .......................... SUCCESS (9.2 s)
[INFO] Building: MCHECKSTYLE-225-customHeader\pom.xml
[INFO] run post-build script verify.groovy
[INFO]           MCHECKSTYLE-225-customHeader\pom.xml ............. SUCCESS (5.0 s)
[INFO] Building: MCHECKSTYLE-225-LICENSE.txt\pom.xml
[INFO] run post-build script verify.groovy
[INFO]           MCHECKSTYLE-225-LICENSE.txt\pom.xml .............. SUCCESS (5.4 s)
[INFO] Building: MCHECKSTYLE-225-pluginManagement\pom.xml
[INFO] run post-build script verify.groovy
[INFO]           MCHECKSTYLE-225-pluginManagement\pom.xml ......... SUCCESS (5.5 s)
[INFO] Building: MCHECKSTYLE-253-jdk8\pom.xml
[INFO] run post-build script verify.groovy
[INFO]           MCHECKSTYLE-253-jdk8\pom.xml ..................... SUCCESS (4.3 s)
[INFO] Building: MCHECKSTYLE-260-sourceDirectories\pom.xml
[INFO] run post-build script verify.groovy
[INFO]           MCHECKSTYLE-260-sourceDirectories\pom.xml ........ SUCCESS (9.3 s)
[INFO] Building: MCHECKSTYLE-260-testSourceDirectories\pom.xml
[INFO] run post-build script verify.groovy
[INFO]           MCHECKSTYLE-260-testSourceDirectories\pom.xml .... SUCCESS (6.5 s)
[INFO] Building: MCHECKSTYLE-268\pom.xml
[INFO] run post-build script verify.groovy
[INFO]           MCHECKSTYLE-268\pom.xml .......................... SUCCESS (6.1 s)
[INFO] Building: MCHECKSTYLE-289\pom.xml
[INFO] run post-build script verify.groovy
[INFO]   The post-build script did not succeed. f:\jenkins\jenkins-slave\workspace\heckstyle-plugin_MCHECKSTYLE-289@2\windows-jdk14-m3.6.x_build\target\it\MCHECKSTYLE-289\target\site\checkstyle.html (The system cannot find the path specified)
[INFO]           MCHECKSTYLE-289\pom.xml .......................... FAILED (8.7 s)
[INFO] Building: MCHECKSTYLE-295\pom.xml
[INFO] run post-build script verify.groovy
[INFO]           MCHECKSTYLE-295\pom.xml .......................... SUCCESS (5.6 s)
[INFO] Building: MCHECKSTYLE-332_cache-checker\pom.xml
[INFO] run post-build script verify.groovy
[INFO]           MCHECKSTYLE-332_cache-checker\pom.xml ............ SUCCESS (4.7 s)
[INFO] Building: MCHECKSTYLE-337\pom.xml
[INFO] run post-build script verify.groovy
[INFO]           MCHECKSTYLE-337\pom.xml .......................... SUCCESS (5.6 s)
[INFO] Building: MCHECKSTYLE-338\pom.xml
[INFO] run post-build script verify.groovy
[INFO]           MCHECKSTYLE-338\pom.xml .......................... SUCCESS (7.1 s)
[INFO] Building: MCHECKSTYLE-347\pom.xml
[INFO] run post-build script verify.groovy
[INFO]           MCHECKSTYLE-347\pom.xml .......................... SUCCESS (4.0 s)
[INFO] Building: MCHECKSTYLE-357\pom.xml
[INFO] run post-build script verify.groovy
[INFO]           MCHECKSTYLE-357\pom.xml .......................... SUCCESS (8.2 s)
[INFO] Building: MCHECKSTYLE-357-with-header-override\pom.xml
[INFO] run post-build script verify.groovy
[INFO]           MCHECKSTYLE-357-with-header-override\pom.xml ..... SUCCESS (10.2 s)
[INFO] Building: MCHECKSTYLE-365\pom.xml
[INFO] run post-build script verify.groovy
[INFO]           MCHECKSTYLE-365\pom.xml .......................... SUCCESS (6.7 s)
[INFO] Building: MCHECKSTYLE-371\pom.xml
[INFO] run post-build script verify.groovy
[INFO]           MCHECKSTYLE-371\pom.xml .......................... SUCCESS (4.5 s)
[INFO] Building: MCHECKSTYLE-54\pom.xml
[INFO] run pre-build script setup.groovy
[INFO] run post-build script verify.groovy
[INFO]           MCHECKSTYLE-54\pom.xml ........................... SUCCESS (5.1 s)
[INFO] Building: MCHECKSTYLE-70-multi-sourcefolder\pom.xml
[INFO] run post-build script verify.groovy
[INFO]           MCHECKSTYLE-70-multi-sourcefolder\pom.xml ........ SUCCESS (7.9 s)
[INFO] Building: minimal-pom\pom.xml
[INFO] run post-build script verify.bsh
[INFO]           minimal-pom\pom.xml .............................. SUCCESS (8.0 s)
[INFO] Building: multi-modules\pom.xml
[INFO]           multi-modules\pom.xml ............................ SUCCESS (6.2 s)
[INFO] Building: multi-modules-aggregate\pom.xml
[INFO] run post-build script verify.groovy
[INFO]           multi-modules-aggregate\pom.xml .................. SUCCESS (6.4 s)
[INFO] Building: multimoduleproject\pom.xml
[INFO]           multimoduleproject\pom.xml ....................... SUCCESS (5.2 s)
[INFO] 
[INFO] --- maven-checkstyle-plugin:3.0.0:check (checkstyle-check) @ maven-checkstyle-plugin ---
[INFO] There is 1 error reported by Checkstyle 6.18 with config/maven_checks.xml ruleset.
[INFO] Ignored 1 error, 0 violation remaining.
[INFO] 
[INFO] --- maven-invoker-plugin:3.2.1:verify (integration-test) @ maven-checkstyle-plugin ---
[INFO] -------------------------------------------------
[INFO] Build Summary:
[INFO]   Passed: 45, Failed: 1, Errors: 0, Skipped: 0
[INFO] -------------------------------------------------
[ERROR] The following builds failed:
[ERROR] *  MCHECKSTYLE-289\pom.xml
[INFO] -------------------------------------------------
[INFO] ------------------------------------------------------------------------
[INFO] BUILD FAILURE
[INFO] ------------------------------------------------------------------------
[INFO] Total time:  05:40 min
[INFO] Finished at: 2020-07-01T13:32:50-07:00
[INFO] ------------------------------------------------------------------------
[INFO] [jenkins-event-spy] Generated F:\jenkins\jenkins-slave\workspace\heckstyle-plugin_MCHECKSTYLE-289@2@tmp\withMavenaff9ceb7\maven-spy-20200701-132709-94510790880721626808604.log
[ERROR] Failed to execute goal org.apache.maven.plugins:maven-invoker-plugin:3.2.1:verify (integration-test) on project maven-checkstyle-plugin: 1 build failed. See console output above for details. -> [Help 1]
org.apache.maven.lifecycle.LifecycleExecutionException: Failed to execute goal org.apache.maven.plugins:maven-invoker-plugin:3.2.1:verify (integration-test) on project maven-checkstyle-plugin: 1 build failed. See console output above for details.
    at org.apache.maven.lifecycle.internal.MojoExecutor.execute (MojoExecutor.java:215)
    at org.apache.maven.lifecycle.internal.MojoExecutor.execute (MojoExecutor.java:156)
    at org.apache.maven.lifecycle.internal.MojoExecutor.execute (MojoExecutor.java:148)
    at org.apache.maven.lifecycle.internal.LifecycleModuleBuilder.buildProject (LifecycleModuleBuilder.java:117)
    at org.apache.maven.lifecycle.internal.LifecycleModuleBuilder.buildProject (LifecycleModuleBuilder.java:81)
    at org.apache.maven.lifecycle.internal.builder.singlethreaded.SingleThreadedBuilder.build (SingleThreadedBuilder.java:56)
    at org.apache.maven.lifecycle.internal.LifecycleStarter.execute (LifecycleStarter.java:128)
    at org.apache.maven.DefaultMaven.doExecute (DefaultMaven.java:305)
    at org.apache.maven.DefaultMaven.doExecute (DefaultMaven.java:192)
    at org.apache.maven.DefaultMaven.execute (DefaultMaven.java:105)
    at org.apache.maven.cli.MavenCli.execute (MavenCli.java:956)
    at org.apache.maven.cli.MavenCli.doMain (MavenCli.java:288)
    at org.apache.maven.cli.MavenCli.main (MavenCli.java:192)
    at jdk.internal.reflect.NativeMethodAccessorImpl.invoke0 (Native Method)
    at jdk.internal.reflect.NativeMethodAccessorImpl.invoke (NativeMethodAccessorImpl.java:62)
    at jdk.internal.reflect.DelegatingMethodAccessorImpl.invoke (DelegatingMethodAccessorImpl.java:43)
    at java.lang.reflect.Method.invoke (Method.java:567)
    at org.codehaus.plexus.classworlds.launcher.Launcher.launchEnhanced (Launcher.java:282)
    at org.codehaus.plexus.classworlds.launcher.Launcher.launch (Launcher.java:225)
    at org.codehaus.plexus.classworlds.launcher.Launcher.mainWithExitCode (Launcher.java:406)
    at org.codehaus.plexus.classworlds.launcher.Launcher.main (Launcher.java:347)
Caused by: org.apache.maven.plugin.MojoFailureException: 1 build failed. See console output above for details.
    at org.apache.maven.plugins.invoker.InvokerSession.handleFailures (InvokerSession.java:259)
    at org.apache.maven.plugins.invoker.VerifyMojo.execute (VerifyMojo.java:140)
    at org.apache.maven.plugin.DefaultBuildPluginManager.executeMojo (DefaultBuildPluginManager.java:137)
    at org.apache.maven.lifecycle.internal.MojoExecutor.execute (MojoExecutor.java:210)
    at org.apache.maven.lifecycle.internal.MojoExecutor.execute (MojoExecutor.java:156)
    at org.apache.maven.lifecycle.internal.MojoExecutor.execute (MojoExecutor.java:148)
    at org.apache.maven.lifecycle.internal.LifecycleModuleBuilder.buildProject (LifecycleModuleBuilder.java:117)
    at org.apache.maven.lifecycle.internal.LifecycleModuleBuilder.buildProject (LifecycleModuleBuilder.java:81)
    at org.apache.maven.lifecycle.internal.builder.singlethreaded.SingleThreadedBuilder.build (SingleThreadedBuilder.java:56)
    at org.apache.maven.lifecycle.internal.LifecycleStarter.execute (LifecycleStarter.java:128)
    at org.apache.maven.DefaultMaven.doExecute (DefaultMaven.java:305)
    at org.apache.maven.DefaultMaven.doExecute (DefaultMaven.java:192)
    at org.apache.maven.DefaultMaven.execute (DefaultMaven.java:105)
    at org.apache.maven.cli.MavenCli.execute (MavenCli.java:956)
    at org.apache.maven.cli.MavenCli.doMain (MavenCli.java:288)
    at org.apache.maven.cli.MavenCli.main (MavenCli.java:192)
    at jdk.internal.reflect.NativeMethodAccessorImpl.invoke0 (Native Method)
    at jdk.internal.reflect.NativeMethodAccessorImpl.invoke (NativeMethodAccessorImpl.java:62)
    at jdk.internal.reflect.DelegatingMethodAccessorImpl.invoke (DelegatingMethodAccessorImpl.java:43)
    at java.lang.reflect.Method.invoke (Method.java:567)
    at org.codehaus.plexus.classworlds.launcher.Launcher.launchEnhanced (Launcher.java:282)
    at org.codehaus.plexus.classworlds.launcher.Launcher.launch (Launcher.java:225)
    at org.codehaus.plexus.classworlds.launcher.Launcher.mainWithExitCode (Launcher.java:406)
    at org.codehaus.plexus.classworlds.launcher.Launcher.main (Launcher.java:347)
[ERROR] 
[ERROR] Re-run Maven using the -X switch to enable full debug logging.
[ERROR] 
[ERROR] For more information about the errors and possible solutions, please read the following articles:
[ERROR] [Help 1] http://cwiki.apache.org/confluence/display/MAVEN/MojoFailureException
[Pipeline] }
[Pipeline] // dir
[Pipeline] }
[withMaven] junitPublisher - Archive test results for Maven artifact org.apache.maven.plugins:maven-checkstyle-plugin:maven-plugin:3.1.2-SNAPSHOT generated by maven-surefire-plugin:test (default-test): windows-jdk14-m3.6.x_build\target\surefire-reports\*.xml
Recording test results
[withMaven] openTasksPublisher - Scan Tasks for Maven artifact org.apache.maven.plugins:maven-checkstyle-plugin:maven-plugin:3.1.2-SNAPSHOT in source directory windows-jdk14-m3.6.x_build\src\main\java
[TASKS] Scanning folder 'f:\jenkins\jenkins-slave\workspace\heckstyle-plugin_MCHECKSTYLE-289@2' for files matching the pattern 'windows-jdk14-m3.6.x_build\src\main\java\**\*' - excludes: null
[TASKS] Found 21 files to scan for tasks
[TASKS] Found 5 open tasks.
Skipping warnings blame since pipelines do not have an SCM link.%n
[TASKS] Computing warning deltas based on reference build #4
[withMaven] invokerPublisher - Archive invoker results for Maven artifact MavenArtifact{org.apache.maven.plugins:maven-checkstyle-plugin:maven-plugin:3.1.2-SNAPSHOT(version: 3.1.2-SNAPSHOT, snapshot:false) } generated by PluginInvocation{org.apache.maven.plugins:maven-invoker-plugin:3.2.1@integration-test  integration-test}: windows-jdk14-m3.6.x_build\target\invoker-reports\*.xml
[withMaven] Publishers: Generated Artifacts Publisher: 13 ms, Junit Publisher: 273 ms, Open Task Scanner Publisher: 144 ms, Invoker Publisher: 15345 ms
[Pipeline] // withMaven
[Pipeline] cleanWs
[WS-CLEANUP] Deleting project workspace...
[WS-CLEANUP] Deferred wipeout is used...
[WS-CLEANUP] done
[Pipeline] cleanWs
[WS-CLEANUP] Deleting project workspace...
[WS-CLEANUP] Deferred wipeout is used...
[WS-CLEANUP] done
[Pipeline] }
[Pipeline] // stage
[Pipeline] }
[Pipeline] // ws
[Pipeline] }
[Pipeline] // node
[Pipeline] }
Failed in branch windows-jdk14-m3.6.x_build
[Pipeline] // parallel
[Pipeline] stage
[Pipeline] { (Notifications)
[Pipeline] echo
Build result: FAILURE
[Pipeline] jiraIssueSelector
[Pipeline] echo
The authors of changes [slachiewicz, rfscholte, hboutemy].
[Pipeline] echo
Sending email ...
[Pipeline] emailext

Build failed in Jenkins: Maven TLP » maven-checkstyle-plugin » MCHECKSTYLE-289 #30

Posted by Apache Jenkins Server <je...@builds.apache.org>.
See https://builds.apache.org/job/maven-box/job/maven-checkstyle-plugin/job/MCHECKSTYLE-289/30/

Changes:

* Restore jenkins-win-he-de-1

All tests passed

Build log:
[...truncated 6132 lines...]
[Pipeline] // withMaven
[Pipeline] cleanWs
[WS-CLEANUP] Deleting project workspace...
[WS-CLEANUP] Deferred wipeout is used...
[WS-CLEANUP] done
[Pipeline] cleanWs
[WS-CLEANUP] Deleting project workspace...
[WS-CLEANUP] Deferred wipeout is used...
[WS-CLEANUP] done
[Pipeline] }
[Pipeline] // stage
[Pipeline] }
[Pipeline] // ws
[Pipeline] }
[Pipeline] // node
[Pipeline] }
Failed in branch windows-jdk11-m3.6.x_build
[INFO] run post-build script verify.groovy
[INFO]           checkstyle-report\pom.xml ........................ SUCCESS (17.2 s)
[INFO] Building: inlinerules\pom.xml
[INFO] run post-build script verify.groovy
[INFO]           inlinerules\pom.xml .............................. SUCCESS (5.1 s)
[INFO] Building: MCHECKSTYLE-129\pom.xml
[INFO]           MCHECKSTYLE-129\pom.xml .......................... SUCCESS (16.8 s)
[INFO] Building: MCHECKSTYLE-131\pom.xml
[INFO]           MCHECKSTYLE-131\pom.xml .......................... SUCCESS (4.6 s)
[INFO] Building: MCHECKSTYLE-137\pom.xml
[INFO]           MCHECKSTYLE-137\pom.xml .......................... SUCCESS (4.8 s)
[INFO] Building: MCHECKSTYLE-163\pom.xml
[INFO]           MCHECKSTYLE-163\pom.xml .......................... SUCCESS (4.3 s)
[INFO] Building: MCHECKSTYLE-169\pom.xml
[INFO] run post-build script verify.groovy
[INFO]           MCHECKSTYLE-169\pom.xml .......................... SUCCESS (5.2 s)
[INFO] Building: MCHECKSTYLE-172\pom.xml
[INFO] run post-build script verify.groovy
[INFO]           MCHECKSTYLE-172\pom.xml .......................... SUCCESS (6.5 s)
[INFO] Building: MCHECKSTYLE-173-with-charset\pom.xml
[INFO]           MCHECKSTYLE-173-with-charset\pom.xml ............. SUCCESS (7.6 s)
[INFO] Building: MCHECKSTYLE-173-without-charset\pom.xml
[INFO]           MCHECKSTYLE-173-without-charset\pom.xml .......... SUCCESS (7.5 s)
[INFO] Building: MCHECKSTYLE-193\pom.xml
[INFO]           MCHECKSTYLE-193\pom.xml .......................... SUCCESS (4.5 s)
[INFO] Building: MCHECKSTYLE-214-basedir-resource\pom.xml
[INFO] run post-build script verify.groovy
[INFO]           MCHECKSTYLE-214-basedir-resource\pom.xml ......... SUCCESS (3.6 s)
[INFO] Building: MCHECKSTYLE-219-no-license_failure\pom.xml
[INFO] run post-build script verify.groovy
[INFO]           MCHECKSTYLE-219-no-license_failure\pom.xml ....... SUCCESS (5.1 s)
[INFO] Building: MCHECKSTYLE-219-no-license_success\pom.xml
[INFO] run post-build script verify.groovy
[INFO]           MCHECKSTYLE-219-no-license_success\pom.xml ....... SUCCESS (6.1 s)
[INFO] Building: MCHECKSTYLE-220\pom.xml
[INFO] run post-build script verify.groovy
[INFO]           MCHECKSTYLE-220\pom.xml .......................... SUCCESS (5.9 s)
[INFO] Building: MCHECKSTYLE-222-no-resources\pom.xml
[INFO] run post-build script verify.groovy
[INFO]           MCHECKSTYLE-222-no-resources\pom.xml ............. SUCCESS (4.0 s)
[INFO] Building: MCHECKSTYLE-222-resources\pom.xml
[INFO] run post-build script verify.groovy
[INFO]           MCHECKSTYLE-222-resources\pom.xml ................ SUCCESS (3.7 s)
[INFO] Building: MCHECKSTYLE-222-testResources\pom.xml
[INFO] run post-build script verify.groovy
[INFO]           MCHECKSTYLE-222-testResources\pom.xml ............ SUCCESS (4.4 s)
[INFO] Building: MCHECKSTYLE-224\pom.xml
[INFO] run post-build script verify.groovy
[INFO]           MCHECKSTYLE-224\pom.xml .......................... SUCCESS (9.6 s)
[INFO] Building: MCHECKSTYLE-225-customHeader\pom.xml
[INFO] run post-build script verify.groovy
[INFO]           MCHECKSTYLE-225-customHeader\pom.xml ............. SUCCESS (5.7 s)
[INFO] Building: MCHECKSTYLE-225-LICENSE.txt\pom.xml
[INFO] run post-build script verify.groovy
[INFO]           MCHECKSTYLE-225-LICENSE.txt\pom.xml .............. SUCCESS (6.2 s)
[INFO] Building: MCHECKSTYLE-225-pluginManagement\pom.xml
[INFO] run post-build script verify.groovy
[INFO]           MCHECKSTYLE-225-pluginManagement\pom.xml ......... SUCCESS (5.6 s)
[INFO] Building: MCHECKSTYLE-253-jdk8\pom.xml
[INFO] run post-build script verify.groovy
[INFO]           MCHECKSTYLE-253-jdk8\pom.xml ..................... SUCCESS (5.0 s)
[INFO] Building: MCHECKSTYLE-260-sourceDirectories\pom.xml
[INFO] run post-build script verify.groovy
[INFO]           MCHECKSTYLE-260-sourceDirectories\pom.xml ........ SUCCESS (7.7 s)
[INFO] Building: MCHECKSTYLE-260-testSourceDirectories\pom.xml
[INFO] run post-build script verify.groovy
[INFO]           MCHECKSTYLE-260-testSourceDirectories\pom.xml .... SUCCESS (6.2 s)
[INFO] Building: MCHECKSTYLE-268\pom.xml
[INFO] run post-build script verify.groovy
[INFO]           MCHECKSTYLE-268\pom.xml .......................... SUCCESS (6.2 s)
[INFO] Building: MCHECKSTYLE-289\pom.xml
[INFO] run post-build script verify.groovy
[INFO]   The post-build script did not succeed. f:\jenkins\jenkins-slave\workspace\heckstyle-plugin_MCHECKSTYLE-289@2\windows-jdk14-m3.6.x_build\target\it\MCHECKSTYLE-289\target\site\checkstyle.html (The system cannot find the path specified)
[INFO]           MCHECKSTYLE-289\pom.xml .......................... FAILED (9.1 s)
[INFO] Building: MCHECKSTYLE-295\pom.xml
[INFO] run post-build script verify.groovy
[INFO]           MCHECKSTYLE-295\pom.xml .......................... SUCCESS (5.7 s)
[INFO] Building: MCHECKSTYLE-332_cache-checker\pom.xml
[INFO] run post-build script verify.groovy
[INFO]           MCHECKSTYLE-332_cache-checker\pom.xml ............ SUCCESS (4.8 s)
[INFO] Building: MCHECKSTYLE-337\pom.xml
[INFO] run post-build script verify.groovy
[INFO]           MCHECKSTYLE-337\pom.xml .......................... SUCCESS (6.0 s)
[INFO] Building: MCHECKSTYLE-338\pom.xml
[INFO] run post-build script verify.groovy
[INFO]           MCHECKSTYLE-338\pom.xml .......................... SUCCESS (9.0 s)
[INFO] Building: MCHECKSTYLE-347\pom.xml
[INFO] run post-build script verify.groovy
[INFO]           MCHECKSTYLE-347\pom.xml .......................... SUCCESS (3.8 s)
[INFO] Building: MCHECKSTYLE-357\pom.xml
[INFO] run post-build script verify.groovy
[INFO]           MCHECKSTYLE-357\pom.xml .......................... SUCCESS (7.6 s)
[INFO] Building: MCHECKSTYLE-357-with-header-override\pom.xml
[INFO] run post-build script verify.groovy
[INFO]           MCHECKSTYLE-357-with-header-override\pom.xml ..... SUCCESS (9.6 s)
[INFO] Building: MCHECKSTYLE-365\pom.xml
[INFO] run post-build script verify.groovy
[INFO]           MCHECKSTYLE-365\pom.xml .......................... SUCCESS (7.0 s)
[INFO] Building: MCHECKSTYLE-371\pom.xml
[INFO] run post-build script verify.groovy
[INFO]           MCHECKSTYLE-371\pom.xml .......................... SUCCESS (4.5 s)
[INFO] Building: MCHECKSTYLE-54\pom.xml
[INFO] run pre-build script setup.groovy
[INFO] run post-build script verify.groovy
[INFO]           MCHECKSTYLE-54\pom.xml ........................... SUCCESS (4.0 s)
[INFO] Building: MCHECKSTYLE-70-multi-sourcefolder\pom.xml
[INFO] run post-build script verify.groovy
[INFO]           MCHECKSTYLE-70-multi-sourcefolder\pom.xml ........ SUCCESS (6.6 s)
[INFO] Building: minimal-pom\pom.xml
[INFO] run post-build script verify.bsh
[INFO]           minimal-pom\pom.xml .............................. SUCCESS (7.8 s)
[INFO] Building: multi-modules\pom.xml
[INFO]           multi-modules\pom.xml ............................ SUCCESS (6.0 s)
[INFO] Building: multi-modules-aggregate\pom.xml
[INFO] run post-build script verify.groovy
[INFO]           multi-modules-aggregate\pom.xml .................. SUCCESS (6.2 s)
[INFO] Building: multimoduleproject\pom.xml
[INFO]           multimoduleproject\pom.xml ....................... SUCCESS (4.4 s)
[INFO] 
[INFO] --- maven-checkstyle-plugin:3.0.0:check (checkstyle-check) @ maven-checkstyle-plugin ---
[INFO] There is 1 error reported by Checkstyle 6.18 with config/maven_checks.xml ruleset.
[INFO] Ignored 1 error, 0 violation remaining.
[INFO] 
[INFO] --- maven-invoker-plugin:3.2.1:verify (integration-test) @ maven-checkstyle-plugin ---
[INFO] -------------------------------------------------
[INFO] Build Summary:
[INFO]   Passed: 45, Failed: 1, Errors: 0, Skipped: 0
[INFO] -------------------------------------------------
[ERROR] The following builds failed:
[ERROR] *  MCHECKSTYLE-289\pom.xml
[INFO] -------------------------------------------------
[INFO] ------------------------------------------------------------------------
[INFO] BUILD FAILURE
[INFO] ------------------------------------------------------------------------
[INFO] Total time:  05:45 min
[INFO] Finished at: 2020-05-25T09:59:03-07:00
[INFO] ------------------------------------------------------------------------
[INFO] [jenkins-event-spy] Generated F:\jenkins\jenkins-slave\workspace\heckstyle-plugin_MCHECKSTYLE-289@2@tmp\withMaven41514dd6\maven-spy-20200525-095318-2909649905046666140360.log
[ERROR] Failed to execute goal org.apache.maven.plugins:maven-invoker-plugin:3.2.1:verify (integration-test) on project maven-checkstyle-plugin: 1 build failed. See console output above for details. -> [Help 1]
org.apache.maven.lifecycle.LifecycleExecutionException: Failed to execute goal org.apache.maven.plugins:maven-invoker-plugin:3.2.1:verify (integration-test) on project maven-checkstyle-plugin: 1 build failed. See console output above for details.
    at org.apache.maven.lifecycle.internal.MojoExecutor.execute (MojoExecutor.java:215)
    at org.apache.maven.lifecycle.internal.MojoExecutor.execute (MojoExecutor.java:156)
    at org.apache.maven.lifecycle.internal.MojoExecutor.execute (MojoExecutor.java:148)
    at org.apache.maven.lifecycle.internal.LifecycleModuleBuilder.buildProject (LifecycleModuleBuilder.java:117)
    at org.apache.maven.lifecycle.internal.LifecycleModuleBuilder.buildProject (LifecycleModuleBuilder.java:81)
    at org.apache.maven.lifecycle.internal.builder.singlethreaded.SingleThreadedBuilder.build (SingleThreadedBuilder.java:56)
    at org.apache.maven.lifecycle.internal.LifecycleStarter.execute (LifecycleStarter.java:128)
    at org.apache.maven.DefaultMaven.doExecute (DefaultMaven.java:305)
    at org.apache.maven.DefaultMaven.doExecute (DefaultMaven.java:192)
    at org.apache.maven.DefaultMaven.execute (DefaultMaven.java:105)
    at org.apache.maven.cli.MavenCli.execute (MavenCli.java:956)
    at org.apache.maven.cli.MavenCli.doMain (MavenCli.java:288)
    at org.apache.maven.cli.MavenCli.main (MavenCli.java:192)
    at jdk.internal.reflect.NativeMethodAccessorImpl.invoke0 (Native Method)
    at jdk.internal.reflect.NativeMethodAccessorImpl.invoke (NativeMethodAccessorImpl.java:62)
    at jdk.internal.reflect.DelegatingMethodAccessorImpl.invoke (DelegatingMethodAccessorImpl.java:43)
    at java.lang.reflect.Method.invoke (Method.java:567)
    at org.codehaus.plexus.classworlds.launcher.Launcher.launchEnhanced (Launcher.java:282)
    at org.codehaus.plexus.classworlds.launcher.Launcher.launch (Launcher.java:225)
    at org.codehaus.plexus.classworlds.launcher.Launcher.mainWithExitCode (Launcher.java:406)
    at org.codehaus.plexus.classworlds.launcher.Launcher.main (Launcher.java:347)
Caused by: org.apache.maven.plugin.MojoFailureException: 1 build failed. See console output above for details.
    at org.apache.maven.plugins.invoker.InvokerSession.handleFailures (InvokerSession.java:259)
    at org.apache.maven.plugins.invoker.VerifyMojo.execute (VerifyMojo.java:140)
    at org.apache.maven.plugin.DefaultBuildPluginManager.executeMojo (DefaultBuildPluginManager.java:137)
    at org.apache.maven.lifecycle.internal.MojoExecutor.execute (MojoExecutor.java:210)
    at org.apache.maven.lifecycle.internal.MojoExecutor.execute (MojoExecutor.java:156)
    at org.apache.maven.lifecycle.internal.MojoExecutor.execute (MojoExecutor.java:148)
    at org.apache.maven.lifecycle.internal.LifecycleModuleBuilder.buildProject (LifecycleModuleBuilder.java:117)
    at org.apache.maven.lifecycle.internal.LifecycleModuleBuilder.buildProject (LifecycleModuleBuilder.java:81)
    at org.apache.maven.lifecycle.internal.builder.singlethreaded.SingleThreadedBuilder.build (SingleThreadedBuilder.java:56)
    at org.apache.maven.lifecycle.internal.LifecycleStarter.execute (LifecycleStarter.java:128)
    at org.apache.maven.DefaultMaven.doExecute (DefaultMaven.java:305)
    at org.apache.maven.DefaultMaven.doExecute (DefaultMaven.java:192)
    at org.apache.maven.DefaultMaven.execute (DefaultMaven.java:105)
    at org.apache.maven.cli.MavenCli.execute (MavenCli.java:956)
    at org.apache.maven.cli.MavenCli.doMain (MavenCli.java:288)
    at org.apache.maven.cli.MavenCli.main (MavenCli.java:192)
    at jdk.internal.reflect.NativeMethodAccessorImpl.invoke0 (Native Method)
    at jdk.internal.reflect.NativeMethodAccessorImpl.invoke (NativeMethodAccessorImpl.java:62)
    at jdk.internal.reflect.DelegatingMethodAccessorImpl.invoke (DelegatingMethodAccessorImpl.java:43)
    at java.lang.reflect.Method.invoke (Method.java:567)
    at org.codehaus.plexus.classworlds.launcher.Launcher.launchEnhanced (Launcher.java:282)
    at org.codehaus.plexus.classworlds.launcher.Launcher.launch (Launcher.java:225)
    at org.codehaus.plexus.classworlds.launcher.Launcher.mainWithExitCode (Launcher.java:406)
    at org.codehaus.plexus.classworlds.launcher.Launcher.main (Launcher.java:347)
[ERROR] 
[ERROR] Re-run Maven using the -X switch to enable full debug logging.
[ERROR] 
[ERROR] For more information about the errors and possible solutions, please read the following articles:
[ERROR] [Help 1] http://cwiki.apache.org/confluence/display/MAVEN/MojoFailureException
[Pipeline] }
[Pipeline] // dir
[Pipeline] }
[withMaven] junitPublisher - Archive test results for Maven artifact org.apache.maven.plugins:maven-checkstyle-plugin:maven-plugin:3.1.2-SNAPSHOT generated by maven-surefire-plugin:test (default-test): windows-jdk14-m3.6.x_build\target\surefire-reports\*.xml
Recording test results
[withMaven] openTasksPublisher - Scan Tasks for Maven artifact org.apache.maven.plugins:maven-checkstyle-plugin:maven-plugin:3.1.2-SNAPSHOT in source directory windows-jdk14-m3.6.x_build\src\main\java
[TASKS] Scanning folder 'f:\jenkins\jenkins-slave\workspace\heckstyle-plugin_MCHECKSTYLE-289@2' for files matching the pattern 'windows-jdk14-m3.6.x_build\src\main\java\**\*' - excludes: null
[TASKS] Found 21 files to scan for tasks
[TASKS] Found 5 open tasks.
Skipping warnings blame since pipelines do not have an SCM link.%n
[TASKS] Computing warning deltas based on reference build #4
[withMaven] invokerPublisher - Archive invoker results for Maven artifact MavenArtifact{org.apache.maven.plugins:maven-checkstyle-plugin:maven-plugin:3.1.2-SNAPSHOT(version: 3.1.2-SNAPSHOT, snapshot:false) } generated by PluginInvocation{org.apache.maven.plugins:maven-invoker-plugin:3.2.1@integration-test  integration-test}: windows-jdk14-m3.6.x_build\target\invoker-reports\*.xml
[withMaven] Publishers: Generated Artifacts Publisher: 15 ms, Junit Publisher: 305 ms, Open Task Scanner Publisher: 173 ms, Invoker Publisher: 15964 ms
[Pipeline] // withMaven
[Pipeline] cleanWs
[WS-CLEANUP] Deleting project workspace...
[WS-CLEANUP] Deferred wipeout is used...
[WS-CLEANUP] done
[Pipeline] cleanWs
[WS-CLEANUP] Deleting project workspace...
[WS-CLEANUP] Deferred wipeout is used...
[WS-CLEANUP] done
[Pipeline] }
[Pipeline] // stage
[Pipeline] }
[Pipeline] // ws
[Pipeline] }
[Pipeline] // node
[Pipeline] }
Failed in branch windows-jdk14-m3.6.x_build
[Pipeline] // parallel
[Pipeline] stage
[Pipeline] { (Notifications)
[Pipeline] echo
Build result: FAILURE
[Pipeline] jiraIssueSelector
[Pipeline] echo
The authors of changes [rfscholte].
[Pipeline] echo
Sending email ...
[Pipeline] emailext