You are viewing a plain text version of this content. The canonical link for it is here.
Posted to dev@kafka.apache.org by Apache Jenkins Server <je...@builds.apache.org> on 2019/07/18 06:52:47 UTC

Build failed in Jenkins: kafka-trunk-jdk8 #3797

See <https://builds.apache.org/job/kafka-trunk-jdk8/3797/display/redirect>

------------------------------------------
Started by an SCM change
Started by an SCM change
Started by an SCM change
Started by an SCM change
Started by an SCM change
Started by an SCM change
Started by an SCM change
Started by an SCM change
[EnvInject] - Loading node environment variables.
Building remotely on H35 (ubuntu xenial) in workspace <https://builds.apache.org/job/kafka-trunk-jdk8/ws/>
[WS-CLEANUP] Deleting project workspace...
[WS-CLEANUP] Deferred wipeout is used...
[WS-CLEANUP] Done
No credentials specified
Cloning the remote Git repository
Cloning repository https://github.com/apache/kafka.git
 > git init <https://builds.apache.org/job/kafka-trunk-jdk8/ws/> # timeout=10
Fetching upstream changes from https://github.com/apache/kafka.git
 > git --version # timeout=10
 > git fetch --tags --progress https://github.com/apache/kafka.git +refs/heads/*:refs/remotes/origin/*
ERROR: Error cloning remote repo 'origin'
hudson.plugins.git.GitException: Command "git fetch --tags --progress https://github.com/apache/kafka.git +refs/heads/*:refs/remotes/origin/*" returned status code 128:
stdout: 
stderr: fatal: unable to access 'https://github.com/apache/kafka.git/': Could not resolve host: github.com

	at org.jenkinsci.plugins.gitclient.CliGitAPIImpl.launchCommandIn(CliGitAPIImpl.java:2042)
	at org.jenkinsci.plugins.gitclient.CliGitAPIImpl.launchCommandWithCredentials(CliGitAPIImpl.java:1761)
	at org.jenkinsci.plugins.gitclient.CliGitAPIImpl.access$400(CliGitAPIImpl.java:72)
	at org.jenkinsci.plugins.gitclient.CliGitAPIImpl$1.execute(CliGitAPIImpl.java:442)
	at org.jenkinsci.plugins.gitclient.CliGitAPIImpl$2.execute(CliGitAPIImpl.java:655)
	at org.jenkinsci.plugins.gitclient.RemoteGitImpl$CommandInvocationHandler$1.call(RemoteGitImpl.java:153)
	at org.jenkinsci.plugins.gitclient.RemoteGitImpl$CommandInvocationHandler$1.call(RemoteGitImpl.java:146)
	at hudson.remoting.UserRequest.perform(UserRequest.java:212)
	at hudson.remoting.UserRequest.perform(UserRequest.java:54)
	at hudson.remoting.Request$2.run(Request.java:369)
	at hudson.remoting.InterceptingExecutorService$1.call(InterceptingExecutorService.java:72)
	at java.util.concurrent.FutureTask.run(FutureTask.java:266)
	at java.util.concurrent.ThreadPoolExecutor.runWorker(ThreadPoolExecutor.java:1142)
	at java.util.concurrent.ThreadPoolExecutor$Worker.run(ThreadPoolExecutor.java:617)
	at java.lang.Thread.run(Thread.java:748)
	Suppressed: hudson.remoting.Channel$CallSiteStackTrace: Remote call to H35
		at hudson.remoting.Channel.attachCallSiteStackTrace(Channel.java:1741)
		at hudson.remoting.UserRequest$ExceptionResponse.retrieve(UserRequest.java:357)
		at hudson.remoting.Channel.call(Channel.java:955)
		at org.jenkinsci.plugins.gitclient.RemoteGitImpl$CommandInvocationHandler.execute(RemoteGitImpl.java:146)
		at sun.reflect.GeneratedMethodAccessor974.invoke(Unknown Source)
		at sun.reflect.DelegatingMethodAccessorImpl.invoke(DelegatingMethodAccessorImpl.java:43)
		at java.lang.reflect.Method.invoke(Method.java:498)
		at org.jenkinsci.plugins.gitclient.RemoteGitImpl$CommandInvocationHandler.invoke(RemoteGitImpl.java:132)
		at com.sun.proxy.$Proxy135.execute(Unknown Source)
		at hudson.plugins.git.GitSCM.retrieveChanges(GitSCM.java:1152)
		at hudson.plugins.git.GitSCM.checkout(GitSCM.java:1192)
		at hudson.scm.SCM.checkout(SCM.java:504)
		at hudson.model.AbstractProject.checkout(AbstractProject.java:1208)
		at hudson.model.AbstractBuild$AbstractBuildExecution.defaultCheckout(AbstractBuild.java:574)
		at jenkins.scm.SCMCheckoutStrategy.checkout(SCMCheckoutStrategy.java:86)
		at hudson.model.AbstractBuild$AbstractBuildExecution.run(AbstractBuild.java:499)
		at hudson.model.Run.execute(Run.java:1810)
		at hudson.model.FreeStyleBuild.run(FreeStyleBuild.java:43)
		at hudson.model.ResourceController.execute(ResourceController.java:97)
		at hudson.model.Executor.run(Executor.java:429)
ERROR: Error cloning remote repo 'origin'
Retrying after 10 seconds
No credentials specified
 > git rev-parse --is-inside-work-tree # timeout=10
Fetching changes from the remote Git repository
 > git config remote.origin.url https://github.com/apache/kafka.git # timeout=10
Fetching upstream changes from https://github.com/apache/kafka.git
 > git --version # timeout=10
 > git fetch --tags --progress https://github.com/apache/kafka.git +refs/heads/*:refs/remotes/origin/*
ERROR: Error fetching remote repo 'origin'
hudson.plugins.git.GitException: Failed to fetch from https://github.com/apache/kafka.git
	at hudson.plugins.git.GitSCM.fetchFrom(GitSCM.java:894)
	at hudson.plugins.git.GitSCM.retrieveChanges(GitSCM.java:1161)
	at hudson.plugins.git.GitSCM.checkout(GitSCM.java:1192)
	at hudson.scm.SCM.checkout(SCM.java:504)
	at hudson.model.AbstractProject.checkout(AbstractProject.java:1208)
	at hudson.model.AbstractBuild$AbstractBuildExecution.defaultCheckout(AbstractBuild.java:574)
	at jenkins.scm.SCMCheckoutStrategy.checkout(SCMCheckoutStrategy.java:86)
	at hudson.model.AbstractBuild$AbstractBuildExecution.run(AbstractBuild.java:499)
	at hudson.model.Run.execute(Run.java:1810)
	at hudson.model.FreeStyleBuild.run(FreeStyleBuild.java:43)
	at hudson.model.ResourceController.execute(ResourceController.java:97)
	at hudson.model.Executor.run(Executor.java:429)
Caused by: hudson.plugins.git.GitException: Command "git fetch --tags --progress https://github.com/apache/kafka.git +refs/heads/*:refs/remotes/origin/*" returned status code 128:
stdout: 
stderr: fatal: unable to access 'https://github.com/apache/kafka.git/': Could not resolve host: github.com

	at org.jenkinsci.plugins.gitclient.CliGitAPIImpl.launchCommandIn(CliGitAPIImpl.java:2042)
	at org.jenkinsci.plugins.gitclient.CliGitAPIImpl.launchCommandWithCredentials(CliGitAPIImpl.java:1761)
	at org.jenkinsci.plugins.gitclient.CliGitAPIImpl.access$400(CliGitAPIImpl.java:72)
	at org.jenkinsci.plugins.gitclient.CliGitAPIImpl$1.execute(CliGitAPIImpl.java:442)
	at org.jenkinsci.plugins.gitclient.RemoteGitImpl$CommandInvocationHandler$1.call(RemoteGitImpl.java:153)
	at org.jenkinsci.plugins.gitclient.RemoteGitImpl$CommandInvocationHandler$1.call(RemoteGitImpl.java:146)
	at hudson.remoting.UserRequest.perform(UserRequest.java:212)
	at hudson.remoting.UserRequest.perform(UserRequest.java:54)
	at hudson.remoting.Request$2.run(Request.java:369)
	at hudson.remoting.InterceptingExecutorService$1.call(InterceptingExecutorService.java:72)
	at java.util.concurrent.FutureTask.run(FutureTask.java:266)
	at java.util.concurrent.ThreadPoolExecutor.runWorker(ThreadPoolExecutor.java:1142)
	at java.util.concurrent.ThreadPoolExecutor$Worker.run(ThreadPoolExecutor.java:617)
	at java.lang.Thread.run(Thread.java:748)
	Suppressed: hudson.remoting.Channel$CallSiteStackTrace: Remote call to H35
		at hudson.remoting.Channel.attachCallSiteStackTrace(Channel.java:1741)
		at hudson.remoting.UserRequest$ExceptionResponse.retrieve(UserRequest.java:357)
		at hudson.remoting.Channel.call(Channel.java:955)
		at org.jenkinsci.plugins.gitclient.RemoteGitImpl$CommandInvocationHandler.execute(RemoteGitImpl.java:146)
		at sun.reflect.GeneratedMethodAccessor974.invoke(Unknown Source)
		at sun.reflect.DelegatingMethodAccessorImpl.invoke(DelegatingMethodAccessorImpl.java:43)
		at java.lang.reflect.Method.invoke(Method.java:498)
		at org.jenkinsci.plugins.gitclient.RemoteGitImpl$CommandInvocationHandler.invoke(RemoteGitImpl.java:132)
		at com.sun.proxy.$Proxy115.execute(Unknown Source)
		at hudson.plugins.git.GitSCM.fetchFrom(GitSCM.java:892)
		at hudson.plugins.git.GitSCM.retrieveChanges(GitSCM.java:1161)
		at hudson.plugins.git.GitSCM.checkout(GitSCM.java:1192)
		at hudson.scm.SCM.checkout(SCM.java:504)
		at hudson.model.AbstractProject.checkout(AbstractProject.java:1208)
		at hudson.model.AbstractBuild$AbstractBuildExecution.defaultCheckout(AbstractBuild.java:574)
		at jenkins.scm.SCMCheckoutStrategy.checkout(SCMCheckoutStrategy.java:86)
		at hudson.model.AbstractBuild$AbstractBuildExecution.run(AbstractBuild.java:499)
		at hudson.model.Run.execute(Run.java:1810)
		at hudson.model.FreeStyleBuild.run(FreeStyleBuild.java:43)
		at hudson.model.ResourceController.execute(ResourceController.java:97)
		at hudson.model.Executor.run(Executor.java:429)
ERROR: Error fetching remote repo 'origin'
Retrying after 10 seconds
No credentials specified
 > git rev-parse --is-inside-work-tree # timeout=10
Fetching changes from the remote Git repository
 > git config remote.origin.url https://github.com/apache/kafka.git # timeout=10
Fetching upstream changes from https://github.com/apache/kafka.git
 > git --version # timeout=10
 > git fetch --tags --progress https://github.com/apache/kafka.git +refs/heads/*:refs/remotes/origin/*
ERROR: Error fetching remote repo 'origin'
hudson.plugins.git.GitException: Failed to fetch from https://github.com/apache/kafka.git
	at hudson.plugins.git.GitSCM.fetchFrom(GitSCM.java:894)
	at hudson.plugins.git.GitSCM.retrieveChanges(GitSCM.java:1161)
	at hudson.plugins.git.GitSCM.checkout(GitSCM.java:1192)
	at hudson.scm.SCM.checkout(SCM.java:504)
	at hudson.model.AbstractProject.checkout(AbstractProject.java:1208)
	at hudson.model.AbstractBuild$AbstractBuildExecution.defaultCheckout(AbstractBuild.java:574)
	at jenkins.scm.SCMCheckoutStrategy.checkout(SCMCheckoutStrategy.java:86)
	at hudson.model.AbstractBuild$AbstractBuildExecution.run(AbstractBuild.java:499)
	at hudson.model.Run.execute(Run.java:1810)
	at hudson.model.FreeStyleBuild.run(FreeStyleBuild.java:43)
	at hudson.model.ResourceController.execute(ResourceController.java:97)
	at hudson.model.Executor.run(Executor.java:429)
Caused by: hudson.plugins.git.GitException: Command "git fetch --tags --progress https://github.com/apache/kafka.git +refs/heads/*:refs/remotes/origin/*" returned status code 128:
stdout: 
stderr: fatal: unable to access 'https://github.com/apache/kafka.git/': Could not resolve host: github.com

	at org.jenkinsci.plugins.gitclient.CliGitAPIImpl.launchCommandIn(CliGitAPIImpl.java:2042)
	at org.jenkinsci.plugins.gitclient.CliGitAPIImpl.launchCommandWithCredentials(CliGitAPIImpl.java:1761)
	at org.jenkinsci.plugins.gitclient.CliGitAPIImpl.access$400(CliGitAPIImpl.java:72)
	at org.jenkinsci.plugins.gitclient.CliGitAPIImpl$1.execute(CliGitAPIImpl.java:442)
	at org.jenkinsci.plugins.gitclient.RemoteGitImpl$CommandInvocationHandler$1.call(RemoteGitImpl.java:153)
	at org.jenkinsci.plugins.gitclient.RemoteGitImpl$CommandInvocationHandler$1.call(RemoteGitImpl.java:146)
	at hudson.remoting.UserRequest.perform(UserRequest.java:212)
	at hudson.remoting.UserRequest.perform(UserRequest.java:54)
	at hudson.remoting.Request$2.run(Request.java:369)
	at hudson.remoting.InterceptingExecutorService$1.call(InterceptingExecutorService.java:72)
	at java.util.concurrent.FutureTask.run(FutureTask.java:266)
	at java.util.concurrent.ThreadPoolExecutor.runWorker(ThreadPoolExecutor.java:1142)
	at java.util.concurrent.ThreadPoolExecutor$Worker.run(ThreadPoolExecutor.java:617)
	at java.lang.Thread.run(Thread.java:748)
	Suppressed: hudson.remoting.Channel$CallSiteStackTrace: Remote call to H35
		at hudson.remoting.Channel.attachCallSiteStackTrace(Channel.java:1741)
		at hudson.remoting.UserRequest$ExceptionResponse.retrieve(UserRequest.java:357)
		at hudson.remoting.Channel.call(Channel.java:955)
		at org.jenkinsci.plugins.gitclient.RemoteGitImpl$CommandInvocationHandler.execute(RemoteGitImpl.java:146)
		at sun.reflect.GeneratedMethodAccessor974.invoke(Unknown Source)
		at sun.reflect.DelegatingMethodAccessorImpl.invoke(DelegatingMethodAccessorImpl.java:43)
		at java.lang.reflect.Method.invoke(Method.java:498)
		at org.jenkinsci.plugins.gitclient.RemoteGitImpl$CommandInvocationHandler.invoke(RemoteGitImpl.java:132)
		at com.sun.proxy.$Proxy115.execute(Unknown Source)
		at hudson.plugins.git.GitSCM.fetchFrom(GitSCM.java:892)
		at hudson.plugins.git.GitSCM.retrieveChanges(GitSCM.java:1161)
		at hudson.plugins.git.GitSCM.checkout(GitSCM.java:1192)
		at hudson.scm.SCM.checkout(SCM.java:504)
		at hudson.model.AbstractProject.checkout(AbstractProject.java:1208)
		at hudson.model.AbstractBuild$AbstractBuildExecution.defaultCheckout(AbstractBuild.java:574)
		at jenkins.scm.SCMCheckoutStrategy.checkout(SCMCheckoutStrategy.java:86)
		at hudson.model.AbstractBuild$AbstractBuildExecution.run(AbstractBuild.java:499)
		at hudson.model.Run.execute(Run.java:1810)
		at hudson.model.FreeStyleBuild.run(FreeStyleBuild.java:43)
		at hudson.model.ResourceController.execute(ResourceController.java:97)
		at hudson.model.Executor.run(Executor.java:429)
ERROR: Error fetching remote repo 'origin'
[FINDBUGS] Collecting findbugs analysis files...
[FINDBUGS] Searching for all files in <https://builds.apache.org/job/kafka-trunk-jdk8/ws/> that match the pattern **/build/reports/*bugs/*.xml
[FINDBUGS] No files found. Configuration error?
No credentials specified
<Git Blamer> Using GitBlamer to create author and commit information for all warnings.
<Git Blamer> GIT_COMMIT=53b10a37a42769b0c1b91c3a66fbe7f60917cab5, workspace=<https://builds.apache.org/job/kafka-trunk-jdk8/ws/>
[FINDBUGS] Computing warning deltas based on reference build #3796
Recording test results
ERROR: Step ?Publish JUnit test result report? failed: No test report files were found. Configuration error?

Jenkins build is back to normal : kafka-trunk-jdk8 #3819

Posted by Apache Jenkins Server <je...@builds.apache.org>.
See <https://builds.apache.org/job/kafka-trunk-jdk8/3819/display/redirect?page=changes>


Build failed in Jenkins: kafka-trunk-jdk8 #3818

Posted by Apache Jenkins Server <je...@builds.apache.org>.
See <https://builds.apache.org/job/kafka-trunk-jdk8/3818/display/redirect>

------------------------------------------
[...truncated 6.46 MB...]

org.apache.kafka.connect.json.JsonConverterTest > structToConnect PASSED

org.apache.kafka.connect.json.JsonConverterTest > stringToJson STARTED

org.apache.kafka.connect.json.JsonConverterTest > stringToJson PASSED

org.apache.kafka.connect.json.JsonConverterTest > nullSchemaAndArrayToJson STARTED

org.apache.kafka.connect.json.JsonConverterTest > nullSchemaAndArrayToJson PASSED

org.apache.kafka.connect.json.JsonConverterTest > byteToConnect STARTED

org.apache.kafka.connect.json.JsonConverterTest > byteToConnect PASSED

org.apache.kafka.connect.json.JsonConverterTest > nullSchemaPrimitiveToConnect STARTED

org.apache.kafka.connect.json.JsonConverterTest > nullSchemaPrimitiveToConnect PASSED

org.apache.kafka.connect.json.JsonConverterTest > byteToJson STARTED

org.apache.kafka.connect.json.JsonConverterTest > byteToJson PASSED

org.apache.kafka.connect.json.JsonConverterTest > intToConnect STARTED

org.apache.kafka.connect.json.JsonConverterTest > intToConnect PASSED

org.apache.kafka.connect.json.JsonConverterTest > dateToJson STARTED

org.apache.kafka.connect.json.JsonConverterTest > dateToJson PASSED

org.apache.kafka.connect.json.JsonConverterTest > noSchemaToConnect STARTED

org.apache.kafka.connect.json.JsonConverterTest > noSchemaToConnect PASSED

org.apache.kafka.connect.json.JsonConverterTest > noSchemaToJson STARTED

org.apache.kafka.connect.json.JsonConverterTest > noSchemaToJson PASSED

org.apache.kafka.connect.json.JsonConverterTest > nullSchemaAndPrimitiveToJson STARTED

org.apache.kafka.connect.json.JsonConverterTest > nullSchemaAndPrimitiveToJson PASSED

org.apache.kafka.connect.json.JsonConverterTest > decimalToConnectOptionalWithDefaultValue STARTED

org.apache.kafka.connect.json.JsonConverterTest > decimalToConnectOptionalWithDefaultValue PASSED

org.apache.kafka.connect.json.JsonConverterTest > mapToJsonStringKeys STARTED

org.apache.kafka.connect.json.JsonConverterTest > mapToJsonStringKeys PASSED

org.apache.kafka.connect.json.JsonConverterTest > arrayToJson STARTED

org.apache.kafka.connect.json.JsonConverterTest > arrayToJson PASSED

org.apache.kafka.connect.json.JsonConverterTest > nullToConnect STARTED

org.apache.kafka.connect.json.JsonConverterTest > nullToConnect PASSED

org.apache.kafka.connect.json.JsonConverterTest > timeToJson STARTED

org.apache.kafka.connect.json.JsonConverterTest > timeToJson PASSED

org.apache.kafka.connect.json.JsonConverterTest > structToJson STARTED

org.apache.kafka.connect.json.JsonConverterTest > structToJson PASSED

org.apache.kafka.connect.json.JsonConverterTest > testConnectSchemaMetadataTranslation STARTED

org.apache.kafka.connect.json.JsonConverterTest > testConnectSchemaMetadataTranslation PASSED

org.apache.kafka.connect.json.JsonConverterTest > shortToJson STARTED

org.apache.kafka.connect.json.JsonConverterTest > shortToJson PASSED

org.apache.kafka.connect.json.JsonConverterTest > dateToConnect STARTED

org.apache.kafka.connect.json.JsonConverterTest > dateToConnect PASSED

org.apache.kafka.connect.json.JsonConverterTest > doubleToJson STARTED

org.apache.kafka.connect.json.JsonConverterTest > doubleToJson PASSED

org.apache.kafka.connect.json.JsonConverterTest > testStringHeaderToJson STARTED

org.apache.kafka.connect.json.JsonConverterTest > testStringHeaderToJson PASSED

org.apache.kafka.connect.json.JsonConverterTest > decimalToConnectOptional STARTED

org.apache.kafka.connect.json.JsonConverterTest > decimalToConnectOptional PASSED

org.apache.kafka.connect.json.JsonConverterTest > structSchemaIdentical STARTED

org.apache.kafka.connect.json.JsonConverterTest > structSchemaIdentical PASSED

org.apache.kafka.connect.json.JsonConverterTest > timeToConnectWithDefaultValue STARTED

org.apache.kafka.connect.json.JsonConverterTest > timeToConnectWithDefaultValue PASSED

org.apache.kafka.connect.json.JsonConverterTest > timeToConnect STARTED

org.apache.kafka.connect.json.JsonConverterTest > timeToConnect PASSED

org.apache.kafka.connect.json.JsonConverterTest > dateToConnectOptionalWithDefaultValue STARTED

org.apache.kafka.connect.json.JsonConverterTest > dateToConnectOptionalWithDefaultValue PASSED

org.apache.kafka.connect.json.JsonConverterTest > mapToConnectStringKeys STARTED

org.apache.kafka.connect.json.JsonConverterTest > mapToConnectStringKeys PASSED

org.apache.kafka.connect.json.JsonConverterTest > dateToConnectOptional STARTED

org.apache.kafka.connect.json.JsonConverterTest > dateToConnectOptional PASSED

org.apache.kafka.connect.json.JsonConverterTest > timeToConnectOptionalWithDefaultValue STARTED

org.apache.kafka.connect.json.JsonConverterTest > timeToConnectOptionalWithDefaultValue PASSED

org.apache.kafka.connect.json.JsonConverterTest > floatToConnect STARTED

org.apache.kafka.connect.json.JsonConverterTest > floatToConnect PASSED

org.apache.kafka.connect.json.JsonConverterTest > decimalToConnectWithDefaultValue STARTED

org.apache.kafka.connect.json.JsonConverterTest > decimalToConnectWithDefaultValue PASSED

org.apache.kafka.connect.json.JsonConverterTest > decimalToJson STARTED

org.apache.kafka.connect.json.JsonConverterTest > decimalToJson PASSED

org.apache.kafka.connect.json.JsonConverterTest > arrayToConnect STARTED

org.apache.kafka.connect.json.JsonConverterTest > arrayToConnect PASSED

org.apache.kafka.connect.json.JsonConverterTest > testCacheSchemaToConnectConversion STARTED

org.apache.kafka.connect.json.JsonConverterTest > testCacheSchemaToConnectConversion PASSED

org.apache.kafka.connect.json.JsonConverterTest > booleanToJson STARTED

org.apache.kafka.connect.json.JsonConverterTest > booleanToJson PASSED

org.apache.kafka.connect.json.JsonConverterTest > bytesToConnect STARTED

org.apache.kafka.connect.json.JsonConverterTest > bytesToConnect PASSED

org.apache.kafka.connect.json.JsonConverterTest > doubleToConnect STARTED

org.apache.kafka.connect.json.JsonConverterTest > doubleToConnect PASSED

org.apache.kafka.connect.json.JsonConverterTest > timestampToConnectOptionalWithDefaultValue STARTED

org.apache.kafka.connect.json.JsonConverterTest > timestampToConnectOptionalWithDefaultValue PASSED

> Task :connect:basic-auth-extension:test

org.apache.kafka.connect.rest.basic.auth.extension.JaasBasicAuthFilterTest > testSuccess STARTED

org.apache.kafka.connect.rest.basic.auth.extension.JaasBasicAuthFilterTest > testSuccess PASSED

org.apache.kafka.connect.rest.basic.auth.extension.JaasBasicAuthFilterTest > testBadCredential STARTED

org.apache.kafka.connect.rest.basic.auth.extension.JaasBasicAuthFilterTest > testBadCredential PASSED

org.apache.kafka.connect.rest.basic.auth.extension.JaasBasicAuthFilterTest > testBadPassword STARTED

org.apache.kafka.connect.rest.basic.auth.extension.JaasBasicAuthFilterTest > testBadPassword PASSED

org.apache.kafka.connect.rest.basic.auth.extension.JaasBasicAuthFilterTest > testUnknownBearer STARTED

org.apache.kafka.connect.rest.basic.auth.extension.JaasBasicAuthFilterTest > testUnknownBearer PASSED

org.apache.kafka.connect.rest.basic.auth.extension.JaasBasicAuthFilterTest > testUnknownLoginModule STARTED

org.apache.kafka.connect.rest.basic.auth.extension.JaasBasicAuthFilterTest > testUnknownLoginModule PASSED

org.apache.kafka.connect.rest.basic.auth.extension.JaasBasicAuthFilterTest > testUnknownCredentialsFile STARTED

org.apache.kafka.connect.rest.basic.auth.extension.JaasBasicAuthFilterTest > testUnknownCredentialsFile PASSED

org.apache.kafka.connect.rest.basic.auth.extension.JaasBasicAuthFilterTest > testEmptyCredentialsFile STARTED

org.apache.kafka.connect.rest.basic.auth.extension.JaasBasicAuthFilterTest > testEmptyCredentialsFile PASSED

org.apache.kafka.connect.rest.basic.auth.extension.JaasBasicAuthFilterTest > testNoFileOption STARTED

org.apache.kafka.connect.rest.basic.auth.extension.JaasBasicAuthFilterTest > testNoFileOption PASSED

org.apache.kafka.connect.rest.basic.auth.extension.JaasBasicAuthFilterTest > testPostWithoutAppropriateCredential STARTED

org.apache.kafka.connect.rest.basic.auth.extension.JaasBasicAuthFilterTest > testPostWithoutAppropriateCredential PASSED

org.apache.kafka.connect.rest.basic.auth.extension.JaasBasicAuthFilterTest > testPostNotChangingConnectorTask STARTED

org.apache.kafka.connect.rest.basic.auth.extension.JaasBasicAuthFilterTest > testPostNotChangingConnectorTask PASSED

FAILURE: Build failed with an exception.

* What went wrong:
Execution failed for task ':connect:runtime:test'.
> There were failing tests. See the report at: file://<https://builds.apache.org/job/kafka-trunk-jdk8/ws/connect/runtime/build/reports/tests/test/index.html>

* Try:
Run with --stacktrace option to get the stack trace. Run with --info or --debug option to get more log output. Run with --scan to get full insights.

* Get more help at https://help.gradle.org

Deprecated Gradle features were used in this build, making it incompatible with Gradle 6.0.
Use '--warning-mode all' to show the individual deprecation warnings.
See https://docs.gradle.org/5.4.1/userguide/command_line_interface.html#sec:command_line_warnings

BUILD FAILED in 3h 22m 11s
178 actionable tasks: 175 executed, 3 up-to-date
Build step 'Execute shell' marked build as failure
[FINDBUGS] Collecting findbugs analysis files...
Setting GRADLE_4_10_3_HOME=/home/jenkins/tools/gradle/4.10.3
[FINDBUGS] Searching for all files in <https://builds.apache.org/job/kafka-trunk-jdk8/ws/> that match the pattern **/build/reports/*bugs/*.xml
[FINDBUGS] Parsing 17 files in <https://builds.apache.org/job/kafka-trunk-jdk8/ws/>
[FINDBUGS] Successfully parsed file <https://builds.apache.org/job/kafka-trunk-jdk8/ws/clients/build/reports/spotbugs/main.xml> with 0 unique warnings and 0 duplicates.
[FINDBUGS] Successfully parsed file <https://builds.apache.org/job/kafka-trunk-jdk8/ws/connect/api/build/reports/spotbugs/main.xml> with 0 unique warnings and 0 duplicates.
[FINDBUGS] Successfully parsed file <https://builds.apache.org/job/kafka-trunk-jdk8/ws/connect/basic-auth-extension/build/reports/spotbugs/main.xml> with 0 unique warnings and 0 duplicates.
[FINDBUGS] Successfully parsed file <https://builds.apache.org/job/kafka-trunk-jdk8/ws/connect/file/build/reports/spotbugs/main.xml> with 0 unique warnings and 0 duplicates.
[FINDBUGS] Successfully parsed file <https://builds.apache.org/job/kafka-trunk-jdk8/ws/connect/json/build/reports/spotbugs/main.xml> with 0 unique warnings and 0 duplicates.
[FINDBUGS] Successfully parsed file <https://builds.apache.org/job/kafka-trunk-jdk8/ws/connect/runtime/build/reports/spotbugs/main.xml> with 0 unique warnings and 0 duplicates.
[FINDBUGS] Successfully parsed file <https://builds.apache.org/job/kafka-trunk-jdk8/ws/connect/transforms/build/reports/spotbugs/main.xml> with 0 unique warnings and 0 duplicates.
[FINDBUGS] Successfully parsed file <https://builds.apache.org/job/kafka-trunk-jdk8/ws/core/build/reports/spotbugs/main.xml> with 0 unique warnings and 0 duplicates.
[FINDBUGS] Successfully parsed file <https://builds.apache.org/job/kafka-trunk-jdk8/ws/examples/build/reports/spotbugs/main.xml> with 0 unique warnings and 0 duplicates.
[FINDBUGS] Successfully parsed file <https://builds.apache.org/job/kafka-trunk-jdk8/ws/generator/build/reports/spotbugs/main.xml> with 0 unique warnings and 0 duplicates.
[FINDBUGS] Successfully parsed file <https://builds.apache.org/job/kafka-trunk-jdk8/ws/jmh-benchmarks/build/reports/spotbugs/main.xml> with 0 unique warnings and 0 duplicates.
[FINDBUGS] Successfully parsed file <https://builds.apache.org/job/kafka-trunk-jdk8/ws/log4j-appender/build/reports/spotbugs/main.xml> with 0 unique warnings and 0 duplicates.
[FINDBUGS] Successfully parsed file <https://builds.apache.org/job/kafka-trunk-jdk8/ws/streams/build/reports/spotbugs/main.xml> with 0 unique warnings and 0 duplicates.
[FINDBUGS] Successfully parsed file <https://builds.apache.org/job/kafka-trunk-jdk8/ws/streams/examples/build/reports/spotbugs/main.xml> with 0 unique warnings and 0 duplicates.
[FINDBUGS] Successfully parsed file <https://builds.apache.org/job/kafka-trunk-jdk8/ws/streams/streams-scala/build/reports/spotbugs/main.xml> with 0 unique warnings and 0 duplicates.
[FINDBUGS] Successfully parsed file <https://builds.apache.org/job/kafka-trunk-jdk8/ws/streams/test-utils/build/reports/spotbugs/main.xml> with 0 unique warnings and 0 duplicates.
[FINDBUGS] Successfully parsed file <https://builds.apache.org/job/kafka-trunk-jdk8/ws/tools/build/reports/spotbugs/main.xml> with 0 unique warnings and 0 duplicates.
Setting GRADLE_4_10_3_HOME=/home/jenkins/tools/gradle/4.10.3
No credentials specified
Setting GRADLE_4_10_3_HOME=/home/jenkins/tools/gradle/4.10.3
<Git Blamer> Using GitBlamer to create author and commit information for all warnings.
<Git Blamer> GIT_COMMIT=81900d0ba0a5839a1e5dc876897bab1c24b3bd94, workspace=<https://builds.apache.org/job/kafka-trunk-jdk8/ws/>
[FINDBUGS] Computing warning deltas based on reference build #3796
Recording test results
Setting GRADLE_4_10_3_HOME=/home/jenkins/tools/gradle/4.10.3
Setting GRADLE_4_10_3_HOME=/home/jenkins/tools/gradle/4.10.3
Not sending mail to unregistered user ismael@juma.me.uk
Not sending mail to unregistered user noreply@github.com
Not sending mail to unregistered user wangguoz@gmail.com
Not sending mail to unregistered user rajinisivaram@googlemail.com

Build failed in Jenkins: kafka-trunk-jdk8 #3817

Posted by Apache Jenkins Server <je...@builds.apache.org>.
See <https://builds.apache.org/job/kafka-trunk-jdk8/3817/display/redirect?page=changes>

Changes:

[cmccabe] KAFKA-8345: KIP-455 Protocol changes (part 1) (#7114)

------------------------------------------
[...truncated 6.47 MB...]

org.apache.kafka.connect.data.SchemaProjectorTest > testStructAddField PASSED

org.apache.kafka.connect.data.SchemaProjectorTest > testStructRemoveField STARTED

org.apache.kafka.connect.data.SchemaProjectorTest > testStructRemoveField PASSED

org.apache.kafka.connect.data.SchemaProjectorTest > testStructDefaultValue STARTED

org.apache.kafka.connect.data.SchemaProjectorTest > testStructDefaultValue PASSED

org.apache.kafka.connect.data.SchemaProjectorTest > testProjectMissingDefaultValuedStructField STARTED

org.apache.kafka.connect.data.SchemaProjectorTest > testProjectMissingDefaultValuedStructField PASSED

org.apache.kafka.connect.data.SchemaProjectorTest > testPrimitiveOptionalProjection STARTED

org.apache.kafka.connect.data.SchemaProjectorTest > testPrimitiveOptionalProjection PASSED

org.apache.kafka.connect.data.SchemaProjectorTest > testProjectMissingOptionalStructField STARTED

org.apache.kafka.connect.data.SchemaProjectorTest > testProjectMissingOptionalStructField PASSED

org.apache.kafka.connect.data.SchemaProjectorTest > testMaybeCompatible STARTED

org.apache.kafka.connect.data.SchemaProjectorTest > testMaybeCompatible PASSED

org.apache.kafka.connect.data.FieldTest > testEquality STARTED

org.apache.kafka.connect.data.FieldTest > testEquality PASSED

org.apache.kafka.connect.storage.StringConverterTest > testBytesNullToString STARTED

org.apache.kafka.connect.storage.StringConverterTest > testBytesNullToString PASSED

org.apache.kafka.connect.storage.StringConverterTest > testToBytesNonUtf8Encoding STARTED

org.apache.kafka.connect.storage.StringConverterTest > testToBytesNonUtf8Encoding PASSED

org.apache.kafka.connect.storage.StringConverterTest > testNonStringToBytes STARTED

org.apache.kafka.connect.storage.StringConverterTest > testNonStringToBytes PASSED

org.apache.kafka.connect.storage.StringConverterTest > testBytesToStringNonUtf8Encoding STARTED

org.apache.kafka.connect.storage.StringConverterTest > testBytesToStringNonUtf8Encoding PASSED

org.apache.kafka.connect.storage.StringConverterTest > testNullToBytes STARTED

org.apache.kafka.connect.storage.StringConverterTest > testNullToBytes PASSED

org.apache.kafka.connect.storage.StringConverterTest > testNullHeaderValueToBytes STARTED

org.apache.kafka.connect.storage.StringConverterTest > testNullHeaderValueToBytes PASSED

org.apache.kafka.connect.storage.StringConverterTest > testStringHeaderValueToBytes STARTED

org.apache.kafka.connect.storage.StringConverterTest > testStringHeaderValueToBytes PASSED

org.apache.kafka.connect.storage.StringConverterTest > testToBytesIgnoresSchema STARTED

org.apache.kafka.connect.storage.StringConverterTest > testToBytesIgnoresSchema PASSED

org.apache.kafka.connect.storage.StringConverterTest > testNonStringHeaderValueToBytes STARTED

org.apache.kafka.connect.storage.StringConverterTest > testNonStringHeaderValueToBytes PASSED

org.apache.kafka.connect.storage.StringConverterTest > testStringToBytes STARTED

org.apache.kafka.connect.storage.StringConverterTest > testStringToBytes PASSED

org.apache.kafka.connect.storage.StringConverterTest > testBytesToString STARTED

org.apache.kafka.connect.storage.StringConverterTest > testBytesToString PASSED

org.apache.kafka.connect.storage.SimpleHeaderConverterTest > shouldConvertEmptyListToListWithoutSchema STARTED

org.apache.kafka.connect.storage.SimpleHeaderConverterTest > shouldConvertEmptyListToListWithoutSchema PASSED

org.apache.kafka.connect.storage.SimpleHeaderConverterTest > shouldConvertStringWithQuotesAndOtherDelimiterCharacters STARTED

org.apache.kafka.connect.storage.SimpleHeaderConverterTest > shouldConvertStringWithQuotesAndOtherDelimiterCharacters PASSED

org.apache.kafka.connect.storage.SimpleHeaderConverterTest > shouldConvertListWithMixedValuesToListWithoutSchema STARTED

org.apache.kafka.connect.storage.SimpleHeaderConverterTest > shouldConvertListWithMixedValuesToListWithoutSchema PASSED

org.apache.kafka.connect.storage.SimpleHeaderConverterTest > shouldConvertMapWithStringKeys STARTED

org.apache.kafka.connect.storage.SimpleHeaderConverterTest > shouldConvertMapWithStringKeys PASSED

org.apache.kafka.connect.storage.SimpleHeaderConverterTest > shouldParseStringOfMapWithStringValuesWithWhitespaceAsMap STARTED

org.apache.kafka.connect.storage.SimpleHeaderConverterTest > shouldParseStringOfMapWithStringValuesWithWhitespaceAsMap PASSED

org.apache.kafka.connect.storage.SimpleHeaderConverterTest > shouldConvertMapWithStringKeysAndShortValues STARTED

org.apache.kafka.connect.storage.SimpleHeaderConverterTest > shouldConvertMapWithStringKeysAndShortValues PASSED

org.apache.kafka.connect.storage.SimpleHeaderConverterTest > shouldParseStringOfMapWithStringValuesWithoutWhitespaceAsMap STARTED

org.apache.kafka.connect.storage.SimpleHeaderConverterTest > shouldParseStringOfMapWithStringValuesWithoutWhitespaceAsMap PASSED

org.apache.kafka.connect.storage.SimpleHeaderConverterTest > shouldConvertSimpleString STARTED

org.apache.kafka.connect.storage.SimpleHeaderConverterTest > shouldConvertSimpleString PASSED

org.apache.kafka.connect.storage.SimpleHeaderConverterTest > shouldConvertEmptyMapToMapWithoutSchema STARTED

org.apache.kafka.connect.storage.SimpleHeaderConverterTest > shouldConvertEmptyMapToMapWithoutSchema PASSED

org.apache.kafka.connect.storage.SimpleHeaderConverterTest > shouldConvertEmptyString STARTED

org.apache.kafka.connect.storage.SimpleHeaderConverterTest > shouldConvertEmptyString PASSED

org.apache.kafka.connect.storage.SimpleHeaderConverterTest > shouldConvertMapWithStringKeysAndMixedValuesToMapWithoutSchema STARTED

org.apache.kafka.connect.storage.SimpleHeaderConverterTest > shouldConvertMapWithStringKeysAndMixedValuesToMapWithoutSchema PASSED

org.apache.kafka.connect.storage.SimpleHeaderConverterTest > shouldParseStringOfMapWithIntValuesWithoutWhitespaceAsMap STARTED

org.apache.kafka.connect.storage.SimpleHeaderConverterTest > shouldParseStringOfMapWithIntValuesWithoutWhitespaceAsMap PASSED

org.apache.kafka.connect.storage.SimpleHeaderConverterTest > shouldParseStringOfMapWithShortValuesWithWhitespaceAsMap STARTED

org.apache.kafka.connect.storage.SimpleHeaderConverterTest > shouldParseStringOfMapWithShortValuesWithWhitespaceAsMap PASSED

org.apache.kafka.connect.storage.SimpleHeaderConverterTest > shouldConvertMapWithStringKeysAndIntegerValues STARTED

org.apache.kafka.connect.storage.SimpleHeaderConverterTest > shouldConvertMapWithStringKeysAndIntegerValues PASSED

org.apache.kafka.connect.storage.SimpleHeaderConverterTest > shouldConvertNullValue STARTED

org.apache.kafka.connect.storage.SimpleHeaderConverterTest > shouldConvertNullValue PASSED

org.apache.kafka.connect.storage.SimpleHeaderConverterTest > shouldParseStringOfMapWithShortValuesWithoutWhitespaceAsMap STARTED

org.apache.kafka.connect.storage.SimpleHeaderConverterTest > shouldParseStringOfMapWithShortValuesWithoutWhitespaceAsMap PASSED

org.apache.kafka.connect.storage.SimpleHeaderConverterTest > shouldConvertListWithStringValues STARTED

org.apache.kafka.connect.storage.SimpleHeaderConverterTest > shouldConvertListWithStringValues PASSED

org.apache.kafka.connect.storage.SimpleHeaderConverterTest > shouldParseStringOfMapWithIntValuesWithWhitespaceAsMap STARTED

org.apache.kafka.connect.storage.SimpleHeaderConverterTest > shouldParseStringOfMapWithIntValuesWithWhitespaceAsMap PASSED

org.apache.kafka.connect.storage.SimpleHeaderConverterTest > shouldConvertListWithIntegerValues STARTED

org.apache.kafka.connect.storage.SimpleHeaderConverterTest > shouldConvertListWithIntegerValues PASSED

org.apache.kafka.connect.storage.ConverterTypeTest > shouldFindByName STARTED

org.apache.kafka.connect.storage.ConverterTypeTest > shouldFindByName PASSED

org.apache.kafka.connect.connector.ConnectorReconfigurationTest > testReconfigureStopException STARTED

org.apache.kafka.connect.connector.ConnectorReconfigurationTest > testReconfigureStopException PASSED

org.apache.kafka.connect.connector.ConnectorReconfigurationTest > testDefaultReconfigure STARTED

org.apache.kafka.connect.connector.ConnectorReconfigurationTest > testDefaultReconfigure PASSED

org.apache.kafka.connect.source.SourceRecordTest > shouldDuplicateRecordAndCloneHeaders STARTED

org.apache.kafka.connect.source.SourceRecordTest > shouldDuplicateRecordAndCloneHeaders PASSED

org.apache.kafka.connect.source.SourceRecordTest > shouldDuplicateRecordUsingNewHeaders STARTED

org.apache.kafka.connect.source.SourceRecordTest > shouldDuplicateRecordUsingNewHeaders PASSED

org.apache.kafka.connect.source.SourceRecordTest > shouldModifyRecordHeader STARTED

org.apache.kafka.connect.source.SourceRecordTest > shouldModifyRecordHeader PASSED

org.apache.kafka.connect.source.SourceRecordTest > shouldCreateSinkRecordWithHeaders STARTED

org.apache.kafka.connect.source.SourceRecordTest > shouldCreateSinkRecordWithHeaders PASSED

org.apache.kafka.connect.source.SourceRecordTest > shouldCreateSinkRecordWithEmtpyHeaders STARTED

org.apache.kafka.connect.source.SourceRecordTest > shouldCreateSinkRecordWithEmtpyHeaders PASSED

org.apache.kafka.connect.util.ConnectorUtilsTest > testGroupPartitions STARTED

org.apache.kafka.connect.util.ConnectorUtilsTest > testGroupPartitions PASSED

org.apache.kafka.connect.util.ConnectorUtilsTest > testGroupPartitionsInvalidCount STARTED

org.apache.kafka.connect.util.ConnectorUtilsTest > testGroupPartitionsInvalidCount PASSED

> Task :streams:examples:test

org.apache.kafka.streams.examples.wordcount.WordCountProcessorTest > test STARTED

org.apache.kafka.streams.examples.wordcount.WordCountProcessorTest > test PASSED

FAILURE: Build failed with an exception.

* What went wrong:
Execution failed for task ':connect:runtime:test'.
> There were failing tests. See the report at: file://<https://builds.apache.org/job/kafka-trunk-jdk8/ws/connect/runtime/build/reports/tests/test/index.html>

* Try:
Run with --stacktrace option to get the stack trace. Run with --info or --debug option to get more log output. Run with --scan to get full insights.

* Get more help at https://help.gradle.org

Deprecated Gradle features were used in this build, making it incompatible with Gradle 6.0.
Use '--warning-mode all' to show the individual deprecation warnings.
See https://docs.gradle.org/5.4.1/userguide/command_line_interface.html#sec:command_line_warnings

BUILD FAILED in 3h 22m 37s
178 actionable tasks: 175 executed, 3 up-to-date
Build step 'Execute shell' marked build as failure
[FINDBUGS] Collecting findbugs analysis files...
Setting GRADLE_4_8_1_HOME=/home/jenkins/tools/gradle/4.8.1
[FINDBUGS] Searching for all files in <https://builds.apache.org/job/kafka-trunk-jdk8/ws/> that match the pattern **/build/reports/*bugs/*.xml
[FINDBUGS] Parsing 17 files in <https://builds.apache.org/job/kafka-trunk-jdk8/ws/>
[FINDBUGS] Successfully parsed file <https://builds.apache.org/job/kafka-trunk-jdk8/ws/clients/build/reports/spotbugs/main.xml> with 0 unique warnings and 0 duplicates.
[FINDBUGS] Successfully parsed file <https://builds.apache.org/job/kafka-trunk-jdk8/ws/connect/api/build/reports/spotbugs/main.xml> with 0 unique warnings and 0 duplicates.
[FINDBUGS] Successfully parsed file <https://builds.apache.org/job/kafka-trunk-jdk8/ws/connect/basic-auth-extension/build/reports/spotbugs/main.xml> with 0 unique warnings and 0 duplicates.
[FINDBUGS] Successfully parsed file <https://builds.apache.org/job/kafka-trunk-jdk8/ws/connect/file/build/reports/spotbugs/main.xml> with 0 unique warnings and 0 duplicates.
[FINDBUGS] Successfully parsed file <https://builds.apache.org/job/kafka-trunk-jdk8/ws/connect/json/build/reports/spotbugs/main.xml> with 0 unique warnings and 0 duplicates.
[FINDBUGS] Successfully parsed file <https://builds.apache.org/job/kafka-trunk-jdk8/ws/connect/runtime/build/reports/spotbugs/main.xml> with 0 unique warnings and 0 duplicates.
[FINDBUGS] Successfully parsed file <https://builds.apache.org/job/kafka-trunk-jdk8/ws/connect/transforms/build/reports/spotbugs/main.xml> with 0 unique warnings and 0 duplicates.
[FINDBUGS] Successfully parsed file <https://builds.apache.org/job/kafka-trunk-jdk8/ws/core/build/reports/spotbugs/main.xml> with 0 unique warnings and 0 duplicates.
[FINDBUGS] Successfully parsed file <https://builds.apache.org/job/kafka-trunk-jdk8/ws/examples/build/reports/spotbugs/main.xml> with 0 unique warnings and 0 duplicates.
[FINDBUGS] Successfully parsed file <https://builds.apache.org/job/kafka-trunk-jdk8/ws/generator/build/reports/spotbugs/main.xml> with 0 unique warnings and 0 duplicates.
[FINDBUGS] Successfully parsed file <https://builds.apache.org/job/kafka-trunk-jdk8/ws/jmh-benchmarks/build/reports/spotbugs/main.xml> with 0 unique warnings and 0 duplicates.
[FINDBUGS] Successfully parsed file <https://builds.apache.org/job/kafka-trunk-jdk8/ws/log4j-appender/build/reports/spotbugs/main.xml> with 0 unique warnings and 0 duplicates.
[FINDBUGS] Successfully parsed file <https://builds.apache.org/job/kafka-trunk-jdk8/ws/streams/build/reports/spotbugs/main.xml> with 0 unique warnings and 0 duplicates.
[FINDBUGS] Successfully parsed file <https://builds.apache.org/job/kafka-trunk-jdk8/ws/streams/examples/build/reports/spotbugs/main.xml> with 0 unique warnings and 0 duplicates.
[FINDBUGS] Successfully parsed file <https://builds.apache.org/job/kafka-trunk-jdk8/ws/streams/streams-scala/build/reports/spotbugs/main.xml> with 0 unique warnings and 0 duplicates.
[FINDBUGS] Successfully parsed file <https://builds.apache.org/job/kafka-trunk-jdk8/ws/streams/test-utils/build/reports/spotbugs/main.xml> with 0 unique warnings and 0 duplicates.
[FINDBUGS] Successfully parsed file <https://builds.apache.org/job/kafka-trunk-jdk8/ws/tools/build/reports/spotbugs/main.xml> with 0 unique warnings and 0 duplicates.
Setting GRADLE_4_8_1_HOME=/home/jenkins/tools/gradle/4.8.1
No credentials specified
Setting GRADLE_4_8_1_HOME=/home/jenkins/tools/gradle/4.8.1
<Git Blamer> Using GitBlamer to create author and commit information for all warnings.
<Git Blamer> GIT_COMMIT=81900d0ba0a5839a1e5dc876897bab1c24b3bd94, workspace=<https://builds.apache.org/job/kafka-trunk-jdk8/ws/>
[FINDBUGS] Computing warning deltas based on reference build #3796
Recording test results
Setting GRADLE_4_8_1_HOME=/home/jenkins/tools/gradle/4.8.1
Setting GRADLE_4_8_1_HOME=/home/jenkins/tools/gradle/4.8.1
Not sending mail to unregistered user ismael@juma.me.uk
Not sending mail to unregistered user noreply@github.com
Not sending mail to unregistered user wangguoz@gmail.com
Not sending mail to unregistered user rajinisivaram@googlemail.com

Build failed in Jenkins: kafka-trunk-jdk8 #3816

Posted by Apache Jenkins Server <je...@builds.apache.org>.
See <https://builds.apache.org/job/kafka-trunk-jdk8/3816/display/redirect?page=changes>

Changes:

[github] MINOR: Fix Streams metadata upgrade system test (#7118)

------------------------------------------
Started by an SCM change
[EnvInject] - Loading node environment variables.
Building remotely on H44 (ubuntu bionic) in workspace <https://builds.apache.org/job/kafka-trunk-jdk8/ws/>
[WS-CLEANUP] Deleting project workspace...
[WS-CLEANUP] Deferred wipeout is used...
[WS-CLEANUP] Done
No credentials specified
Cloning the remote Git repository
Cloning repository https://github.com/apache/kafka.git
 > git init <https://builds.apache.org/job/kafka-trunk-jdk8/ws/> # timeout=10
Fetching upstream changes from https://github.com/apache/kafka.git
 > git --version # timeout=10
 > git fetch --tags --progress https://github.com/apache/kafka.git +refs/heads/*:refs/remotes/origin/*
 > git config remote.origin.url https://github.com/apache/kafka.git # timeout=10
 > git config --add remote.origin.fetch +refs/heads/*:refs/remotes/origin/* # timeout=10
 > git config remote.origin.url https://github.com/apache/kafka.git # timeout=10
Fetching upstream changes from https://github.com/apache/kafka.git
 > git fetch --tags --progress https://github.com/apache/kafka.git +refs/heads/*:refs/remotes/origin/*
 > git rev-parse refs/remotes/origin/trunk^{commit} # timeout=10
 > git rev-parse refs/remotes/origin/origin/trunk^{commit} # timeout=10
Checking out Revision 39bcc8447c906506d63b8df156cf90174bbb8b78 (refs/remotes/origin/trunk)
 > git config core.sparsecheckout # timeout=10
 > git checkout -f 39bcc8447c906506d63b8df156cf90174bbb8b78
Commit message: "MINOR: Fix Streams metadata upgrade system test (#7118)"
 > git rev-list --no-walk acf507ce9cd0a6037da3e4c561bd4c50ba526f8a # timeout=10
Setting GRADLE_4_8_1_HOME=/home/jenkins/tools/gradle/4.8.1
[kafka-trunk-jdk8] $ /bin/bash -xe /tmp/jenkins6004398714022845310.sh
+ rm -rf <https://builds.apache.org/job/kafka-trunk-jdk8/ws/.gradle>
+ /home/jenkins/tools/gradle/4.8.1/bin/gradle
/tmp/jenkins6004398714022845310.sh: line 4: /home/jenkins/tools/gradle/4.8.1/bin/gradle: No such file or directory
Build step 'Execute shell' marked build as failure
[FINDBUGS] Collecting findbugs analysis files...
Setting GRADLE_4_8_1_HOME=/home/jenkins/tools/gradle/4.8.1
[FINDBUGS] Searching for all files in <https://builds.apache.org/job/kafka-trunk-jdk8/ws/> that match the pattern **/build/reports/*bugs/*.xml
[FINDBUGS] No files found. Configuration error?
Setting GRADLE_4_8_1_HOME=/home/jenkins/tools/gradle/4.8.1
No credentials specified
Setting GRADLE_4_8_1_HOME=/home/jenkins/tools/gradle/4.8.1
<Git Blamer> Using GitBlamer to create author and commit information for all warnings.
<Git Blamer> GIT_COMMIT=39bcc8447c906506d63b8df156cf90174bbb8b78, workspace=<https://builds.apache.org/job/kafka-trunk-jdk8/ws/>
[FINDBUGS] Computing warning deltas based on reference build #3796
Recording test results
Setting GRADLE_4_8_1_HOME=/home/jenkins/tools/gradle/4.8.1
ERROR: Step ?Publish JUnit test result report? failed: No test report files were found. Configuration error?
Setting GRADLE_4_8_1_HOME=/home/jenkins/tools/gradle/4.8.1
Not sending mail to unregistered user ismael@juma.me.uk
Not sending mail to unregistered user noreply@github.com
Not sending mail to unregistered user wangguoz@gmail.com
Not sending mail to unregistered user rajinisivaram@googlemail.com

Re: Build failed in Jenkins: kafka-trunk-jdk8 #3815

Posted by Divansh Arora <di...@iiitd.ac.in>.
m

On Sun, Jul 28, 2019 at 10:42 PM Apache Jenkins Server <
jenkins@builds.apache.org> wrote:

> See <
> https://builds.apache.org/job/kafka-trunk-jdk8/3815/display/redirect?page=changes
> >
>
> Changes:
>
> [github] MINOR: Remove unused TopicAndPartition and remove unused symbols
> (#7119)
>
> ------------------------------------------
> Started by an SCM change
> [EnvInject] - Loading node environment variables.
> Building remotely on H44 (ubuntu bionic) in workspace <
> https://builds.apache.org/job/kafka-trunk-jdk8/ws/>
> [WS-CLEANUP] Deleting project workspace...
> [WS-CLEANUP] Deferred wipeout is used...
> [WS-CLEANUP] Done
> No credentials specified
> Cloning the remote Git repository
> Cloning repository https://github.com/apache/kafka.git
>  > git init <https://builds.apache.org/job/kafka-trunk-jdk8/ws/> #
> timeout=10
> Fetching upstream changes from https://github.com/apache/kafka.git
>  > git --version # timeout=10
>  > git fetch --tags --progress https://github.com/apache/kafka.git
> +refs/heads/*:refs/remotes/origin/*
>  > git config remote.origin.url https://github.com/apache/kafka.git #
> timeout=10
>  > git config --add remote.origin.fetch
> +refs/heads/*:refs/remotes/origin/* # timeout=10
>  > git config remote.origin.url https://github.com/apache/kafka.git #
> timeout=10
> Fetching upstream changes from https://github.com/apache/kafka.git
>  > git fetch --tags --progress https://github.com/apache/kafka.git
> +refs/heads/*:refs/remotes/origin/*
>  > git rev-parse refs/remotes/origin/trunk^{commit} # timeout=10
>  > git rev-parse refs/remotes/origin/origin/trunk^{commit} # timeout=10
> Checking out Revision acf507ce9cd0a6037da3e4c561bd4c50ba526f8a
> (refs/remotes/origin/trunk)
>  > git config core.sparsecheckout # timeout=10
>  > git checkout -f acf507ce9cd0a6037da3e4c561bd4c50ba526f8a
> Commit message: "MINOR: Remove unused TopicAndPartition and remove unused
> symbols (#7119)"
>  > git rev-list --no-walk 9ad7bce492869e7d971bb7c83becf795622fa4dd #
> timeout=10
> Setting GRADLE_4_8_1_HOME=/home/jenkins/tools/gradle/4.8.1
> [kafka-trunk-jdk8] $ /bin/bash -xe /tmp/jenkins4422692413816819539.sh
> + rm -rf <https://builds.apache.org/job/kafka-trunk-jdk8/ws/.gradle>
> + /home/jenkins/tools/gradle/4.8.1/bin/gradle
> /tmp/jenkins4422692413816819539.sh: line 4:
> /home/jenkins/tools/gradle/4.8.1/bin/gradle: No such file or directory
> Build step 'Execute shell' marked build as failure
> [FINDBUGS] Collecting findbugs analysis files...
> Setting GRADLE_4_8_1_HOME=/home/jenkins/tools/gradle/4.8.1
> [FINDBUGS] Searching for all files in <
> https://builds.apache.org/job/kafka-trunk-jdk8/ws/> that match the
> pattern **/build/reports/*bugs/*.xml
> [FINDBUGS] No files found. Configuration error?
> Setting GRADLE_4_8_1_HOME=/home/jenkins/tools/gradle/4.8.1
> No credentials specified
> Setting GRADLE_4_8_1_HOME=/home/jenkins/tools/gradle/4.8.1
> <Git Blamer> Using GitBlamer to create author and commit information for
> all warnings.
> <Git Blamer> GIT_COMMIT=acf507ce9cd0a6037da3e4c561bd4c50ba526f8a,
> workspace=<https://builds.apache.org/job/kafka-trunk-jdk8/ws/>
> [FINDBUGS] Computing warning deltas based on reference build #3796
> Recording test results
> Setting GRADLE_4_8_1_HOME=/home/jenkins/tools/gradle/4.8.1
> ERROR: Step ?Publish JUnit test result report? failed: No test report
> files were found. Configuration error?
> Setting GRADLE_4_8_1_HOME=/home/jenkins/tools/gradle/4.8.1
> Not sending mail to unregistered user ismael@juma.me.uk
> Not sending mail to unregistered user noreply@github.com
> Not sending mail to unregistered user wangguoz@gmail.com
> Not sending mail to unregistered user rajinisivaram@googlemail.com
>

Build failed in Jenkins: kafka-trunk-jdk8 #3815

Posted by Apache Jenkins Server <je...@builds.apache.org>.
See <https://builds.apache.org/job/kafka-trunk-jdk8/3815/display/redirect?page=changes>

Changes:

[github] MINOR: Remove unused TopicAndPartition and remove unused symbols (#7119)

------------------------------------------
Started by an SCM change
[EnvInject] - Loading node environment variables.
Building remotely on H44 (ubuntu bionic) in workspace <https://builds.apache.org/job/kafka-trunk-jdk8/ws/>
[WS-CLEANUP] Deleting project workspace...
[WS-CLEANUP] Deferred wipeout is used...
[WS-CLEANUP] Done
No credentials specified
Cloning the remote Git repository
Cloning repository https://github.com/apache/kafka.git
 > git init <https://builds.apache.org/job/kafka-trunk-jdk8/ws/> # timeout=10
Fetching upstream changes from https://github.com/apache/kafka.git
 > git --version # timeout=10
 > git fetch --tags --progress https://github.com/apache/kafka.git +refs/heads/*:refs/remotes/origin/*
 > git config remote.origin.url https://github.com/apache/kafka.git # timeout=10
 > git config --add remote.origin.fetch +refs/heads/*:refs/remotes/origin/* # timeout=10
 > git config remote.origin.url https://github.com/apache/kafka.git # timeout=10
Fetching upstream changes from https://github.com/apache/kafka.git
 > git fetch --tags --progress https://github.com/apache/kafka.git +refs/heads/*:refs/remotes/origin/*
 > git rev-parse refs/remotes/origin/trunk^{commit} # timeout=10
 > git rev-parse refs/remotes/origin/origin/trunk^{commit} # timeout=10
Checking out Revision acf507ce9cd0a6037da3e4c561bd4c50ba526f8a (refs/remotes/origin/trunk)
 > git config core.sparsecheckout # timeout=10
 > git checkout -f acf507ce9cd0a6037da3e4c561bd4c50ba526f8a
Commit message: "MINOR: Remove unused TopicAndPartition and remove unused symbols (#7119)"
 > git rev-list --no-walk 9ad7bce492869e7d971bb7c83becf795622fa4dd # timeout=10
Setting GRADLE_4_8_1_HOME=/home/jenkins/tools/gradle/4.8.1
[kafka-trunk-jdk8] $ /bin/bash -xe /tmp/jenkins4422692413816819539.sh
+ rm -rf <https://builds.apache.org/job/kafka-trunk-jdk8/ws/.gradle>
+ /home/jenkins/tools/gradle/4.8.1/bin/gradle
/tmp/jenkins4422692413816819539.sh: line 4: /home/jenkins/tools/gradle/4.8.1/bin/gradle: No such file or directory
Build step 'Execute shell' marked build as failure
[FINDBUGS] Collecting findbugs analysis files...
Setting GRADLE_4_8_1_HOME=/home/jenkins/tools/gradle/4.8.1
[FINDBUGS] Searching for all files in <https://builds.apache.org/job/kafka-trunk-jdk8/ws/> that match the pattern **/build/reports/*bugs/*.xml
[FINDBUGS] No files found. Configuration error?
Setting GRADLE_4_8_1_HOME=/home/jenkins/tools/gradle/4.8.1
No credentials specified
Setting GRADLE_4_8_1_HOME=/home/jenkins/tools/gradle/4.8.1
<Git Blamer> Using GitBlamer to create author and commit information for all warnings.
<Git Blamer> GIT_COMMIT=acf507ce9cd0a6037da3e4c561bd4c50ba526f8a, workspace=<https://builds.apache.org/job/kafka-trunk-jdk8/ws/>
[FINDBUGS] Computing warning deltas based on reference build #3796
Recording test results
Setting GRADLE_4_8_1_HOME=/home/jenkins/tools/gradle/4.8.1
ERROR: Step ?Publish JUnit test result report? failed: No test report files were found. Configuration error?
Setting GRADLE_4_8_1_HOME=/home/jenkins/tools/gradle/4.8.1
Not sending mail to unregistered user ismael@juma.me.uk
Not sending mail to unregistered user noreply@github.com
Not sending mail to unregistered user wangguoz@gmail.com
Not sending mail to unregistered user rajinisivaram@googlemail.com

Build failed in Jenkins: kafka-trunk-jdk8 #3814

Posted by Apache Jenkins Server <je...@builds.apache.org>.
See <https://builds.apache.org/job/kafka-trunk-jdk8/3814/display/redirect?page=changes>

Changes:

[ismael] MINOR: Close ZKDatabase in EmbeddedZookeeper (#6237)

------------------------------------------
[...truncated 6.45 MB...]

org.apache.kafka.connect.util.KafkaBasedLogTest > testStartStop STARTED

org.apache.kafka.connect.util.KafkaBasedLogTest > testStartStop PASSED

org.apache.kafka.connect.util.KafkaBasedLogTest > testReloadOnStart STARTED

org.apache.kafka.connect.util.KafkaBasedLogTest > testReloadOnStart PASSED

org.apache.kafka.connect.converters.FloatConverterTest > testBytesNullToNumber STARTED

org.apache.kafka.connect.converters.FloatConverterTest > testBytesNullToNumber PASSED

org.apache.kafka.connect.converters.FloatConverterTest > testSerializingIncorrectType STARTED

org.apache.kafka.connect.converters.FloatConverterTest > testSerializingIncorrectType PASSED

org.apache.kafka.connect.converters.FloatConverterTest > testDeserializingHeaderWithTooManyBytes STARTED

org.apache.kafka.connect.converters.FloatConverterTest > testDeserializingHeaderWithTooManyBytes PASSED

org.apache.kafka.connect.converters.FloatConverterTest > testNullToBytes STARTED

org.apache.kafka.connect.converters.FloatConverterTest > testNullToBytes PASSED

org.apache.kafka.connect.converters.FloatConverterTest > testSerializingIncorrectHeader STARTED

org.apache.kafka.connect.converters.FloatConverterTest > testSerializingIncorrectHeader PASSED

org.apache.kafka.connect.converters.FloatConverterTest > testDeserializingDataWithTooManyBytes STARTED

org.apache.kafka.connect.converters.FloatConverterTest > testDeserializingDataWithTooManyBytes PASSED

org.apache.kafka.connect.converters.FloatConverterTest > testConvertingSamplesToAndFromBytes STARTED

org.apache.kafka.connect.converters.FloatConverterTest > testConvertingSamplesToAndFromBytes PASSED

org.apache.kafka.connect.converters.IntegerConverterTest > testBytesNullToNumber STARTED

org.apache.kafka.connect.converters.IntegerConverterTest > testBytesNullToNumber PASSED

org.apache.kafka.connect.converters.IntegerConverterTest > testSerializingIncorrectType STARTED

org.apache.kafka.connect.converters.IntegerConverterTest > testSerializingIncorrectType PASSED

org.apache.kafka.connect.converters.IntegerConverterTest > testDeserializingHeaderWithTooManyBytes STARTED

org.apache.kafka.connect.converters.IntegerConverterTest > testDeserializingHeaderWithTooManyBytes PASSED

org.apache.kafka.connect.converters.IntegerConverterTest > testNullToBytes STARTED

org.apache.kafka.connect.converters.IntegerConverterTest > testNullToBytes PASSED

org.apache.kafka.connect.converters.IntegerConverterTest > testSerializingIncorrectHeader STARTED

org.apache.kafka.connect.converters.IntegerConverterTest > testSerializingIncorrectHeader PASSED

org.apache.kafka.connect.converters.IntegerConverterTest > testDeserializingDataWithTooManyBytes STARTED

org.apache.kafka.connect.converters.IntegerConverterTest > testDeserializingDataWithTooManyBytes PASSED

org.apache.kafka.connect.converters.IntegerConverterTest > testConvertingSamplesToAndFromBytes STARTED

org.apache.kafka.connect.converters.IntegerConverterTest > testConvertingSamplesToAndFromBytes PASSED

org.apache.kafka.connect.converters.ByteArrayConverterTest > testFromConnectSchemaless STARTED

org.apache.kafka.connect.converters.ByteArrayConverterTest > testFromConnectSchemaless PASSED

org.apache.kafka.connect.converters.ByteArrayConverterTest > testToConnectNull STARTED

org.apache.kafka.connect.converters.ByteArrayConverterTest > testToConnectNull PASSED

org.apache.kafka.connect.converters.ByteArrayConverterTest > testFromConnectBadSchema STARTED

org.apache.kafka.connect.converters.ByteArrayConverterTest > testFromConnectBadSchema PASSED

org.apache.kafka.connect.converters.ByteArrayConverterTest > testFromConnectNull STARTED

org.apache.kafka.connect.converters.ByteArrayConverterTest > testFromConnectNull PASSED

org.apache.kafka.connect.converters.ByteArrayConverterTest > testToConnect STARTED

org.apache.kafka.connect.converters.ByteArrayConverterTest > testToConnect PASSED

org.apache.kafka.connect.converters.ByteArrayConverterTest > testFromConnect STARTED

org.apache.kafka.connect.converters.ByteArrayConverterTest > testFromConnect PASSED

org.apache.kafka.connect.converters.ByteArrayConverterTest > testFromConnectInvalidValue STARTED

org.apache.kafka.connect.converters.ByteArrayConverterTest > testFromConnectInvalidValue PASSED

org.apache.kafka.connect.converters.DoubleConverterTest > testBytesNullToNumber STARTED

org.apache.kafka.connect.converters.DoubleConverterTest > testBytesNullToNumber PASSED

org.apache.kafka.connect.converters.DoubleConverterTest > testSerializingIncorrectType STARTED

org.apache.kafka.connect.converters.DoubleConverterTest > testSerializingIncorrectType PASSED

org.apache.kafka.connect.converters.DoubleConverterTest > testDeserializingHeaderWithTooManyBytes STARTED

org.apache.kafka.connect.converters.DoubleConverterTest > testDeserializingHeaderWithTooManyBytes PASSED

org.apache.kafka.connect.converters.DoubleConverterTest > testNullToBytes STARTED

org.apache.kafka.connect.converters.DoubleConverterTest > testNullToBytes PASSED

org.apache.kafka.connect.converters.DoubleConverterTest > testSerializingIncorrectHeader STARTED

org.apache.kafka.connect.converters.DoubleConverterTest > testSerializingIncorrectHeader PASSED

org.apache.kafka.connect.converters.DoubleConverterTest > testDeserializingDataWithTooManyBytes STARTED

org.apache.kafka.connect.converters.DoubleConverterTest > testDeserializingDataWithTooManyBytes PASSED

org.apache.kafka.connect.converters.DoubleConverterTest > testConvertingSamplesToAndFromBytes STARTED

org.apache.kafka.connect.converters.DoubleConverterTest > testConvertingSamplesToAndFromBytes PASSED

org.apache.kafka.connect.converters.LongConverterTest > testBytesNullToNumber STARTED

org.apache.kafka.connect.converters.LongConverterTest > testBytesNullToNumber PASSED

org.apache.kafka.connect.converters.LongConverterTest > testSerializingIncorrectType STARTED

org.apache.kafka.connect.converters.LongConverterTest > testSerializingIncorrectType PASSED

org.apache.kafka.connect.converters.LongConverterTest > testDeserializingHeaderWithTooManyBytes STARTED

org.apache.kafka.connect.converters.LongConverterTest > testDeserializingHeaderWithTooManyBytes PASSED

org.apache.kafka.connect.converters.LongConverterTest > testNullToBytes STARTED

org.apache.kafka.connect.converters.LongConverterTest > testNullToBytes PASSED

org.apache.kafka.connect.converters.LongConverterTest > testSerializingIncorrectHeader STARTED

org.apache.kafka.connect.converters.LongConverterTest > testSerializingIncorrectHeader PASSED

org.apache.kafka.connect.converters.LongConverterTest > testDeserializingDataWithTooManyBytes STARTED

org.apache.kafka.connect.converters.LongConverterTest > testDeserializingDataWithTooManyBytes PASSED

org.apache.kafka.connect.converters.LongConverterTest > testConvertingSamplesToAndFromBytes STARTED

org.apache.kafka.connect.converters.LongConverterTest > testConvertingSamplesToAndFromBytes PASSED

org.apache.kafka.connect.converters.ShortConverterTest > testBytesNullToNumber STARTED

org.apache.kafka.connect.converters.ShortConverterTest > testBytesNullToNumber PASSED

org.apache.kafka.connect.converters.ShortConverterTest > testSerializingIncorrectType STARTED

org.apache.kafka.connect.converters.ShortConverterTest > testSerializingIncorrectType PASSED

org.apache.kafka.connect.converters.ShortConverterTest > testDeserializingHeaderWithTooManyBytes STARTED

org.apache.kafka.connect.converters.ShortConverterTest > testDeserializingHeaderWithTooManyBytes PASSED

org.apache.kafka.connect.converters.ShortConverterTest > testNullToBytes STARTED

org.apache.kafka.connect.converters.ShortConverterTest > testNullToBytes PASSED

org.apache.kafka.connect.converters.ShortConverterTest > testSerializingIncorrectHeader STARTED

org.apache.kafka.connect.converters.ShortConverterTest > testSerializingIncorrectHeader PASSED

org.apache.kafka.connect.converters.ShortConverterTest > testDeserializingDataWithTooManyBytes STARTED

org.apache.kafka.connect.converters.ShortConverterTest > testDeserializingDataWithTooManyBytes PASSED

org.apache.kafka.connect.converters.ShortConverterTest > testConvertingSamplesToAndFromBytes STARTED

org.apache.kafka.connect.converters.ShortConverterTest > testConvertingSamplesToAndFromBytes PASSED

org.apache.kafka.connect.connector.policy.NoneConnectorClientConfigOverridePolicyTest > testNoOverrides STARTED

org.apache.kafka.connect.connector.policy.NoneConnectorClientConfigOverridePolicyTest > testNoOverrides PASSED

org.apache.kafka.connect.connector.policy.NoneConnectorClientConfigOverridePolicyTest > testWithOverrides STARTED

org.apache.kafka.connect.connector.policy.NoneConnectorClientConfigOverridePolicyTest > testWithOverrides PASSED

org.apache.kafka.connect.connector.policy.PrincipalConnectorClientConfigOverridePolicyTest > testPrincipalPlusOtherConfigs STARTED

org.apache.kafka.connect.connector.policy.PrincipalConnectorClientConfigOverridePolicyTest > testPrincipalPlusOtherConfigs PASSED

org.apache.kafka.connect.connector.policy.PrincipalConnectorClientConfigOverridePolicyTest > testPrincipalOnly STARTED

org.apache.kafka.connect.connector.policy.PrincipalConnectorClientConfigOverridePolicyTest > testPrincipalOnly PASSED

470 tests completed, 1 failed

> Task :connect:runtime:test FAILED

FAILURE: Build failed with an exception.

* What went wrong:
Execution failed for task ':connect:runtime:test'.
> There were failing tests. See the report at: file://<https://builds.apache.org/job/kafka-trunk-jdk8/ws/connect/runtime/build/reports/tests/test/index.html>

* Try:
Run with --stacktrace option to get the stack trace. Run with --info or --debug option to get more log output. Run with --scan to get full insights.

* Get more help at https://help.gradle.org

Deprecated Gradle features were used in this build, making it incompatible with Gradle 6.0.
Use '--warning-mode all' to show the individual deprecation warnings.
See https://docs.gradle.org/5.4.1/userguide/command_line_interface.html#sec:command_line_warnings

BUILD FAILED in 3h 9m 37s
178 actionable tasks: 175 executed, 3 up-to-date
Build step 'Execute shell' marked build as failure
[FINDBUGS] Collecting findbugs analysis files...
Setting GRADLE_4_8_1_HOME=/home/jenkins/tools/gradle/4.8.1
[FINDBUGS] Searching for all files in <https://builds.apache.org/job/kafka-trunk-jdk8/ws/> that match the pattern **/build/reports/*bugs/*.xml
[FINDBUGS] Parsing 17 files in <https://builds.apache.org/job/kafka-trunk-jdk8/ws/>
[FINDBUGS] Successfully parsed file <https://builds.apache.org/job/kafka-trunk-jdk8/ws/clients/build/reports/spotbugs/main.xml> with 0 unique warnings and 0 duplicates.
[FINDBUGS] Successfully parsed file <https://builds.apache.org/job/kafka-trunk-jdk8/ws/connect/api/build/reports/spotbugs/main.xml> with 0 unique warnings and 0 duplicates.
[FINDBUGS] Successfully parsed file <https://builds.apache.org/job/kafka-trunk-jdk8/ws/connect/basic-auth-extension/build/reports/spotbugs/main.xml> with 0 unique warnings and 0 duplicates.
[FINDBUGS] Successfully parsed file <https://builds.apache.org/job/kafka-trunk-jdk8/ws/connect/file/build/reports/spotbugs/main.xml> with 0 unique warnings and 0 duplicates.
[FINDBUGS] Successfully parsed file <https://builds.apache.org/job/kafka-trunk-jdk8/ws/connect/json/build/reports/spotbugs/main.xml> with 0 unique warnings and 0 duplicates.
[FINDBUGS] Successfully parsed file <https://builds.apache.org/job/kafka-trunk-jdk8/ws/connect/runtime/build/reports/spotbugs/main.xml> with 0 unique warnings and 0 duplicates.
[FINDBUGS] Successfully parsed file <https://builds.apache.org/job/kafka-trunk-jdk8/ws/connect/transforms/build/reports/spotbugs/main.xml> with 0 unique warnings and 0 duplicates.
[FINDBUGS] Successfully parsed file <https://builds.apache.org/job/kafka-trunk-jdk8/ws/core/build/reports/spotbugs/main.xml> with 0 unique warnings and 0 duplicates.
[FINDBUGS] Successfully parsed file <https://builds.apache.org/job/kafka-trunk-jdk8/ws/examples/build/reports/spotbugs/main.xml> with 0 unique warnings and 0 duplicates.
[FINDBUGS] Successfully parsed file <https://builds.apache.org/job/kafka-trunk-jdk8/ws/generator/build/reports/spotbugs/main.xml> with 0 unique warnings and 0 duplicates.
[FINDBUGS] Successfully parsed file <https://builds.apache.org/job/kafka-trunk-jdk8/ws/jmh-benchmarks/build/reports/spotbugs/main.xml> with 0 unique warnings and 0 duplicates.
[FINDBUGS] Successfully parsed file <https://builds.apache.org/job/kafka-trunk-jdk8/ws/log4j-appender/build/reports/spotbugs/main.xml> with 0 unique warnings and 0 duplicates.
[FINDBUGS] Successfully parsed file <https://builds.apache.org/job/kafka-trunk-jdk8/ws/streams/build/reports/spotbugs/main.xml> with 0 unique warnings and 0 duplicates.
[FINDBUGS] Successfully parsed file <https://builds.apache.org/job/kafka-trunk-jdk8/ws/streams/examples/build/reports/spotbugs/main.xml> with 0 unique warnings and 0 duplicates.
[FINDBUGS] Successfully parsed file <https://builds.apache.org/job/kafka-trunk-jdk8/ws/streams/streams-scala/build/reports/spotbugs/main.xml> with 0 unique warnings and 0 duplicates.
[FINDBUGS] Successfully parsed file <https://builds.apache.org/job/kafka-trunk-jdk8/ws/streams/test-utils/build/reports/spotbugs/main.xml> with 0 unique warnings and 0 duplicates.
[FINDBUGS] Successfully parsed file <https://builds.apache.org/job/kafka-trunk-jdk8/ws/tools/build/reports/spotbugs/main.xml> with 0 unique warnings and 0 duplicates.
Setting GRADLE_4_8_1_HOME=/home/jenkins/tools/gradle/4.8.1
No credentials specified
Setting GRADLE_4_8_1_HOME=/home/jenkins/tools/gradle/4.8.1
<Git Blamer> Using GitBlamer to create author and commit information for all warnings.
<Git Blamer> GIT_COMMIT=9ad7bce492869e7d971bb7c83becf795622fa4dd, workspace=<https://builds.apache.org/job/kafka-trunk-jdk8/ws/>
[FINDBUGS] Computing warning deltas based on reference build #3796
Recording test results
Setting GRADLE_4_8_1_HOME=/home/jenkins/tools/gradle/4.8.1
Setting GRADLE_4_8_1_HOME=/home/jenkins/tools/gradle/4.8.1
Not sending mail to unregistered user ismael@juma.me.uk
Not sending mail to unregistered user noreply@github.com
Not sending mail to unregistered user wangguoz@gmail.com
Not sending mail to unregistered user rajinisivaram@googlemail.com

Build failed in Jenkins: kafka-trunk-jdk8 #3813

Posted by Apache Jenkins Server <je...@builds.apache.org>.
See <https://builds.apache.org/job/kafka-trunk-jdk8/3813/display/redirect?page=changes>

Changes:

[jason] KAFKA-8221; Add batch leave group request (#6714)

------------------------------------------
[...truncated 2.56 MB...]
org.apache.kafka.common.metrics.SensorTest > testRecordLevelEnum PASSED

org.apache.kafka.common.ClusterTest > testBootstrap STARTED

org.apache.kafka.common.ClusterTest > testBootstrap PASSED

> Task :streams:streams-scala:test

org.apache.kafka.streams.scala.StreamToTableJoinScalaIntegrationTestImplicitSerdes > testShouldCountClicksPerRegionWithNamedRepartitionTopic STARTED

org.apache.kafka.streams.scala.StreamToTableJoinScalaIntegrationTestImplicitSerdes > testShouldCountClicksPerRegionWithNamedRepartitionTopic PASSED

org.apache.kafka.streams.scala.StreamToTableJoinScalaIntegrationTestImplicitSerdes > testShouldCountClicksPerRegionJava STARTED

org.apache.kafka.streams.scala.StreamToTableJoinScalaIntegrationTestImplicitSerdes > testShouldCountClicksPerRegionJava PASSED

org.apache.kafka.streams.scala.StreamToTableJoinScalaIntegrationTestImplicitSerdes > testShouldCountClicksPerRegion STARTED

org.apache.kafka.streams.scala.StreamToTableJoinScalaIntegrationTestImplicitSerdes > testShouldCountClicksPerRegion PASSED

org.apache.kafka.streams.scala.kstream.SuppressedTest > Suppressed.untilWindowCloses should produce the correct suppression STARTED

org.apache.kafka.streams.scala.kstream.SuppressedTest > Suppressed.untilWindowCloses should produce the correct suppression PASSED

org.apache.kafka.streams.scala.kstream.SuppressedTest > Suppressed.untilTimeLimit should produce the correct suppression STARTED

org.apache.kafka.streams.scala.kstream.SuppressedTest > Suppressed.untilTimeLimit should produce the correct suppression PASSED

org.apache.kafka.streams.scala.kstream.SuppressedTest > BufferConfig.maxRecords should produce the correct buffer config STARTED

org.apache.kafka.streams.scala.kstream.SuppressedTest > BufferConfig.maxRecords should produce the correct buffer config PASSED

org.apache.kafka.streams.scala.kstream.SuppressedTest > BufferConfig.maxBytes should produce the correct buffer config STARTED

org.apache.kafka.streams.scala.kstream.SuppressedTest > BufferConfig.maxBytes should produce the correct buffer config PASSED

org.apache.kafka.streams.scala.kstream.SuppressedTest > BufferConfig.unbounded should produce the correct buffer config STARTED

org.apache.kafka.streams.scala.kstream.SuppressedTest > BufferConfig.unbounded should produce the correct buffer config PASSED

org.apache.kafka.streams.scala.kstream.SuppressedTest > BufferConfig should support very long chains of factory methods STARTED

org.apache.kafka.streams.scala.kstream.SuppressedTest > BufferConfig should support very long chains of factory methods PASSED

org.apache.kafka.streams.scala.kstream.ConsumedTest > Create a Consumed should create a Consumed with Serdes STARTED

org.apache.kafka.streams.scala.kstream.ConsumedTest > Create a Consumed should create a Consumed with Serdes PASSED

org.apache.kafka.streams.scala.kstream.ConsumedTest > Create a Consumed with timestampExtractor and resetPolicy should create a Consumed with Serdes, timestampExtractor and resetPolicy STARTED

org.apache.kafka.streams.scala.kstream.ConsumedTest > Create a Consumed with timestampExtractor and resetPolicy should create a Consumed with Serdes, timestampExtractor and resetPolicy PASSED

org.apache.kafka.streams.scala.kstream.ConsumedTest > Create a Consumed with timestampExtractor should create a Consumed with Serdes and timestampExtractor STARTED

org.apache.kafka.streams.scala.kstream.ConsumedTest > Create a Consumed with timestampExtractor should create a Consumed with Serdes and timestampExtractor PASSED

org.apache.kafka.streams.scala.kstream.ConsumedTest > Create a Consumed with resetPolicy should create a Consumed with Serdes and resetPolicy STARTED

org.apache.kafka.streams.scala.kstream.ConsumedTest > Create a Consumed with resetPolicy should create a Consumed with Serdes and resetPolicy PASSED

org.apache.kafka.streams.scala.kstream.ProducedTest > Create a Produced should create a Produced with Serdes STARTED

org.apache.kafka.streams.scala.kstream.ProducedTest > Create a Produced should create a Produced with Serdes PASSED

org.apache.kafka.streams.scala.kstream.ProducedTest > Create a Produced with timestampExtractor and resetPolicy should create a Consumed with Serdes, timestampExtractor and resetPolicy STARTED

org.apache.kafka.streams.scala.kstream.ProducedTest > Create a Produced with timestampExtractor and resetPolicy should create a Consumed with Serdes, timestampExtractor and resetPolicy PASSED

org.apache.kafka.streams.scala.kstream.GroupedTest > Create a Grouped should create a Grouped with Serdes STARTED

org.apache.kafka.streams.scala.kstream.GroupedTest > Create a Grouped should create a Grouped with Serdes PASSED

org.apache.kafka.streams.scala.kstream.GroupedTest > Create a Grouped with repartition topic name should create a Grouped with Serdes, and repartition topic name STARTED

org.apache.kafka.streams.scala.kstream.GroupedTest > Create a Grouped with repartition topic name should create a Grouped with Serdes, and repartition topic name PASSED

org.apache.kafka.streams.scala.kstream.JoinedTest > Create a Joined should create a Joined with Serdes STARTED

org.apache.kafka.streams.scala.kstream.JoinedTest > Create a Joined should create a Joined with Serdes PASSED

org.apache.kafka.streams.scala.kstream.JoinedTest > Create a Joined should create a Joined with Serdes and repartition topic name STARTED

org.apache.kafka.streams.scala.kstream.JoinedTest > Create a Joined should create a Joined with Serdes and repartition topic name PASSED

org.apache.kafka.streams.scala.kstream.KTableTest > filter a KTable should filter records satisfying the predicate STARTED

org.apache.kafka.streams.scala.kstream.KTableTest > filter a KTable should filter records satisfying the predicate PASSED

org.apache.kafka.streams.scala.kstream.KTableTest > filterNot a KTable should filter records not satisfying the predicate STARTED

org.apache.kafka.streams.scala.kstream.KTableTest > filterNot a KTable should filter records not satisfying the predicate PASSED

org.apache.kafka.streams.scala.kstream.KTableTest > join 2 KTables should join correctly records STARTED

org.apache.kafka.streams.scala.kstream.KTableTest > join 2 KTables should join correctly records PASSED

org.apache.kafka.streams.scala.kstream.KTableTest > join 2 KTables with a Materialized should join correctly records and state store STARTED

org.apache.kafka.streams.scala.kstream.KTableTest > join 2 KTables with a Materialized should join correctly records and state store PASSED

org.apache.kafka.streams.scala.kstream.KTableTest > windowed KTable#suppress should correctly suppress results using Suppressed.untilTimeLimit STARTED

org.apache.kafka.streams.scala.kstream.KTableTest > windowed KTable#suppress should correctly suppress results using Suppressed.untilTimeLimit PASSED

org.apache.kafka.streams.scala.kstream.KTableTest > windowed KTable#suppress should correctly suppress results using Suppressed.untilWindowCloses STARTED

org.apache.kafka.streams.scala.kstream.KTableTest > windowed KTable#suppress should correctly suppress results using Suppressed.untilWindowCloses PASSED

org.apache.kafka.streams.scala.kstream.KTableTest > session windowed KTable#suppress should correctly suppress results using Suppressed.untilWindowCloses STARTED

org.apache.kafka.streams.scala.kstream.KTableTest > session windowed KTable#suppress should correctly suppress results using Suppressed.untilWindowCloses PASSED

org.apache.kafka.streams.scala.kstream.KTableTest > non-windowed KTable#suppress should correctly suppress results using Suppressed.untilTimeLimit STARTED

org.apache.kafka.streams.scala.kstream.KTableTest > non-windowed KTable#suppress should correctly suppress results using Suppressed.untilTimeLimit PASSED

org.apache.kafka.streams.scala.kstream.MaterializedTest > Create a Materialized should create a Materialized with Serdes STARTED

org.apache.kafka.streams.scala.kstream.MaterializedTest > Create a Materialized should create a Materialized with Serdes PASSED

org.apache.kafka.streams.scala.kstream.MaterializedTest > Create a Materialize with a store name should create a Materialized with Serdes and a store name STARTED

org.apache.kafka.streams.scala.kstream.MaterializedTest > Create a Materialize with a store name should create a Materialized with Serdes and a store name PASSED

org.apache.kafka.streams.scala.kstream.MaterializedTest > Create a Materialize with a window store supplier should create a Materialized with Serdes and a store supplier STARTED

org.apache.kafka.streams.scala.kstream.MaterializedTest > Create a Materialize with a window store supplier should create a Materialized with Serdes and a store supplier PASSED

org.apache.kafka.streams.scala.kstream.MaterializedTest > Create a Materialize with a key value store supplier should create a Materialized with Serdes and a store supplier STARTED

org.apache.kafka.streams.scala.kstream.MaterializedTest > Create a Materialize with a key value store supplier should create a Materialized with Serdes and a store supplier PASSED

org.apache.kafka.streams.scala.kstream.MaterializedTest > Create a Materialize with a session store supplier should create a Materialized with Serdes and a store supplier STARTED

org.apache.kafka.streams.scala.kstream.MaterializedTest > Create a Materialize with a session store supplier should create a Materialized with Serdes and a store supplier PASSED

org.apache.kafka.streams.scala.kstream.KStreamTest > filter a KStream should filter records satisfying the predicate STARTED

org.apache.kafka.streams.scala.kstream.KStreamTest > filter a KStream should filter records satisfying the predicate PASSED

org.apache.kafka.streams.scala.kstream.KStreamTest > filterNot a KStream should filter records not satisfying the predicate STARTED

org.apache.kafka.streams.scala.kstream.KStreamTest > filterNot a KStream should filter records not satisfying the predicate PASSED

org.apache.kafka.streams.scala.kstream.KStreamTest > foreach a KStream should run foreach actions on records STARTED

org.apache.kafka.streams.scala.kstream.KStreamTest > foreach a KStream should run foreach actions on records PASSED

org.apache.kafka.streams.scala.kstream.KStreamTest > peek a KStream should run peek actions on records STARTED

org.apache.kafka.streams.scala.kstream.KStreamTest > peek a KStream should run peek actions on records PASSED

org.apache.kafka.streams.scala.kstream.KStreamTest > selectKey a KStream should select a new key STARTED

org.apache.kafka.streams.scala.kstream.KStreamTest > selectKey a KStream should select a new key PASSED

org.apache.kafka.streams.scala.kstream.KStreamTest > join 2 KStreams should join correctly records STARTED

org.apache.kafka.streams.scala.kstream.KStreamTest > join 2 KStreams should join correctly records PASSED

org.apache.kafka.streams.scala.WordCountTest > testShouldCountWordsMaterialized STARTED

org.apache.kafka.streams.scala.WordCountTest > testShouldCountWordsMaterialized PASSED

org.apache.kafka.streams.scala.WordCountTest > testShouldCountWordsJava STARTED

org.apache.kafka.streams.scala.WordCountTest > testShouldCountWordsJava PASSED

org.apache.kafka.streams.scala.WordCountTest > testShouldCountWords STARTED

org.apache.kafka.streams.scala.WordCountTest > testShouldCountWords PASSED

org.apache.kafka.streams.scala.TopologyTest > shouldBuildIdenticalTopologyInJavaNScalaJoin STARTED

org.apache.kafka.streams.scala.TopologyTest > shouldBuildIdenticalTopologyInJavaNScalaJoin PASSED

org.apache.kafka.streams.scala.TopologyTest > shouldBuildIdenticalTopologyInJavaNScalaSimple STARTED

org.apache.kafka.streams.scala.TopologyTest > shouldBuildIdenticalTopologyInJavaNScalaSimple PASSED

org.apache.kafka.streams.scala.TopologyTest > shouldBuildIdenticalTopologyInJavaNScalaAggregate STARTED

org.apache.kafka.streams.scala.TopologyTest > shouldBuildIdenticalTopologyInJavaNScalaAggregate PASSED

org.apache.kafka.streams.scala.TopologyTest > shouldBuildIdenticalTopologyInJavaNScalaProperties STARTED

org.apache.kafka.streams.scala.TopologyTest > shouldBuildIdenticalTopologyInJavaNScalaProperties PASSED

org.apache.kafka.streams.scala.TopologyTest > shouldBuildIdenticalTopologyInJavaNScalaTransform STARTED

org.apache.kafka.streams.scala.TopologyTest > shouldBuildIdenticalTopologyInJavaNScalaTransform PASSED

> Task :streams:examples:test

org.apache.kafka.streams.examples.wordcount.WordCountProcessorTest > test STARTED

org.apache.kafka.streams.examples.wordcount.WordCountProcessorTest > test PASSED

FAILURE: Build failed with an exception.

* What went wrong:
Execution failed for task ':connect:runtime:test'.
> There were failing tests. See the report at: file://<https://builds.apache.org/job/kafka-trunk-jdk8/ws/connect/runtime/build/reports/tests/test/index.html>

* Try:
Run with --stacktrace option to get the stack trace. Run with --info or --debug option to get more log output. Run with --scan to get full insights.

* Get more help at https://help.gradle.org

Deprecated Gradle features were used in this build, making it incompatible with Gradle 6.0.
Use '--warning-mode all' to show the individual deprecation warnings.
See https://docs.gradle.org/5.4.1/userguide/command_line_interface.html#sec:command_line_warnings

BUILD FAILED in 3h 1m 7s
178 actionable tasks: 152 executed, 26 up-to-date
Build step 'Execute shell' marked build as failure
[FINDBUGS] Collecting findbugs analysis files...
Setting GRADLE_4_8_1_HOME=/home/jenkins/tools/gradle/4.8.1
[FINDBUGS] Searching for all files in <https://builds.apache.org/job/kafka-trunk-jdk8/ws/> that match the pattern **/build/reports/*bugs/*.xml
[FINDBUGS] Parsing 17 files in <https://builds.apache.org/job/kafka-trunk-jdk8/ws/>
[FINDBUGS] Successfully parsed file <https://builds.apache.org/job/kafka-trunk-jdk8/ws/clients/build/reports/spotbugs/main.xml> with 0 unique warnings and 0 duplicates.
[FINDBUGS] Successfully parsed file <https://builds.apache.org/job/kafka-trunk-jdk8/ws/connect/api/build/reports/spotbugs/main.xml> with 0 unique warnings and 0 duplicates.
[FINDBUGS] Successfully parsed file <https://builds.apache.org/job/kafka-trunk-jdk8/ws/connect/basic-auth-extension/build/reports/spotbugs/main.xml> with 0 unique warnings and 0 duplicates.
[FINDBUGS] Successfully parsed file <https://builds.apache.org/job/kafka-trunk-jdk8/ws/connect/file/build/reports/spotbugs/main.xml> with 0 unique warnings and 0 duplicates.
[FINDBUGS] Successfully parsed file <https://builds.apache.org/job/kafka-trunk-jdk8/ws/connect/json/build/reports/spotbugs/main.xml> with 0 unique warnings and 0 duplicates.
[FINDBUGS] Successfully parsed file <https://builds.apache.org/job/kafka-trunk-jdk8/ws/connect/runtime/build/reports/spotbugs/main.xml> with 0 unique warnings and 0 duplicates.
[FINDBUGS] Successfully parsed file <https://builds.apache.org/job/kafka-trunk-jdk8/ws/connect/transforms/build/reports/spotbugs/main.xml> with 0 unique warnings and 0 duplicates.
[FINDBUGS] Successfully parsed file <https://builds.apache.org/job/kafka-trunk-jdk8/ws/core/build/reports/spotbugs/main.xml> with 0 unique warnings and 0 duplicates.
[FINDBUGS] Successfully parsed file <https://builds.apache.org/job/kafka-trunk-jdk8/ws/examples/build/reports/spotbugs/main.xml> with 0 unique warnings and 0 duplicates.
[FINDBUGS] Successfully parsed file <https://builds.apache.org/job/kafka-trunk-jdk8/ws/generator/build/reports/spotbugs/main.xml> with 0 unique warnings and 0 duplicates.
[FINDBUGS] Successfully parsed file <https://builds.apache.org/job/kafka-trunk-jdk8/ws/jmh-benchmarks/build/reports/spotbugs/main.xml> with 0 unique warnings and 0 duplicates.
[FINDBUGS] Successfully parsed file <https://builds.apache.org/job/kafka-trunk-jdk8/ws/log4j-appender/build/reports/spotbugs/main.xml> with 0 unique warnings and 0 duplicates.
[FINDBUGS] Successfully parsed file <https://builds.apache.org/job/kafka-trunk-jdk8/ws/streams/build/reports/spotbugs/main.xml> with 0 unique warnings and 0 duplicates.
[FINDBUGS] Successfully parsed file <https://builds.apache.org/job/kafka-trunk-jdk8/ws/streams/examples/build/reports/spotbugs/main.xml> with 0 unique warnings and 0 duplicates.
[FINDBUGS] Successfully parsed file <https://builds.apache.org/job/kafka-trunk-jdk8/ws/streams/streams-scala/build/reports/spotbugs/main.xml> with 0 unique warnings and 0 duplicates.
[FINDBUGS] Successfully parsed file <https://builds.apache.org/job/kafka-trunk-jdk8/ws/streams/test-utils/build/reports/spotbugs/main.xml> with 0 unique warnings and 0 duplicates.
[FINDBUGS] Successfully parsed file <https://builds.apache.org/job/kafka-trunk-jdk8/ws/tools/build/reports/spotbugs/main.xml> with 0 unique warnings and 0 duplicates.
Setting GRADLE_4_8_1_HOME=/home/jenkins/tools/gradle/4.8.1
No credentials specified
Setting GRADLE_4_8_1_HOME=/home/jenkins/tools/gradle/4.8.1
<Git Blamer> Using GitBlamer to create author and commit information for all warnings.
<Git Blamer> GIT_COMMIT=74c90f46c34727be9484e9826ff543b451ada775, workspace=<https://builds.apache.org/job/kafka-trunk-jdk8/ws/>
[FINDBUGS] Computing warning deltas based on reference build #3796
Recording test results
Setting GRADLE_4_8_1_HOME=/home/jenkins/tools/gradle/4.8.1
Setting GRADLE_4_8_1_HOME=/home/jenkins/tools/gradle/4.8.1
Not sending mail to unregistered user noreply@github.com
Not sending mail to unregistered user wangguoz@gmail.com
Not sending mail to unregistered user rajinisivaram@googlemail.com

Build failed in Jenkins: kafka-trunk-jdk8 #3812

Posted by Apache Jenkins Server <je...@builds.apache.org>.
See <https://builds.apache.org/job/kafka-trunk-jdk8/3812/display/redirect?page=changes>

Changes:

[jason] KAFKA-8715; Fix buggy reliance on state timestamp in static member.id

------------------------------------------
[...truncated 6.45 MB...]
org.apache.kafka.connect.runtime.distributed.DistributedHerderTest > testRebalance STARTED

org.apache.kafka.connect.runtime.distributed.DistributedHerderTest > testRebalance PASSED

org.apache.kafka.connect.runtime.distributed.DistributedHerderTest > testIncrementalCooperativeRebalanceForNewMember STARTED

org.apache.kafka.connect.runtime.distributed.DistributedHerderTest > testIncrementalCooperativeRebalanceForNewMember PASSED

org.apache.kafka.connect.runtime.distributed.DistributedHerderTest > testIncrementalCooperativeRebalanceForExistingMember STARTED

org.apache.kafka.connect.runtime.distributed.DistributedHerderTest > testIncrementalCooperativeRebalanceForExistingMember PASSED

org.apache.kafka.connect.runtime.distributed.DistributedHerderTest > testIncrementalCooperativeRebalanceWithDelay STARTED

org.apache.kafka.connect.runtime.distributed.DistributedHerderTest > testIncrementalCooperativeRebalanceWithDelay PASSED

org.apache.kafka.connect.runtime.distributed.DistributedHerderTest > testRebalanceFailedConnector STARTED

org.apache.kafka.connect.runtime.distributed.DistributedHerderTest > testRebalanceFailedConnector PASSED

org.apache.kafka.connect.runtime.distributed.DistributedHerderTest > testHaltCleansUpWorker STARTED

org.apache.kafka.connect.runtime.distributed.DistributedHerderTest > testHaltCleansUpWorker PASSED

org.apache.kafka.connect.runtime.distributed.DistributedHerderTest > testConnectorNameConflictsWithWorkerGroupId STARTED

org.apache.kafka.connect.runtime.distributed.DistributedHerderTest > testConnectorNameConflictsWithWorkerGroupId PASSED

org.apache.kafka.connect.runtime.distributed.DistributedHerderTest > testRestartUnknownConnector STARTED

org.apache.kafka.connect.runtime.distributed.DistributedHerderTest > testRestartUnknownConnector PASSED

org.apache.kafka.connect.runtime.distributed.DistributedHerderTest > testRestartConnectorRedirectToLeader STARTED

org.apache.kafka.connect.runtime.distributed.DistributedHerderTest > testRestartConnectorRedirectToLeader PASSED

org.apache.kafka.connect.runtime.distributed.DistributedHerderTest > testRestartConnectorRedirectToOwner STARTED

org.apache.kafka.connect.runtime.distributed.DistributedHerderTest > testRestartConnectorRedirectToOwner PASSED

org.apache.kafka.connect.runtime.distributed.DistributedHerderTest > testRestartUnknownTask STARTED

org.apache.kafka.connect.runtime.distributed.DistributedHerderTest > testRestartUnknownTask PASSED

org.apache.kafka.connect.runtime.distributed.DistributedHerderTest > testRequestProcessingOrder STARTED

org.apache.kafka.connect.runtime.distributed.DistributedHerderTest > testRequestProcessingOrder PASSED

org.apache.kafka.connect.runtime.distributed.DistributedHerderTest > testRestartTaskRedirectToLeader STARTED

org.apache.kafka.connect.runtime.distributed.DistributedHerderTest > testRestartTaskRedirectToLeader PASSED

org.apache.kafka.connect.runtime.distributed.DistributedHerderTest > testRestartTaskRedirectToOwner STARTED

org.apache.kafka.connect.runtime.distributed.DistributedHerderTest > testRestartTaskRedirectToOwner PASSED

org.apache.kafka.connect.runtime.distributed.DistributedHerderTest > testConnectorConfigAdded STARTED

org.apache.kafka.connect.runtime.distributed.DistributedHerderTest > testConnectorConfigAdded PASSED

org.apache.kafka.connect.runtime.distributed.DistributedHerderTest > testConnectorConfigUpdate STARTED

org.apache.kafka.connect.runtime.distributed.DistributedHerderTest > testConnectorConfigUpdate PASSED

org.apache.kafka.connect.runtime.distributed.DistributedHerderTest > testConnectorPaused STARTED

org.apache.kafka.connect.runtime.distributed.DistributedHerderTest > testConnectorPaused PASSED

org.apache.kafka.connect.runtime.distributed.DistributedHerderTest > testConnectorResumed STARTED

org.apache.kafka.connect.runtime.distributed.DistributedHerderTest > testConnectorResumed PASSED

org.apache.kafka.connect.runtime.distributed.DistributedHerderTest > testUnknownConnectorPaused STARTED

org.apache.kafka.connect.runtime.distributed.DistributedHerderTest > testUnknownConnectorPaused PASSED

org.apache.kafka.connect.runtime.distributed.DistributedHerderTest > testConnectorPausedRunningTaskOnly STARTED

org.apache.kafka.connect.runtime.distributed.DistributedHerderTest > testConnectorPausedRunningTaskOnly PASSED

org.apache.kafka.connect.runtime.distributed.DistributedHerderTest > testConnectorResumedRunningTaskOnly STARTED

org.apache.kafka.connect.runtime.distributed.DistributedHerderTest > testConnectorResumedRunningTaskOnly PASSED

org.apache.kafka.connect.runtime.distributed.DistributedHerderTest > testTaskConfigAdded STARTED

org.apache.kafka.connect.runtime.distributed.DistributedHerderTest > testTaskConfigAdded PASSED

org.apache.kafka.connect.runtime.distributed.DistributedHerderTest > testJoinLeaderCatchUpFails STARTED

org.apache.kafka.connect.runtime.distributed.DistributedHerderTest > testJoinLeaderCatchUpFails PASSED

org.apache.kafka.connect.runtime.distributed.DistributedHerderTest > testInconsistentConfigs STARTED

org.apache.kafka.connect.runtime.distributed.DistributedHerderTest > testInconsistentConfigs PASSED

org.apache.kafka.connect.runtime.distributed.WorkerCoordinatorIncrementalTest > testMetadataWithExistingAssignmentButOlderProtocolSelection[0] STARTED

org.apache.kafka.connect.runtime.distributed.WorkerCoordinatorIncrementalTest > testMetadataWithExistingAssignmentButOlderProtocolSelection[0] PASSED

org.apache.kafka.connect.runtime.distributed.WorkerCoordinatorIncrementalTest > testMetadataWithExistingAssignment[0] STARTED

org.apache.kafka.connect.runtime.distributed.WorkerCoordinatorIncrementalTest > testMetadataWithExistingAssignment[0] PASSED

org.apache.kafka.connect.runtime.distributed.WorkerCoordinatorIncrementalTest > testTaskAssignmentWhenWorkerBounces[0] STARTED

org.apache.kafka.connect.runtime.distributed.WorkerCoordinatorIncrementalTest > testTaskAssignmentWhenWorkerBounces[0] PASSED

org.apache.kafka.connect.runtime.distributed.WorkerCoordinatorIncrementalTest > testTaskAssignmentWhenWorkerJoins[0] STARTED

org.apache.kafka.connect.runtime.distributed.WorkerCoordinatorIncrementalTest > testTaskAssignmentWhenWorkerJoins[0] PASSED

org.apache.kafka.connect.runtime.distributed.WorkerCoordinatorIncrementalTest > testTaskAssignmentWhenWorkerLeavesPermanently[0] STARTED

org.apache.kafka.connect.runtime.distributed.WorkerCoordinatorIncrementalTest > testTaskAssignmentWhenWorkerLeavesPermanently[0] PASSED

org.apache.kafka.connect.runtime.distributed.WorkerCoordinatorIncrementalTest > testMetadata[0] STARTED

org.apache.kafka.connect.runtime.distributed.WorkerCoordinatorIncrementalTest > testMetadata[0] PASSED

org.apache.kafka.connect.runtime.distributed.ConnectProtocolCompatibilityTest > testCoopToCoopMetadata STARTED

org.apache.kafka.connect.runtime.distributed.ConnectProtocolCompatibilityTest > testCoopToCoopMetadata PASSED

org.apache.kafka.connect.runtime.distributed.ConnectProtocolCompatibilityTest > testCoopToEagerAssignment STARTED

org.apache.kafka.connect.runtime.distributed.ConnectProtocolCompatibilityTest > testCoopToEagerAssignment PASSED

org.apache.kafka.connect.runtime.distributed.ConnectProtocolCompatibilityTest > testCoopToCoopAssignment STARTED

org.apache.kafka.connect.runtime.distributed.ConnectProtocolCompatibilityTest > testCoopToCoopAssignment PASSED

org.apache.kafka.connect.runtime.distributed.ConnectProtocolCompatibilityTest > testEagerToCoopAssignment STARTED

org.apache.kafka.connect.runtime.distributed.ConnectProtocolCompatibilityTest > testEagerToCoopAssignment PASSED

org.apache.kafka.connect.runtime.distributed.ConnectProtocolCompatibilityTest > testEagerToEagerAssignment STARTED

org.apache.kafka.connect.runtime.distributed.ConnectProtocolCompatibilityTest > testEagerToEagerAssignment PASSED

org.apache.kafka.connect.runtime.distributed.ConnectProtocolCompatibilityTest > testCoopToEagerMetadata STARTED

org.apache.kafka.connect.runtime.distributed.ConnectProtocolCompatibilityTest > testCoopToEagerMetadata PASSED

org.apache.kafka.connect.runtime.distributed.ConnectProtocolCompatibilityTest > testEagerToEagerMetadata STARTED

org.apache.kafka.connect.runtime.distributed.ConnectProtocolCompatibilityTest > testEagerToEagerMetadata PASSED

org.apache.kafka.connect.runtime.distributed.ConnectProtocolCompatibilityTest > testEagerToCoopMetadata STARTED

org.apache.kafka.connect.runtime.distributed.ConnectProtocolCompatibilityTest > testEagerToCoopMetadata PASSED

org.apache.kafka.connect.runtime.ConnectorConfigTest > unconfiguredTransform STARTED

org.apache.kafka.connect.runtime.ConnectorConfigTest > unconfiguredTransform PASSED

org.apache.kafka.connect.runtime.ConnectorConfigTest > multipleTransformsOneDangling STARTED

org.apache.kafka.connect.runtime.ConnectorConfigTest > multipleTransformsOneDangling PASSED

org.apache.kafka.connect.runtime.ConnectorConfigTest > misconfiguredTransform STARTED

org.apache.kafka.connect.runtime.ConnectorConfigTest > misconfiguredTransform PASSED

org.apache.kafka.connect.runtime.ConnectorConfigTest > noTransforms STARTED

org.apache.kafka.connect.runtime.ConnectorConfigTest > noTransforms PASSED

org.apache.kafka.connect.runtime.ConnectorConfigTest > danglingTransformAlias STARTED

org.apache.kafka.connect.runtime.ConnectorConfigTest > danglingTransformAlias PASSED

org.apache.kafka.connect.runtime.ConnectorConfigTest > emptyConnectorName STARTED

org.apache.kafka.connect.runtime.ConnectorConfigTest > emptyConnectorName PASSED

org.apache.kafka.connect.runtime.ConnectorConfigTest > multipleTransforms STARTED

org.apache.kafka.connect.runtime.ConnectorConfigTest > multipleTransforms PASSED

org.apache.kafka.connect.runtime.ConnectorConfigTest > singleTransform STARTED

org.apache.kafka.connect.runtime.ConnectorConfigTest > singleTransform PASSED

org.apache.kafka.connect.runtime.ConnectorConfigTest > wrongTransformationType STARTED

org.apache.kafka.connect.runtime.ConnectorConfigTest > wrongTransformationType PASSED

470 tests completed, 1 failed

> Task :connect:runtime:test FAILED

> Task :streams:examples:test

org.apache.kafka.streams.examples.wordcount.WordCountProcessorTest > test STARTED

org.apache.kafka.streams.examples.wordcount.WordCountProcessorTest > test PASSED

FAILURE: Build failed with an exception.

* What went wrong:
Execution failed for task ':connect:runtime:test'.
> There were failing tests. See the report at: file://<https://builds.apache.org/job/kafka-trunk-jdk8/ws/connect/runtime/build/reports/tests/test/index.html>

* Try:
Run with --stacktrace option to get the stack trace. Run with --info or --debug option to get more log output. Run with --scan to get full insights.

* Get more help at https://help.gradle.org

Deprecated Gradle features were used in this build, making it incompatible with Gradle 6.0.
Use '--warning-mode all' to show the individual deprecation warnings.
See https://docs.gradle.org/5.4.1/userguide/command_line_interface.html#sec:command_line_warnings

BUILD FAILED in 2h 7m 39s
178 actionable tasks: 175 executed, 3 up-to-date
Build step 'Execute shell' marked build as failure
[FINDBUGS] Collecting findbugs analysis files...
Setting GRADLE_4_8_1_HOME=/home/jenkins/tools/gradle/4.8.1
[FINDBUGS] Searching for all files in <https://builds.apache.org/job/kafka-trunk-jdk8/ws/> that match the pattern **/build/reports/*bugs/*.xml
[FINDBUGS] Parsing 17 files in <https://builds.apache.org/job/kafka-trunk-jdk8/ws/>
[FINDBUGS] Successfully parsed file <https://builds.apache.org/job/kafka-trunk-jdk8/ws/clients/build/reports/spotbugs/main.xml> with 0 unique warnings and 0 duplicates.
[FINDBUGS] Successfully parsed file <https://builds.apache.org/job/kafka-trunk-jdk8/ws/connect/api/build/reports/spotbugs/main.xml> with 0 unique warnings and 0 duplicates.
[FINDBUGS] Successfully parsed file <https://builds.apache.org/job/kafka-trunk-jdk8/ws/connect/basic-auth-extension/build/reports/spotbugs/main.xml> with 0 unique warnings and 0 duplicates.
[FINDBUGS] Successfully parsed file <https://builds.apache.org/job/kafka-trunk-jdk8/ws/connect/file/build/reports/spotbugs/main.xml> with 0 unique warnings and 0 duplicates.
[FINDBUGS] Successfully parsed file <https://builds.apache.org/job/kafka-trunk-jdk8/ws/connect/json/build/reports/spotbugs/main.xml> with 0 unique warnings and 0 duplicates.
[FINDBUGS] Successfully parsed file <https://builds.apache.org/job/kafka-trunk-jdk8/ws/connect/runtime/build/reports/spotbugs/main.xml> with 0 unique warnings and 0 duplicates.
[FINDBUGS] Successfully parsed file <https://builds.apache.org/job/kafka-trunk-jdk8/ws/connect/transforms/build/reports/spotbugs/main.xml> with 0 unique warnings and 0 duplicates.
[FINDBUGS] Successfully parsed file <https://builds.apache.org/job/kafka-trunk-jdk8/ws/core/build/reports/spotbugs/main.xml> with 0 unique warnings and 0 duplicates.
[FINDBUGS] Successfully parsed file <https://builds.apache.org/job/kafka-trunk-jdk8/ws/examples/build/reports/spotbugs/main.xml> with 0 unique warnings and 0 duplicates.
[FINDBUGS] Successfully parsed file <https://builds.apache.org/job/kafka-trunk-jdk8/ws/generator/build/reports/spotbugs/main.xml> with 0 unique warnings and 0 duplicates.
[FINDBUGS] Successfully parsed file <https://builds.apache.org/job/kafka-trunk-jdk8/ws/jmh-benchmarks/build/reports/spotbugs/main.xml> with 0 unique warnings and 0 duplicates.
[FINDBUGS] Successfully parsed file <https://builds.apache.org/job/kafka-trunk-jdk8/ws/log4j-appender/build/reports/spotbugs/main.xml> with 0 unique warnings and 0 duplicates.
[FINDBUGS] Successfully parsed file <https://builds.apache.org/job/kafka-trunk-jdk8/ws/streams/build/reports/spotbugs/main.xml> with 0 unique warnings and 0 duplicates.
[FINDBUGS] Successfully parsed file <https://builds.apache.org/job/kafka-trunk-jdk8/ws/streams/examples/build/reports/spotbugs/main.xml> with 0 unique warnings and 0 duplicates.
[FINDBUGS] Successfully parsed file <https://builds.apache.org/job/kafka-trunk-jdk8/ws/streams/streams-scala/build/reports/spotbugs/main.xml> with 0 unique warnings and 0 duplicates.
[FINDBUGS] Successfully parsed file <https://builds.apache.org/job/kafka-trunk-jdk8/ws/streams/test-utils/build/reports/spotbugs/main.xml> with 0 unique warnings and 0 duplicates.
[FINDBUGS] Successfully parsed file <https://builds.apache.org/job/kafka-trunk-jdk8/ws/tools/build/reports/spotbugs/main.xml> with 0 unique warnings and 0 duplicates.
Setting GRADLE_4_8_1_HOME=/home/jenkins/tools/gradle/4.8.1
No credentials specified
Setting GRADLE_4_8_1_HOME=/home/jenkins/tools/gradle/4.8.1
<Git Blamer> Using GitBlamer to create author and commit information for all warnings.
<Git Blamer> GIT_COMMIT=79341a12f235510d9f78af24d979102c3d8882e1, workspace=<https://builds.apache.org/job/kafka-trunk-jdk8/ws/>
[FINDBUGS] Computing warning deltas based on reference build #3796
Recording test results
Setting GRADLE_4_8_1_HOME=/home/jenkins/tools/gradle/4.8.1
Setting GRADLE_4_8_1_HOME=/home/jenkins/tools/gradle/4.8.1
Not sending mail to unregistered user noreply@github.com
Not sending mail to unregistered user wangguoz@gmail.com
Not sending mail to unregistered user rajinisivaram@googlemail.com

Build failed in Jenkins: kafka-trunk-jdk8 #3811

Posted by Apache Jenkins Server <je...@builds.apache.org>.
See <https://builds.apache.org/job/kafka-trunk-jdk8/3811/display/redirect?page=changes>

Changes:

[wangguoz] KAFKA-8179: add public ConsumerPartitionAssignor interface (#7108)

------------------------------------------
Started by an SCM change
Started by an SCM change
[EnvInject] - Loading node environment variables.
Building remotely on H44 (ubuntu bionic) in workspace <https://builds.apache.org/job/kafka-trunk-jdk8/ws/>
[WS-CLEANUP] Deleting project workspace...
[WS-CLEANUP] Deferred wipeout is used...
[WS-CLEANUP] Done
No credentials specified
Cloning the remote Git repository
Cloning repository https://github.com/apache/kafka.git
 > git init <https://builds.apache.org/job/kafka-trunk-jdk8/ws/> # timeout=10
Fetching upstream changes from https://github.com/apache/kafka.git
 > git --version # timeout=10
 > git fetch --tags --progress https://github.com/apache/kafka.git +refs/heads/*:refs/remotes/origin/*
 > git config remote.origin.url https://github.com/apache/kafka.git # timeout=10
 > git config --add remote.origin.fetch +refs/heads/*:refs/remotes/origin/* # timeout=10
 > git config remote.origin.url https://github.com/apache/kafka.git # timeout=10
Fetching upstream changes from https://github.com/apache/kafka.git
 > git fetch --tags --progress https://github.com/apache/kafka.git +refs/heads/*:refs/remotes/origin/*
 > git rev-parse refs/remotes/origin/trunk^{commit} # timeout=10
 > git rev-parse refs/remotes/origin/origin/trunk^{commit} # timeout=10
Checking out Revision 69d86a197f86ad4c6f1636b5ab4678907e30a4c0 (refs/remotes/origin/trunk)
 > git config core.sparsecheckout # timeout=10
 > git checkout -f 69d86a197f86ad4c6f1636b5ab4678907e30a4c0
Commit message: "KAFKA-8179: add public ConsumerPartitionAssignor interface (#7108)"
 > git rev-list --no-walk e9c61f690e548fb8c587d777e5c8f71149a38fea # timeout=10
Setting GRADLE_4_8_1_HOME=/home/jenkins/tools/gradle/4.8.1
[kafka-trunk-jdk8] $ /bin/bash -xe /tmp/jenkins1918243911402619654.sh
+ rm -rf <https://builds.apache.org/job/kafka-trunk-jdk8/ws/.gradle>
+ /home/jenkins/tools/gradle/4.8.1/bin/gradle
/tmp/jenkins1918243911402619654.sh: line 4: /home/jenkins/tools/gradle/4.8.1/bin/gradle: No such file or directory
Build step 'Execute shell' marked build as failure
[FINDBUGS] Collecting findbugs analysis files...
Setting GRADLE_4_8_1_HOME=/home/jenkins/tools/gradle/4.8.1
[FINDBUGS] Searching for all files in <https://builds.apache.org/job/kafka-trunk-jdk8/ws/> that match the pattern **/build/reports/*bugs/*.xml
[FINDBUGS] No files found. Configuration error?
Setting GRADLE_4_8_1_HOME=/home/jenkins/tools/gradle/4.8.1
No credentials specified
Setting GRADLE_4_8_1_HOME=/home/jenkins/tools/gradle/4.8.1
<Git Blamer> Using GitBlamer to create author and commit information for all warnings.
<Git Blamer> GIT_COMMIT=69d86a197f86ad4c6f1636b5ab4678907e30a4c0, workspace=<https://builds.apache.org/job/kafka-trunk-jdk8/ws/>
[FINDBUGS] Computing warning deltas based on reference build #3796
Recording test results
Setting GRADLE_4_8_1_HOME=/home/jenkins/tools/gradle/4.8.1
ERROR: Step ?Publish JUnit test result report? failed: No test report files were found. Configuration error?
Setting GRADLE_4_8_1_HOME=/home/jenkins/tools/gradle/4.8.1
Not sending mail to unregistered user noreply@github.com
Not sending mail to unregistered user wangguoz@gmail.com
Not sending mail to unregistered user rajinisivaram@googlemail.com

Build failed in Jenkins: kafka-trunk-jdk8 #3810

Posted by Apache Jenkins Server <je...@builds.apache.org>.
See <https://builds.apache.org/job/kafka-trunk-jdk8/3810/display/redirect?page=changes>

Changes:

[junrao] MINOR: Ensure in-memory metadata is removed before physical deletion of

------------------------------------------
[...truncated 2.56 MB...]
org.apache.kafka.connect.transforms.TimestampConverterTest > testWithSchemaNullFieldToUnix PASSED

org.apache.kafka.connect.transforms.TimestampConverterTest > testConfigNoTargetType STARTED

org.apache.kafka.connect.transforms.TimestampConverterTest > testConfigNoTargetType PASSED

org.apache.kafka.connect.transforms.TimestampConverterTest > testWithSchemaStringToTimestamp STARTED

org.apache.kafka.connect.transforms.TimestampConverterTest > testWithSchemaStringToTimestamp PASSED

org.apache.kafka.connect.transforms.TimestampConverterTest > testWithSchemaTimeToTimestamp STARTED

org.apache.kafka.connect.transforms.TimestampConverterTest > testWithSchemaTimeToTimestamp PASSED

org.apache.kafka.connect.transforms.TimestampConverterTest > testSchemalessUnixToTimestamp STARTED

org.apache.kafka.connect.transforms.TimestampConverterTest > testSchemalessUnixToTimestamp PASSED

org.apache.kafka.connect.transforms.TimestampConverterTest > testWithSchemaTimestampToString STARTED

org.apache.kafka.connect.transforms.TimestampConverterTest > testWithSchemaTimestampToString PASSED

org.apache.kafka.connect.transforms.TimestampConverterTest > testConfigInvalidFormat STARTED

org.apache.kafka.connect.transforms.TimestampConverterTest > testConfigInvalidFormat PASSED

org.apache.kafka.connect.transforms.InsertFieldTest > schemalessInsertConfiguredFields STARTED

org.apache.kafka.connect.transforms.InsertFieldTest > schemalessInsertConfiguredFields PASSED

org.apache.kafka.connect.transforms.InsertFieldTest > topLevelStructRequired STARTED

org.apache.kafka.connect.transforms.InsertFieldTest > topLevelStructRequired PASSED

org.apache.kafka.connect.transforms.InsertFieldTest > copySchemaAndInsertConfiguredFields STARTED

org.apache.kafka.connect.transforms.InsertFieldTest > copySchemaAndInsertConfiguredFields PASSED

org.apache.kafka.connect.transforms.RegexRouterTest > doesntMatch STARTED

org.apache.kafka.connect.transforms.RegexRouterTest > doesntMatch PASSED

org.apache.kafka.connect.transforms.RegexRouterTest > identity STARTED

org.apache.kafka.connect.transforms.RegexRouterTest > identity PASSED

org.apache.kafka.connect.transforms.RegexRouterTest > addPrefix STARTED

org.apache.kafka.connect.transforms.RegexRouterTest > addPrefix PASSED

org.apache.kafka.connect.transforms.RegexRouterTest > addSuffix STARTED

org.apache.kafka.connect.transforms.RegexRouterTest > addSuffix PASSED

org.apache.kafka.connect.transforms.RegexRouterTest > slice STARTED

org.apache.kafka.connect.transforms.RegexRouterTest > slice PASSED

org.apache.kafka.connect.transforms.RegexRouterTest > staticReplacement STARTED

org.apache.kafka.connect.transforms.RegexRouterTest > staticReplacement PASSED

org.apache.kafka.connect.transforms.ValueToKeyTest > withSchema STARTED

org.apache.kafka.connect.transforms.ValueToKeyTest > withSchema PASSED

org.apache.kafka.connect.transforms.ValueToKeyTest > schemaless STARTED

org.apache.kafka.connect.transforms.ValueToKeyTest > schemaless PASSED

org.apache.kafka.connect.transforms.TimestampRouterTest > defaultConfiguration STARTED

org.apache.kafka.connect.transforms.TimestampRouterTest > defaultConfiguration PASSED

org.apache.kafka.connect.transforms.FlattenTest > testKey STARTED

org.apache.kafka.connect.transforms.FlattenTest > testKey PASSED

org.apache.kafka.connect.transforms.FlattenTest > testOptionalAndDefaultValuesNested STARTED

org.apache.kafka.connect.transforms.FlattenTest > testOptionalAndDefaultValuesNested PASSED

org.apache.kafka.connect.transforms.FlattenTest > topLevelMapRequired STARTED

org.apache.kafka.connect.transforms.FlattenTest > topLevelMapRequired PASSED

org.apache.kafka.connect.transforms.FlattenTest > topLevelStructRequired STARTED

org.apache.kafka.connect.transforms.FlattenTest > topLevelStructRequired PASSED

org.apache.kafka.connect.transforms.FlattenTest > testOptionalFieldStruct STARTED

org.apache.kafka.connect.transforms.FlattenTest > testOptionalFieldStruct PASSED

org.apache.kafka.connect.transforms.FlattenTest > testOptionalNestedStruct STARTED

org.apache.kafka.connect.transforms.FlattenTest > testOptionalNestedStruct PASSED

org.apache.kafka.connect.transforms.FlattenTest > testNestedMapWithDelimiter STARTED

org.apache.kafka.connect.transforms.FlattenTest > testNestedMapWithDelimiter PASSED

org.apache.kafka.connect.transforms.FlattenTest > testOptionalFieldMap STARTED

org.apache.kafka.connect.transforms.FlattenTest > testOptionalFieldMap PASSED

org.apache.kafka.connect.transforms.FlattenTest > testUnsupportedTypeInMap STARTED

org.apache.kafka.connect.transforms.FlattenTest > testUnsupportedTypeInMap PASSED

org.apache.kafka.connect.transforms.FlattenTest > testOptionalStruct STARTED

org.apache.kafka.connect.transforms.FlattenTest > testOptionalStruct PASSED

org.apache.kafka.connect.transforms.FlattenTest > testNestedStruct STARTED

org.apache.kafka.connect.transforms.FlattenTest > testNestedStruct PASSED

org.apache.kafka.connect.transforms.util.NonEmptyListValidatorTest > testNullList STARTED

org.apache.kafka.connect.transforms.util.NonEmptyListValidatorTest > testNullList PASSED

org.apache.kafka.connect.transforms.util.NonEmptyListValidatorTest > testEmptyList STARTED

org.apache.kafka.connect.transforms.util.NonEmptyListValidatorTest > testEmptyList PASSED

org.apache.kafka.connect.transforms.util.NonEmptyListValidatorTest > testValidList STARTED

org.apache.kafka.connect.transforms.util.NonEmptyListValidatorTest > testValidList PASSED

org.apache.kafka.connect.transforms.ReplaceFieldTest > withSchema STARTED

org.apache.kafka.connect.transforms.ReplaceFieldTest > withSchema PASSED

org.apache.kafka.connect.transforms.ReplaceFieldTest > schemaless STARTED

org.apache.kafka.connect.transforms.ReplaceFieldTest > schemaless PASSED

org.apache.kafka.connect.transforms.MaskFieldTest > withSchema STARTED

org.apache.kafka.connect.transforms.MaskFieldTest > withSchema PASSED

org.apache.kafka.connect.transforms.MaskFieldTest > schemaless STARTED

org.apache.kafka.connect.transforms.MaskFieldTest > schemaless PASSED

org.apache.kafka.connect.transforms.ExtractFieldTest > withSchema STARTED

org.apache.kafka.connect.transforms.ExtractFieldTest > withSchema PASSED

org.apache.kafka.connect.transforms.ExtractFieldTest > testNullWithSchema STARTED

org.apache.kafka.connect.transforms.ExtractFieldTest > testNullWithSchema PASSED

org.apache.kafka.connect.transforms.ExtractFieldTest > schemaless STARTED

org.apache.kafka.connect.transforms.ExtractFieldTest > schemaless PASSED

org.apache.kafka.connect.transforms.ExtractFieldTest > testNullSchemaless STARTED

org.apache.kafka.connect.transforms.ExtractFieldTest > testNullSchemaless PASSED

org.apache.kafka.connect.transforms.HoistFieldTest > withSchema STARTED

org.apache.kafka.connect.transforms.HoistFieldTest > withSchema PASSED

org.apache.kafka.connect.transforms.HoistFieldTest > schemaless STARTED

org.apache.kafka.connect.transforms.HoistFieldTest > schemaless PASSED

org.apache.kafka.connect.transforms.SetSchemaMetadataTest > schemaNameUpdate STARTED

org.apache.kafka.connect.transforms.SetSchemaMetadataTest > schemaNameUpdate PASSED

org.apache.kafka.connect.transforms.SetSchemaMetadataTest > schemaNameAndVersionUpdateWithStruct STARTED

org.apache.kafka.connect.transforms.SetSchemaMetadataTest > schemaNameAndVersionUpdateWithStruct PASSED

org.apache.kafka.connect.transforms.SetSchemaMetadataTest > updateSchemaOfStruct STARTED

org.apache.kafka.connect.transforms.SetSchemaMetadataTest > updateSchemaOfStruct PASSED

org.apache.kafka.connect.transforms.SetSchemaMetadataTest > schemaNameAndVersionUpdate STARTED

org.apache.kafka.connect.transforms.SetSchemaMetadataTest > schemaNameAndVersionUpdate PASSED

org.apache.kafka.connect.transforms.SetSchemaMetadataTest > updateSchemaOfNull STARTED

org.apache.kafka.connect.transforms.SetSchemaMetadataTest > updateSchemaOfNull PASSED

org.apache.kafka.connect.transforms.SetSchemaMetadataTest > schemaVersionUpdate STARTED

org.apache.kafka.connect.transforms.SetSchemaMetadataTest > schemaVersionUpdate PASSED

org.apache.kafka.connect.transforms.SetSchemaMetadataTest > updateSchemaOfNonStruct STARTED

org.apache.kafka.connect.transforms.SetSchemaMetadataTest > updateSchemaOfNonStruct PASSED

FAILURE: Build failed with an exception.

* What went wrong:
Execution failed for task ':core:test'.
> There were failing tests. See the report at: file://<https://builds.apache.org/job/kafka-trunk-jdk8/ws/core/build/reports/tests/test/index.html>

* Try:
Run with --stacktrace option to get the stack trace. Run with --info or --debug option to get more log output. Run with --scan to get full insights.

* Get more help at https://help.gradle.org

Deprecated Gradle features were used in this build, making it incompatible with Gradle 6.0.
Use '--warning-mode all' to show the individual deprecation warnings.
See https://docs.gradle.org/5.4.1/userguide/command_line_interface.html#sec:command_line_warnings

BUILD FAILED in 3h 24m 29s
178 actionable tasks: 152 executed, 26 up-to-date
Build step 'Execute shell' marked build as failure
[FINDBUGS] Collecting findbugs analysis files...
Setting GRADLE_4_8_1_HOME=/home/jenkins/tools/gradle/4.8.1
[FINDBUGS] Searching for all files in <https://builds.apache.org/job/kafka-trunk-jdk8/ws/> that match the pattern **/build/reports/*bugs/*.xml
[FINDBUGS] Parsing 17 files in <https://builds.apache.org/job/kafka-trunk-jdk8/ws/>
[FINDBUGS] Successfully parsed file <https://builds.apache.org/job/kafka-trunk-jdk8/ws/clients/build/reports/spotbugs/main.xml> with 0 unique warnings and 0 duplicates.
[FINDBUGS] Successfully parsed file <https://builds.apache.org/job/kafka-trunk-jdk8/ws/connect/api/build/reports/spotbugs/main.xml> with 0 unique warnings and 0 duplicates.
[FINDBUGS] Successfully parsed file <https://builds.apache.org/job/kafka-trunk-jdk8/ws/connect/basic-auth-extension/build/reports/spotbugs/main.xml> with 0 unique warnings and 0 duplicates.
[FINDBUGS] Successfully parsed file <https://builds.apache.org/job/kafka-trunk-jdk8/ws/connect/file/build/reports/spotbugs/main.xml> with 0 unique warnings and 0 duplicates.
[FINDBUGS] Successfully parsed file <https://builds.apache.org/job/kafka-trunk-jdk8/ws/connect/json/build/reports/spotbugs/main.xml> with 0 unique warnings and 0 duplicates.
[FINDBUGS] Successfully parsed file <https://builds.apache.org/job/kafka-trunk-jdk8/ws/connect/runtime/build/reports/spotbugs/main.xml> with 0 unique warnings and 0 duplicates.
[FINDBUGS] Successfully parsed file <https://builds.apache.org/job/kafka-trunk-jdk8/ws/connect/transforms/build/reports/spotbugs/main.xml> with 0 unique warnings and 0 duplicates.
[FINDBUGS] Successfully parsed file <https://builds.apache.org/job/kafka-trunk-jdk8/ws/core/build/reports/spotbugs/main.xml> with 0 unique warnings and 0 duplicates.
[FINDBUGS] Successfully parsed file <https://builds.apache.org/job/kafka-trunk-jdk8/ws/examples/build/reports/spotbugs/main.xml> with 0 unique warnings and 0 duplicates.
[FINDBUGS] Successfully parsed file <https://builds.apache.org/job/kafka-trunk-jdk8/ws/generator/build/reports/spotbugs/main.xml> with 0 unique warnings and 0 duplicates.
[FINDBUGS] Successfully parsed file <https://builds.apache.org/job/kafka-trunk-jdk8/ws/jmh-benchmarks/build/reports/spotbugs/main.xml> with 0 unique warnings and 0 duplicates.
[FINDBUGS] Successfully parsed file <https://builds.apache.org/job/kafka-trunk-jdk8/ws/log4j-appender/build/reports/spotbugs/main.xml> with 0 unique warnings and 0 duplicates.
[FINDBUGS] Successfully parsed file <https://builds.apache.org/job/kafka-trunk-jdk8/ws/streams/build/reports/spotbugs/main.xml> with 0 unique warnings and 0 duplicates.
[FINDBUGS] Successfully parsed file <https://builds.apache.org/job/kafka-trunk-jdk8/ws/streams/examples/build/reports/spotbugs/main.xml> with 0 unique warnings and 0 duplicates.
[FINDBUGS] Successfully parsed file <https://builds.apache.org/job/kafka-trunk-jdk8/ws/streams/streams-scala/build/reports/spotbugs/main.xml> with 0 unique warnings and 0 duplicates.
[FINDBUGS] Successfully parsed file <https://builds.apache.org/job/kafka-trunk-jdk8/ws/streams/test-utils/build/reports/spotbugs/main.xml> with 0 unique warnings and 0 duplicates.
[FINDBUGS] Successfully parsed file <https://builds.apache.org/job/kafka-trunk-jdk8/ws/tools/build/reports/spotbugs/main.xml> with 0 unique warnings and 0 duplicates.
Setting GRADLE_4_8_1_HOME=/home/jenkins/tools/gradle/4.8.1
No credentials specified
Setting GRADLE_4_8_1_HOME=/home/jenkins/tools/gradle/4.8.1
<Git Blamer> Using GitBlamer to create author and commit information for all warnings.
<Git Blamer> GIT_COMMIT=e9c61f690e548fb8c587d777e5c8f71149a38fea, workspace=<https://builds.apache.org/job/kafka-trunk-jdk8/ws/>
[FINDBUGS] Computing warning deltas based on reference build #3796
Recording test results
Setting GRADLE_4_8_1_HOME=/home/jenkins/tools/gradle/4.8.1
Setting GRADLE_4_8_1_HOME=/home/jenkins/tools/gradle/4.8.1
Not sending mail to unregistered user noreply@github.com
Not sending mail to unregistered user wangguoz@gmail.com
Not sending mail to unregistered user rajinisivaram@googlemail.com

Build failed in Jenkins: kafka-trunk-jdk8 #3809

Posted by Apache Jenkins Server <je...@builds.apache.org>.
See <https://builds.apache.org/job/kafka-trunk-jdk8/3809/display/redirect?page=changes>

Changes:

[wangguoz] KAFKA-8696: clean up Sum/Count/Total metrics (#7057)

------------------------------------------
[...truncated 6.45 MB...]

org.apache.kafka.connect.transforms.TimestampConverterTest > testWithSchemaNullFieldToTimestamp STARTED

org.apache.kafka.connect.transforms.TimestampConverterTest > testWithSchemaNullFieldToTimestamp PASSED

org.apache.kafka.connect.transforms.TimestampConverterTest > testWithSchemaFieldConversion STARTED

org.apache.kafka.connect.transforms.TimestampConverterTest > testWithSchemaFieldConversion PASSED

org.apache.kafka.connect.transforms.TimestampConverterTest > testWithSchemaNullFieldToString STARTED

org.apache.kafka.connect.transforms.TimestampConverterTest > testWithSchemaNullFieldToString PASSED

org.apache.kafka.connect.transforms.TimestampConverterTest > testSchemalessNullValueToTimestamp STARTED

org.apache.kafka.connect.transforms.TimestampConverterTest > testSchemalessNullValueToTimestamp PASSED

org.apache.kafka.connect.transforms.TimestampConverterTest > testSchemalessNullValueToString STARTED

org.apache.kafka.connect.transforms.TimestampConverterTest > testSchemalessNullValueToString PASSED

org.apache.kafka.connect.transforms.TimestampConverterTest > testWithSchemaDateToTimestamp STARTED

org.apache.kafka.connect.transforms.TimestampConverterTest > testWithSchemaDateToTimestamp PASSED

org.apache.kafka.connect.transforms.TimestampConverterTest > testWithSchemaIdentity STARTED

org.apache.kafka.connect.transforms.TimestampConverterTest > testWithSchemaIdentity PASSED

org.apache.kafka.connect.transforms.TimestampConverterTest > testSchemalessTimestampToDate STARTED

org.apache.kafka.connect.transforms.TimestampConverterTest > testSchemalessTimestampToDate PASSED

org.apache.kafka.connect.transforms.TimestampConverterTest > testSchemalessTimestampToTime STARTED

org.apache.kafka.connect.transforms.TimestampConverterTest > testSchemalessTimestampToTime PASSED

org.apache.kafka.connect.transforms.TimestampConverterTest > testSchemalessTimestampToUnix STARTED

org.apache.kafka.connect.transforms.TimestampConverterTest > testSchemalessTimestampToUnix PASSED

org.apache.kafka.connect.transforms.TimestampConverterTest > testConfigMissingFormat STARTED

org.apache.kafka.connect.transforms.TimestampConverterTest > testConfigMissingFormat PASSED

org.apache.kafka.connect.transforms.TimestampConverterTest > testSchemalessNullValueToDate STARTED

org.apache.kafka.connect.transforms.TimestampConverterTest > testSchemalessNullValueToDate PASSED

org.apache.kafka.connect.transforms.TimestampConverterTest > testSchemalessNullValueToTime STARTED

org.apache.kafka.connect.transforms.TimestampConverterTest > testSchemalessNullValueToTime PASSED

org.apache.kafka.connect.transforms.TimestampConverterTest > testSchemalessNullValueToUnix STARTED

org.apache.kafka.connect.transforms.TimestampConverterTest > testSchemalessNullValueToUnix PASSED

org.apache.kafka.connect.transforms.TimestampConverterTest > testWithSchemaNullFieldToDate STARTED

org.apache.kafka.connect.transforms.TimestampConverterTest > testWithSchemaNullFieldToDate PASSED

org.apache.kafka.connect.transforms.TimestampConverterTest > testWithSchemaNullFieldToTime STARTED

org.apache.kafka.connect.transforms.TimestampConverterTest > testWithSchemaNullFieldToTime PASSED

org.apache.kafka.connect.transforms.TimestampConverterTest > testWithSchemaNullFieldToUnix STARTED

org.apache.kafka.connect.transforms.TimestampConverterTest > testWithSchemaNullFieldToUnix PASSED

org.apache.kafka.connect.transforms.TimestampConverterTest > testConfigNoTargetType STARTED

org.apache.kafka.connect.transforms.TimestampConverterTest > testConfigNoTargetType PASSED

org.apache.kafka.connect.transforms.TimestampConverterTest > testWithSchemaStringToTimestamp STARTED

org.apache.kafka.connect.transforms.TimestampConverterTest > testWithSchemaStringToTimestamp PASSED

org.apache.kafka.connect.transforms.TimestampConverterTest > testWithSchemaTimeToTimestamp STARTED

org.apache.kafka.connect.transforms.TimestampConverterTest > testWithSchemaTimeToTimestamp PASSED

org.apache.kafka.connect.transforms.TimestampConverterTest > testSchemalessUnixToTimestamp STARTED

org.apache.kafka.connect.transforms.TimestampConverterTest > testSchemalessUnixToTimestamp PASSED

org.apache.kafka.connect.transforms.TimestampConverterTest > testWithSchemaTimestampToString STARTED

org.apache.kafka.connect.transforms.TimestampConverterTest > testWithSchemaTimestampToString PASSED

org.apache.kafka.connect.transforms.TimestampConverterTest > testConfigInvalidFormat STARTED

org.apache.kafka.connect.transforms.TimestampConverterTest > testConfigInvalidFormat PASSED

org.apache.kafka.connect.transforms.HoistFieldTest > withSchema STARTED

org.apache.kafka.connect.transforms.HoistFieldTest > withSchema PASSED

org.apache.kafka.connect.transforms.HoistFieldTest > schemaless STARTED

org.apache.kafka.connect.transforms.HoistFieldTest > schemaless PASSED

org.apache.kafka.connect.transforms.RegexRouterTest > doesntMatch STARTED

org.apache.kafka.connect.transforms.RegexRouterTest > doesntMatch PASSED

org.apache.kafka.connect.transforms.RegexRouterTest > identity STARTED

org.apache.kafka.connect.transforms.RegexRouterTest > identity PASSED

org.apache.kafka.connect.transforms.RegexRouterTest > addPrefix STARTED

org.apache.kafka.connect.transforms.RegexRouterTest > addPrefix PASSED

org.apache.kafka.connect.transforms.RegexRouterTest > addSuffix STARTED

org.apache.kafka.connect.transforms.RegexRouterTest > addSuffix PASSED

org.apache.kafka.connect.transforms.RegexRouterTest > slice STARTED

org.apache.kafka.connect.transforms.RegexRouterTest > slice PASSED

org.apache.kafka.connect.transforms.RegexRouterTest > staticReplacement STARTED

org.apache.kafka.connect.transforms.RegexRouterTest > staticReplacement PASSED

org.apache.kafka.connect.transforms.util.NonEmptyListValidatorTest > testNullList STARTED

org.apache.kafka.connect.transforms.util.NonEmptyListValidatorTest > testNullList PASSED

org.apache.kafka.connect.transforms.util.NonEmptyListValidatorTest > testEmptyList STARTED

org.apache.kafka.connect.transforms.util.NonEmptyListValidatorTest > testEmptyList PASSED

org.apache.kafka.connect.transforms.util.NonEmptyListValidatorTest > testValidList STARTED

org.apache.kafka.connect.transforms.util.NonEmptyListValidatorTest > testValidList PASSED

org.apache.kafka.connect.transforms.ExtractFieldTest > withSchema STARTED

org.apache.kafka.connect.transforms.ExtractFieldTest > withSchema PASSED

org.apache.kafka.connect.transforms.ExtractFieldTest > testNullWithSchema STARTED

org.apache.kafka.connect.transforms.ExtractFieldTest > testNullWithSchema PASSED

org.apache.kafka.connect.transforms.ExtractFieldTest > schemaless STARTED

org.apache.kafka.connect.transforms.ExtractFieldTest > schemaless PASSED

org.apache.kafka.connect.transforms.ExtractFieldTest > testNullSchemaless STARTED

org.apache.kafka.connect.transforms.ExtractFieldTest > testNullSchemaless PASSED

org.apache.kafka.connect.transforms.MaskFieldTest > withSchema STARTED

org.apache.kafka.connect.transforms.MaskFieldTest > withSchema PASSED

org.apache.kafka.connect.transforms.MaskFieldTest > schemaless STARTED

org.apache.kafka.connect.transforms.MaskFieldTest > schemaless PASSED

org.apache.kafka.connect.transforms.InsertFieldTest > schemalessInsertConfiguredFields STARTED

org.apache.kafka.connect.transforms.InsertFieldTest > schemalessInsertConfiguredFields PASSED

org.apache.kafka.connect.transforms.InsertFieldTest > topLevelStructRequired STARTED

org.apache.kafka.connect.transforms.InsertFieldTest > topLevelStructRequired PASSED

org.apache.kafka.connect.transforms.InsertFieldTest > copySchemaAndInsertConfiguredFields STARTED

org.apache.kafka.connect.transforms.InsertFieldTest > copySchemaAndInsertConfiguredFields PASSED

org.apache.kafka.connect.transforms.ValueToKeyTest > withSchema STARTED

org.apache.kafka.connect.transforms.ValueToKeyTest > withSchema PASSED

org.apache.kafka.connect.transforms.ValueToKeyTest > schemaless STARTED

org.apache.kafka.connect.transforms.ValueToKeyTest > schemaless PASSED

org.apache.kafka.connect.transforms.TimestampRouterTest > defaultConfiguration STARTED

org.apache.kafka.connect.transforms.TimestampRouterTest > defaultConfiguration PASSED

FAILURE: Build completed with 2 failures.

1: Task failed with an exception.
-----------
* What went wrong:
Execution failed for task ':core:test'.
> There were failing tests. See the report at: file://<https://builds.apache.org/job/kafka-trunk-jdk8/ws/core/build/reports/tests/test/index.html>

* Try:
Run with --stacktrace option to get the stack trace. Run with --info or --debug option to get more log output. Run with --scan to get full insights.
==============================================================================

2: Task failed with an exception.
-----------
* What went wrong:
Execution failed for task ':streams:test'.
> There were failing tests. See the report at: file://<https://builds.apache.org/job/kafka-trunk-jdk8/ws/streams/build/reports/tests/test/index.html>

* Try:
Run with --stacktrace option to get the stack trace. Run with --info or --debug option to get more log output. Run with --scan to get full insights.
==============================================================================

* Get more help at https://help.gradle.org

Deprecated Gradle features were used in this build, making it incompatible with Gradle 6.0.
Use '--warning-mode all' to show the individual deprecation warnings.
See https://docs.gradle.org/5.4.1/userguide/command_line_interface.html#sec:command_line_warnings

BUILD FAILED in 5h 9m 44s
178 actionable tasks: 175 executed, 3 up-to-date
Build step 'Execute shell' marked build as failure
[FINDBUGS] Collecting findbugs analysis files...
Setting GRADLE_4_8_1_HOME=/home/jenkins/tools/gradle/4.8.1
[FINDBUGS] Searching for all files in <https://builds.apache.org/job/kafka-trunk-jdk8/ws/> that match the pattern **/build/reports/*bugs/*.xml
[FINDBUGS] Parsing 17 files in <https://builds.apache.org/job/kafka-trunk-jdk8/ws/>
[FINDBUGS] Successfully parsed file <https://builds.apache.org/job/kafka-trunk-jdk8/ws/clients/build/reports/spotbugs/main.xml> with 0 unique warnings and 0 duplicates.
[FINDBUGS] Successfully parsed file <https://builds.apache.org/job/kafka-trunk-jdk8/ws/connect/api/build/reports/spotbugs/main.xml> with 0 unique warnings and 0 duplicates.
[FINDBUGS] Successfully parsed file <https://builds.apache.org/job/kafka-trunk-jdk8/ws/connect/basic-auth-extension/build/reports/spotbugs/main.xml> with 0 unique warnings and 0 duplicates.
[FINDBUGS] Successfully parsed file <https://builds.apache.org/job/kafka-trunk-jdk8/ws/connect/file/build/reports/spotbugs/main.xml> with 0 unique warnings and 0 duplicates.
[FINDBUGS] Successfully parsed file <https://builds.apache.org/job/kafka-trunk-jdk8/ws/connect/json/build/reports/spotbugs/main.xml> with 0 unique warnings and 0 duplicates.
[FINDBUGS] Successfully parsed file <https://builds.apache.org/job/kafka-trunk-jdk8/ws/connect/runtime/build/reports/spotbugs/main.xml> with 0 unique warnings and 0 duplicates.
[FINDBUGS] Successfully parsed file <https://builds.apache.org/job/kafka-trunk-jdk8/ws/connect/transforms/build/reports/spotbugs/main.xml> with 0 unique warnings and 0 duplicates.
[FINDBUGS] Successfully parsed file <https://builds.apache.org/job/kafka-trunk-jdk8/ws/core/build/reports/spotbugs/main.xml> with 0 unique warnings and 0 duplicates.
[FINDBUGS] Successfully parsed file <https://builds.apache.org/job/kafka-trunk-jdk8/ws/examples/build/reports/spotbugs/main.xml> with 0 unique warnings and 0 duplicates.
[FINDBUGS] Successfully parsed file <https://builds.apache.org/job/kafka-trunk-jdk8/ws/generator/build/reports/spotbugs/main.xml> with 0 unique warnings and 0 duplicates.
[FINDBUGS] Successfully parsed file <https://builds.apache.org/job/kafka-trunk-jdk8/ws/jmh-benchmarks/build/reports/spotbugs/main.xml> with 0 unique warnings and 0 duplicates.
[FINDBUGS] Successfully parsed file <https://builds.apache.org/job/kafka-trunk-jdk8/ws/log4j-appender/build/reports/spotbugs/main.xml> with 0 unique warnings and 0 duplicates.
[FINDBUGS] Successfully parsed file <https://builds.apache.org/job/kafka-trunk-jdk8/ws/streams/build/reports/spotbugs/main.xml> with 0 unique warnings and 0 duplicates.
[FINDBUGS] Successfully parsed file <https://builds.apache.org/job/kafka-trunk-jdk8/ws/streams/examples/build/reports/spotbugs/main.xml> with 0 unique warnings and 0 duplicates.
[FINDBUGS] Successfully parsed file <https://builds.apache.org/job/kafka-trunk-jdk8/ws/streams/streams-scala/build/reports/spotbugs/main.xml> with 0 unique warnings and 0 duplicates.
[FINDBUGS] Successfully parsed file <https://builds.apache.org/job/kafka-trunk-jdk8/ws/streams/test-utils/build/reports/spotbugs/main.xml> with 0 unique warnings and 0 duplicates.
[FINDBUGS] Successfully parsed file <https://builds.apache.org/job/kafka-trunk-jdk8/ws/tools/build/reports/spotbugs/main.xml> with 0 unique warnings and 0 duplicates.
Setting GRADLE_4_8_1_HOME=/home/jenkins/tools/gradle/4.8.1
No credentials specified
Setting GRADLE_4_8_1_HOME=/home/jenkins/tools/gradle/4.8.1
<Git Blamer> Using GitBlamer to create author and commit information for all warnings.
<Git Blamer> GIT_COMMIT=a8aedc85ebfadcf1472acafe2e0311a73d3040be, workspace=<https://builds.apache.org/job/kafka-trunk-jdk8/ws/>
[FINDBUGS] Computing warning deltas based on reference build #3796
Recording test results
Setting GRADLE_4_8_1_HOME=/home/jenkins/tools/gradle/4.8.1
Setting GRADLE_4_8_1_HOME=/home/jenkins/tools/gradle/4.8.1
Not sending mail to unregistered user noreply@github.com
Not sending mail to unregistered user wangguoz@gmail.com
Not sending mail to unregistered user rajinisivaram@googlemail.com

Build failed in Jenkins: kafka-trunk-jdk8 #3808

Posted by Apache Jenkins Server <je...@builds.apache.org>.
See <https://builds.apache.org/job/kafka-trunk-jdk8/3808/display/redirect?page=changes>

Changes:

[jason] KAFKA-8526; Fallback to other log dirs after getOrCreateLog failure

------------------------------------------
[...truncated 2.57 MB...]
org.apache.kafka.streams.TopologyTestDriverTest > shouldNotUpdateStoreForSmallerValue[Eos enabled = true] PASSED

org.apache.kafka.streams.TopologyTestDriverTest > shouldCreateStateDirectoryForStatefulTopology[Eos enabled = true] STARTED

org.apache.kafka.streams.TopologyTestDriverTest > shouldCreateStateDirectoryForStatefulTopology[Eos enabled = true] PASSED

org.apache.kafka.streams.TopologyTestDriverTest > shouldPunctuateIfWallClockTimeAdvances[Eos enabled = true] STARTED

org.apache.kafka.streams.TopologyTestDriverTest > shouldPunctuateIfWallClockTimeAdvances[Eos enabled = true] PASSED

org.apache.kafka.streams.TopologyTestDriverTest > shouldCloseProcessor[Eos enabled = false] STARTED

org.apache.kafka.streams.TopologyTestDriverTest > shouldCloseProcessor[Eos enabled = false] PASSED

org.apache.kafka.streams.TopologyTestDriverTest > shouldFeedStoreFromGlobalKTable[Eos enabled = false] STARTED

org.apache.kafka.streams.TopologyTestDriverTest > shouldFeedStoreFromGlobalKTable[Eos enabled = false] PASSED

org.apache.kafka.streams.TopologyTestDriverTest > shouldCleanUpPersistentStateStoresOnClose[Eos enabled = false] STARTED

org.apache.kafka.streams.TopologyTestDriverTest > shouldCleanUpPersistentStateStoresOnClose[Eos enabled = false] PASSED

org.apache.kafka.streams.TopologyTestDriverTest > shouldThrowPatternNotValidForTopicNameException[Eos enabled = false] STARTED

org.apache.kafka.streams.TopologyTestDriverTest > shouldThrowPatternNotValidForTopicNameException[Eos enabled = false] PASSED

org.apache.kafka.streams.TopologyTestDriverTest > shouldPunctuateIfEvenTimeAdvances[Eos enabled = false] STARTED

org.apache.kafka.streams.TopologyTestDriverTest > shouldPunctuateIfEvenTimeAdvances[Eos enabled = false] PASSED

org.apache.kafka.streams.TopologyTestDriverTest > shouldInitProcessor[Eos enabled = false] STARTED

org.apache.kafka.streams.TopologyTestDriverTest > shouldInitProcessor[Eos enabled = false] PASSED

org.apache.kafka.streams.TopologyTestDriverTest > shouldThrowForUnknownTopic[Eos enabled = false] STARTED

org.apache.kafka.streams.TopologyTestDriverTest > shouldThrowForUnknownTopic[Eos enabled = false] PASSED

org.apache.kafka.streams.TopologyTestDriverTest > shouldPunctuateOnStreamsTime[Eos enabled = false] STARTED

org.apache.kafka.streams.TopologyTestDriverTest > shouldPunctuateOnStreamsTime[Eos enabled = false] PASSED

org.apache.kafka.streams.TopologyTestDriverTest > shouldThrowIfInMemoryBuiltInStoreIsAccessedWithUntypedMethod[Eos enabled = false] STARTED

org.apache.kafka.streams.TopologyTestDriverTest > shouldThrowIfInMemoryBuiltInStoreIsAccessedWithUntypedMethod[Eos enabled = false] PASSED

org.apache.kafka.streams.TopologyTestDriverTest > shouldProcessFromSourcesThatMatchMultiplePattern[Eos enabled = false] STARTED

org.apache.kafka.streams.TopologyTestDriverTest > shouldProcessFromSourcesThatMatchMultiplePattern[Eos enabled = false] PASSED

org.apache.kafka.streams.TopologyTestDriverTest > shouldPopulateGlobalStore[Eos enabled = false] STARTED

org.apache.kafka.streams.TopologyTestDriverTest > shouldPopulateGlobalStore[Eos enabled = false] PASSED

org.apache.kafka.streams.TopologyTestDriverTest > shouldThrowIfPersistentBuiltInStoreIsAccessedWithUntypedMethod[Eos enabled = false] STARTED

org.apache.kafka.streams.TopologyTestDriverTest > shouldThrowIfPersistentBuiltInStoreIsAccessedWithUntypedMethod[Eos enabled = false] PASSED

org.apache.kafka.streams.TopologyTestDriverTest > shouldAllowPrePopulatingStatesStoresWithCachingEnabled[Eos enabled = false] STARTED

org.apache.kafka.streams.TopologyTestDriverTest > shouldAllowPrePopulatingStatesStoresWithCachingEnabled[Eos enabled = false] PASSED

org.apache.kafka.streams.TopologyTestDriverTest > shouldReturnCorrectPersistentStoreTypeOnly[Eos enabled = false] STARTED

org.apache.kafka.streams.TopologyTestDriverTest > shouldReturnCorrectPersistentStoreTypeOnly[Eos enabled = false] PASSED

org.apache.kafka.streams.TopologyTestDriverTest > shouldUseSourceSpecificDeserializers[Eos enabled = false] STARTED

org.apache.kafka.streams.TopologyTestDriverTest > shouldUseSourceSpecificDeserializers[Eos enabled = false] PASSED

org.apache.kafka.streams.TopologyTestDriverTest > shouldReturnAllStores[Eos enabled = false] STARTED

org.apache.kafka.streams.TopologyTestDriverTest > shouldReturnAllStores[Eos enabled = false] PASSED

org.apache.kafka.streams.TopologyTestDriverTest > shouldSendRecordViaCorrectSourceTopic[Eos enabled = false] STARTED

org.apache.kafka.streams.TopologyTestDriverTest > shouldSendRecordViaCorrectSourceTopic[Eos enabled = false] PASSED

org.apache.kafka.streams.TopologyTestDriverTest > shouldNotCreateStateDirectoryForStatelessTopology[Eos enabled = false] STARTED

org.apache.kafka.streams.TopologyTestDriverTest > shouldNotCreateStateDirectoryForStatelessTopology[Eos enabled = false] PASSED

org.apache.kafka.streams.TopologyTestDriverTest > shouldReturnAllStoresNames[Eos enabled = false] STARTED

org.apache.kafka.streams.TopologyTestDriverTest > shouldReturnAllStoresNames[Eos enabled = false] PASSED

org.apache.kafka.streams.TopologyTestDriverTest > shouldProcessConsumerRecordList[Eos enabled = false] STARTED

org.apache.kafka.streams.TopologyTestDriverTest > shouldProcessConsumerRecordList[Eos enabled = false] PASSED

org.apache.kafka.streams.TopologyTestDriverTest > shouldUseSinkSpecificSerializers[Eos enabled = false] STARTED

org.apache.kafka.streams.TopologyTestDriverTest > shouldUseSinkSpecificSerializers[Eos enabled = false] PASSED

org.apache.kafka.streams.TopologyTestDriverTest > shouldFlushStoreForFirstInput[Eos enabled = false] STARTED

org.apache.kafka.streams.TopologyTestDriverTest > shouldFlushStoreForFirstInput[Eos enabled = false] PASSED

org.apache.kafka.streams.TopologyTestDriverTest > shouldProcessFromSourceThatMatchPattern[Eos enabled = false] STARTED

org.apache.kafka.streams.TopologyTestDriverTest > shouldProcessFromSourceThatMatchPattern[Eos enabled = false] PASSED

org.apache.kafka.streams.TopologyTestDriverTest > shouldUpdateStoreForNewKey[Eos enabled = false] STARTED

org.apache.kafka.streams.TopologyTestDriverTest > shouldUpdateStoreForNewKey[Eos enabled = false] PASSED

org.apache.kafka.streams.TopologyTestDriverTest > shouldPunctuateOnWallClockTime[Eos enabled = false] STARTED

org.apache.kafka.streams.TopologyTestDriverTest > shouldPunctuateOnWallClockTime[Eos enabled = false] PASSED

org.apache.kafka.streams.TopologyTestDriverTest > shouldSetRecordMetadata[Eos enabled = false] STARTED

org.apache.kafka.streams.TopologyTestDriverTest > shouldSetRecordMetadata[Eos enabled = false] PASSED

org.apache.kafka.streams.TopologyTestDriverTest > shouldNotUpdateStoreForLargerValue[Eos enabled = false] STARTED

org.apache.kafka.streams.TopologyTestDriverTest > shouldNotUpdateStoreForLargerValue[Eos enabled = false] PASSED

org.apache.kafka.streams.TopologyTestDriverTest > shouldReturnCorrectInMemoryStoreTypeOnly[Eos enabled = false] STARTED

org.apache.kafka.streams.TopologyTestDriverTest > shouldReturnCorrectInMemoryStoreTypeOnly[Eos enabled = false] PASSED

org.apache.kafka.streams.TopologyTestDriverTest > shouldProcessRecordForTopic[Eos enabled = false] STARTED

org.apache.kafka.streams.TopologyTestDriverTest > shouldProcessRecordForTopic[Eos enabled = false] PASSED

org.apache.kafka.streams.TopologyTestDriverTest > shouldForwardRecordsFromSubtopologyToSubtopology[Eos enabled = false] STARTED

org.apache.kafka.streams.TopologyTestDriverTest > shouldForwardRecordsFromSubtopologyToSubtopology[Eos enabled = false] PASSED

org.apache.kafka.streams.TopologyTestDriverTest > shouldNotUpdateStoreForSmallerValue[Eos enabled = false] STARTED

org.apache.kafka.streams.TopologyTestDriverTest > shouldNotUpdateStoreForSmallerValue[Eos enabled = false] PASSED

org.apache.kafka.streams.TopologyTestDriverTest > shouldCreateStateDirectoryForStatefulTopology[Eos enabled = false] STARTED

org.apache.kafka.streams.TopologyTestDriverTest > shouldCreateStateDirectoryForStatefulTopology[Eos enabled = false] PASSED

org.apache.kafka.streams.TopologyTestDriverTest > shouldPunctuateIfWallClockTimeAdvances[Eos enabled = false] STARTED

org.apache.kafka.streams.TopologyTestDriverTest > shouldPunctuateIfWallClockTimeAdvances[Eos enabled = false] PASSED

org.apache.kafka.streams.MockTimeTest > shouldGetNanosAsMillis STARTED

org.apache.kafka.streams.MockTimeTest > shouldGetNanosAsMillis PASSED

org.apache.kafka.streams.MockTimeTest > shouldSetStartTime STARTED

org.apache.kafka.streams.MockTimeTest > shouldSetStartTime PASSED

org.apache.kafka.streams.MockTimeTest > shouldNotAllowNegativeSleep STARTED

org.apache.kafka.streams.MockTimeTest > shouldNotAllowNegativeSleep PASSED

org.apache.kafka.streams.MockTimeTest > shouldAdvanceTimeOnSleep STARTED

org.apache.kafka.streams.MockTimeTest > shouldAdvanceTimeOnSleep PASSED

org.apache.kafka.streams.MockProcessorContextTest > shouldStoreAndReturnStateStores STARTED

org.apache.kafka.streams.MockProcessorContextTest > shouldStoreAndReturnStateStores PASSED

org.apache.kafka.streams.MockProcessorContextTest > shouldCaptureOutputRecordsUsingTo STARTED

org.apache.kafka.streams.MockProcessorContextTest > shouldCaptureOutputRecordsUsingTo PASSED

org.apache.kafka.streams.MockProcessorContextTest > shouldCaptureOutputRecords STARTED

org.apache.kafka.streams.MockProcessorContextTest > shouldCaptureOutputRecords PASSED

org.apache.kafka.streams.MockProcessorContextTest > fullConstructorShouldSetAllExpectedAttributes STARTED

org.apache.kafka.streams.MockProcessorContextTest > fullConstructorShouldSetAllExpectedAttributes PASSED

org.apache.kafka.streams.MockProcessorContextTest > shouldCaptureCommitsAndAllowReset STARTED

org.apache.kafka.streams.MockProcessorContextTest > shouldCaptureCommitsAndAllowReset PASSED

org.apache.kafka.streams.MockProcessorContextTest > shouldThrowIfForwardedWithDeprecatedChildName STARTED

org.apache.kafka.streams.MockProcessorContextTest > shouldThrowIfForwardedWithDeprecatedChildName PASSED

org.apache.kafka.streams.MockProcessorContextTest > shouldThrowIfForwardedWithDeprecatedChildIndex STARTED

org.apache.kafka.streams.MockProcessorContextTest > shouldThrowIfForwardedWithDeprecatedChildIndex PASSED

org.apache.kafka.streams.MockProcessorContextTest > shouldCaptureApplicationAndRecordMetadata STARTED

org.apache.kafka.streams.MockProcessorContextTest > shouldCaptureApplicationAndRecordMetadata PASSED

org.apache.kafka.streams.MockProcessorContextTest > shouldCaptureRecordsOutputToChildByName STARTED

org.apache.kafka.streams.MockProcessorContextTest > shouldCaptureRecordsOutputToChildByName PASSED

org.apache.kafka.streams.MockProcessorContextTest > shouldCapturePunctuator STARTED

org.apache.kafka.streams.MockProcessorContextTest > shouldCapturePunctuator PASSED

FAILURE: Build failed with an exception.

* What went wrong:
Execution failed for task ':core:test'.
> There were failing tests. See the report at: file://<https://builds.apache.org/job/kafka-trunk-jdk8/ws/core/build/reports/tests/test/index.html>

* Try:
Run with --stacktrace option to get the stack trace. Run with --info or --debug option to get more log output. Run with --scan to get full insights.

* Get more help at https://help.gradle.org

Deprecated Gradle features were used in this build, making it incompatible with Gradle 6.0.
Use '--warning-mode all' to show the individual deprecation warnings.
See https://docs.gradle.org/5.4.1/userguide/command_line_interface.html#sec:command_line_warnings

BUILD FAILED in 3h 16m 29s
178 actionable tasks: 152 executed, 26 up-to-date
Build step 'Execute shell' marked build as failure
[FINDBUGS] Collecting findbugs analysis files...
Setting GRADLE_4_8_1_HOME=/home/jenkins/tools/gradle/4.8.1
[FINDBUGS] Searching for all files in <https://builds.apache.org/job/kafka-trunk-jdk8/ws/> that match the pattern **/build/reports/*bugs/*.xml
[FINDBUGS] Parsing 17 files in <https://builds.apache.org/job/kafka-trunk-jdk8/ws/>
[FINDBUGS] Successfully parsed file <https://builds.apache.org/job/kafka-trunk-jdk8/ws/clients/build/reports/spotbugs/main.xml> with 0 unique warnings and 0 duplicates.
[FINDBUGS] Successfully parsed file <https://builds.apache.org/job/kafka-trunk-jdk8/ws/connect/api/build/reports/spotbugs/main.xml> with 0 unique warnings and 0 duplicates.
[FINDBUGS] Successfully parsed file <https://builds.apache.org/job/kafka-trunk-jdk8/ws/connect/basic-auth-extension/build/reports/spotbugs/main.xml> with 0 unique warnings and 0 duplicates.
[FINDBUGS] Successfully parsed file <https://builds.apache.org/job/kafka-trunk-jdk8/ws/connect/file/build/reports/spotbugs/main.xml> with 0 unique warnings and 0 duplicates.
[FINDBUGS] Successfully parsed file <https://builds.apache.org/job/kafka-trunk-jdk8/ws/connect/json/build/reports/spotbugs/main.xml> with 0 unique warnings and 0 duplicates.
[FINDBUGS] Successfully parsed file <https://builds.apache.org/job/kafka-trunk-jdk8/ws/connect/runtime/build/reports/spotbugs/main.xml> with 0 unique warnings and 0 duplicates.
[FINDBUGS] Successfully parsed file <https://builds.apache.org/job/kafka-trunk-jdk8/ws/connect/transforms/build/reports/spotbugs/main.xml> with 0 unique warnings and 0 duplicates.
[FINDBUGS] Successfully parsed file <https://builds.apache.org/job/kafka-trunk-jdk8/ws/core/build/reports/spotbugs/main.xml> with 0 unique warnings and 0 duplicates.
[FINDBUGS] Successfully parsed file <https://builds.apache.org/job/kafka-trunk-jdk8/ws/examples/build/reports/spotbugs/main.xml> with 0 unique warnings and 0 duplicates.
[FINDBUGS] Successfully parsed file <https://builds.apache.org/job/kafka-trunk-jdk8/ws/generator/build/reports/spotbugs/main.xml> with 0 unique warnings and 0 duplicates.
[FINDBUGS] Successfully parsed file <https://builds.apache.org/job/kafka-trunk-jdk8/ws/jmh-benchmarks/build/reports/spotbugs/main.xml> with 0 unique warnings and 0 duplicates.
[FINDBUGS] Successfully parsed file <https://builds.apache.org/job/kafka-trunk-jdk8/ws/log4j-appender/build/reports/spotbugs/main.xml> with 0 unique warnings and 0 duplicates.
[FINDBUGS] Successfully parsed file <https://builds.apache.org/job/kafka-trunk-jdk8/ws/streams/build/reports/spotbugs/main.xml> with 0 unique warnings and 0 duplicates.
[FINDBUGS] Successfully parsed file <https://builds.apache.org/job/kafka-trunk-jdk8/ws/streams/examples/build/reports/spotbugs/main.xml> with 0 unique warnings and 0 duplicates.
[FINDBUGS] Successfully parsed file <https://builds.apache.org/job/kafka-trunk-jdk8/ws/streams/streams-scala/build/reports/spotbugs/main.xml> with 0 unique warnings and 0 duplicates.
[FINDBUGS] Successfully parsed file <https://builds.apache.org/job/kafka-trunk-jdk8/ws/streams/test-utils/build/reports/spotbugs/main.xml> with 0 unique warnings and 0 duplicates.
[FINDBUGS] Successfully parsed file <https://builds.apache.org/job/kafka-trunk-jdk8/ws/tools/build/reports/spotbugs/main.xml> with 0 unique warnings and 0 duplicates.
Setting GRADLE_4_8_1_HOME=/home/jenkins/tools/gradle/4.8.1
No credentials specified
Setting GRADLE_4_8_1_HOME=/home/jenkins/tools/gradle/4.8.1
<Git Blamer> Using GitBlamer to create author and commit information for all warnings.
<Git Blamer> GIT_COMMIT=6b6a6b930fda853fd91dfbe85b4462e17654f804, workspace=<https://builds.apache.org/job/kafka-trunk-jdk8/ws/>
[FINDBUGS] Computing warning deltas based on reference build #3796
Recording test results
Setting GRADLE_4_8_1_HOME=/home/jenkins/tools/gradle/4.8.1
Setting GRADLE_4_8_1_HOME=/home/jenkins/tools/gradle/4.8.1
Not sending mail to unregistered user noreply@github.com
Not sending mail to unregistered user wangguoz@gmail.com
Not sending mail to unregistered user rajinisivaram@googlemail.com

Build failed in Jenkins: kafka-trunk-jdk8 #3807

Posted by Apache Jenkins Server <je...@builds.apache.org>.
See <https://builds.apache.org/job/kafka-trunk-jdk8/3807/display/redirect?page=changes>

Changes:

[jason] KAFKA-8454; Add Java AdminClient Interface (KIP-476) (#7087)

[jason] KAFKA-8678; Fix leave group protocol bug in throttling and error

------------------------------------------
[...truncated 2.56 MB...]
org.apache.kafka.connect.transforms.RegexRouterTest > identity PASSED

org.apache.kafka.connect.transforms.RegexRouterTest > addPrefix STARTED

org.apache.kafka.connect.transforms.RegexRouterTest > addPrefix PASSED

org.apache.kafka.connect.transforms.RegexRouterTest > addSuffix STARTED

org.apache.kafka.connect.transforms.RegexRouterTest > addSuffix PASSED

org.apache.kafka.connect.transforms.RegexRouterTest > slice STARTED

org.apache.kafka.connect.transforms.RegexRouterTest > slice PASSED

org.apache.kafka.connect.transforms.RegexRouterTest > staticReplacement STARTED

org.apache.kafka.connect.transforms.RegexRouterTest > staticReplacement PASSED

org.apache.kafka.connect.transforms.FlattenTest > testKey STARTED

org.apache.kafka.connect.transforms.FlattenTest > testKey PASSED

org.apache.kafka.connect.transforms.FlattenTest > testOptionalAndDefaultValuesNested STARTED

org.apache.kafka.connect.transforms.FlattenTest > testOptionalAndDefaultValuesNested PASSED

org.apache.kafka.connect.transforms.FlattenTest > topLevelMapRequired STARTED

org.apache.kafka.connect.transforms.FlattenTest > topLevelMapRequired PASSED

org.apache.kafka.connect.transforms.FlattenTest > topLevelStructRequired STARTED

org.apache.kafka.connect.transforms.FlattenTest > topLevelStructRequired PASSED

org.apache.kafka.connect.transforms.FlattenTest > testOptionalFieldStruct STARTED

org.apache.kafka.connect.transforms.FlattenTest > testOptionalFieldStruct PASSED

org.apache.kafka.connect.transforms.FlattenTest > testOptionalNestedStruct STARTED

org.apache.kafka.connect.transforms.FlattenTest > testOptionalNestedStruct PASSED

org.apache.kafka.connect.transforms.FlattenTest > testNestedMapWithDelimiter STARTED

org.apache.kafka.connect.transforms.FlattenTest > testNestedMapWithDelimiter PASSED

org.apache.kafka.connect.transforms.FlattenTest > testOptionalFieldMap STARTED

org.apache.kafka.connect.transforms.FlattenTest > testOptionalFieldMap PASSED

org.apache.kafka.connect.transforms.FlattenTest > testUnsupportedTypeInMap STARTED

org.apache.kafka.connect.transforms.FlattenTest > testUnsupportedTypeInMap PASSED

org.apache.kafka.connect.transforms.FlattenTest > testOptionalStruct STARTED

org.apache.kafka.connect.transforms.FlattenTest > testOptionalStruct PASSED

org.apache.kafka.connect.transforms.FlattenTest > testNestedStruct STARTED

org.apache.kafka.connect.transforms.FlattenTest > testNestedStruct PASSED

org.apache.kafka.connect.transforms.HoistFieldTest > withSchema STARTED

org.apache.kafka.connect.transforms.HoistFieldTest > withSchema PASSED

org.apache.kafka.connect.transforms.HoistFieldTest > schemaless STARTED

org.apache.kafka.connect.transforms.HoistFieldTest > schemaless PASSED

org.apache.kafka.connect.transforms.CastTest > castWholeDateRecordValueWithSchemaString STARTED

org.apache.kafka.connect.transforms.CastTest > castWholeDateRecordValueWithSchemaString PASSED

org.apache.kafka.connect.transforms.CastTest > castWholeRecordValueSchemalessBooleanTrue STARTED

org.apache.kafka.connect.transforms.CastTest > castWholeRecordValueSchemalessBooleanTrue PASSED

org.apache.kafka.connect.transforms.CastTest > testConfigInvalidTargetType STARTED

org.apache.kafka.connect.transforms.CastTest > testConfigInvalidTargetType PASSED

org.apache.kafka.connect.transforms.CastTest > testConfigMixWholeAndFieldTransformation STARTED

org.apache.kafka.connect.transforms.CastTest > testConfigMixWholeAndFieldTransformation PASSED

org.apache.kafka.connect.transforms.CastTest > castWholeRecordValueSchemalessFloat32 STARTED

org.apache.kafka.connect.transforms.CastTest > castWholeRecordValueSchemalessFloat32 PASSED

org.apache.kafka.connect.transforms.CastTest > castWholeRecordValueSchemalessFloat64 STARTED

org.apache.kafka.connect.transforms.CastTest > castWholeRecordValueSchemalessFloat64 PASSED

org.apache.kafka.connect.transforms.CastTest > castWholeRecordValueSchemalessUnsupportedType STARTED

org.apache.kafka.connect.transforms.CastTest > castWholeRecordValueSchemalessUnsupportedType PASSED

org.apache.kafka.connect.transforms.CastTest > castWholeRecordKeySchemaless STARTED

org.apache.kafka.connect.transforms.CastTest > castWholeRecordKeySchemaless PASSED

org.apache.kafka.connect.transforms.CastTest > castWholeRecordValueWithSchemaFloat32 STARTED

org.apache.kafka.connect.transforms.CastTest > castWholeRecordValueWithSchemaFloat32 PASSED

org.apache.kafka.connect.transforms.CastTest > castWholeRecordValueWithSchemaFloat64 STARTED

org.apache.kafka.connect.transforms.CastTest > castWholeRecordValueWithSchemaFloat64 PASSED

org.apache.kafka.connect.transforms.CastTest > castWholeRecordValueWithSchemaString STARTED

org.apache.kafka.connect.transforms.CastTest > castWholeRecordValueWithSchemaString PASSED

org.apache.kafka.connect.transforms.CastTest > testConfigEmpty STARTED

org.apache.kafka.connect.transforms.CastTest > testConfigEmpty PASSED

org.apache.kafka.connect.transforms.CastTest > castWholeRecordValueSchemalessInt16 STARTED

org.apache.kafka.connect.transforms.CastTest > castWholeRecordValueSchemalessInt16 PASSED

org.apache.kafka.connect.transforms.CastTest > castWholeRecordValueSchemalessInt32 STARTED

org.apache.kafka.connect.transforms.CastTest > castWholeRecordValueSchemalessInt32 PASSED

org.apache.kafka.connect.transforms.CastTest > castWholeRecordValueSchemalessInt64 STARTED

org.apache.kafka.connect.transforms.CastTest > castWholeRecordValueSchemalessInt64 PASSED

org.apache.kafka.connect.transforms.CastTest > castFieldsSchemaless STARTED

org.apache.kafka.connect.transforms.CastTest > castFieldsSchemaless PASSED

org.apache.kafka.connect.transforms.CastTest > testUnsupportedTargetType STARTED

org.apache.kafka.connect.transforms.CastTest > testUnsupportedTargetType PASSED

org.apache.kafka.connect.transforms.CastTest > castWholeRecordValueWithSchemaInt16 STARTED

org.apache.kafka.connect.transforms.CastTest > castWholeRecordValueWithSchemaInt16 PASSED

org.apache.kafka.connect.transforms.CastTest > castWholeRecordValueWithSchemaInt32 STARTED

org.apache.kafka.connect.transforms.CastTest > castWholeRecordValueWithSchemaInt32 PASSED

org.apache.kafka.connect.transforms.CastTest > castWholeRecordValueWithSchemaInt64 STARTED

org.apache.kafka.connect.transforms.CastTest > castWholeRecordValueWithSchemaInt64 PASSED

org.apache.kafka.connect.transforms.CastTest > castWholeBigDecimalRecordValueWithSchemaString STARTED

org.apache.kafka.connect.transforms.CastTest > castWholeBigDecimalRecordValueWithSchemaString PASSED

org.apache.kafka.connect.transforms.CastTest > castWholeRecordValueWithSchemaBooleanFalse STARTED

org.apache.kafka.connect.transforms.CastTest > castWholeRecordValueWithSchemaBooleanFalse PASSED

org.apache.kafka.connect.transforms.CastTest > testConfigInvalidMap STARTED

org.apache.kafka.connect.transforms.CastTest > testConfigInvalidMap PASSED

org.apache.kafka.connect.transforms.CastTest > castWholeRecordValueWithSchemaBooleanTrue STARTED

org.apache.kafka.connect.transforms.CastTest > castWholeRecordValueWithSchemaBooleanTrue PASSED

org.apache.kafka.connect.transforms.CastTest > castWholeRecordDefaultValue STARTED

org.apache.kafka.connect.transforms.CastTest > castWholeRecordDefaultValue PASSED

org.apache.kafka.connect.transforms.CastTest > castWholeRecordValueWithSchemaInt8 STARTED

org.apache.kafka.connect.transforms.CastTest > castWholeRecordValueWithSchemaInt8 PASSED

org.apache.kafka.connect.transforms.CastTest > castWholeRecordKeyWithSchema STARTED

org.apache.kafka.connect.transforms.CastTest > castWholeRecordKeyWithSchema PASSED

org.apache.kafka.connect.transforms.CastTest > castWholeRecordValueSchemalessInt8 STARTED

org.apache.kafka.connect.transforms.CastTest > castWholeRecordValueSchemalessInt8 PASSED

org.apache.kafka.connect.transforms.CastTest > castWholeRecordValueSchemalessBooleanFalse STARTED

org.apache.kafka.connect.transforms.CastTest > castWholeRecordValueSchemalessBooleanFalse PASSED

org.apache.kafka.connect.transforms.CastTest > testConfigInvalidSchemaType STARTED

org.apache.kafka.connect.transforms.CastTest > testConfigInvalidSchemaType PASSED

org.apache.kafka.connect.transforms.CastTest > castWholeRecordValueSchemalessString STARTED

org.apache.kafka.connect.transforms.CastTest > castWholeRecordValueSchemalessString PASSED

org.apache.kafka.connect.transforms.CastTest > castFieldsWithSchema STARTED

org.apache.kafka.connect.transforms.CastTest > castFieldsWithSchema PASSED

FAILURE: Build failed with an exception.

* What went wrong:
Execution failed for task ':streams:test'.
> There were failing tests. See the report at: file://<https://builds.apache.org/job/kafka-trunk-jdk8/ws/streams/build/reports/tests/test/index.html>

* Try:
Run with --stacktrace option to get the stack trace. Run with --info or --debug option to get more log output. Run with --scan to get full insights.

* Get more help at https://help.gradle.org

Deprecated Gradle features were used in this build, making it incompatible with Gradle 6.0.
Use '--warning-mode all' to show the individual deprecation warnings.
See https://docs.gradle.org/5.4.1/userguide/command_line_interface.html#sec:command_line_warnings

BUILD FAILED in 3h 8m 6s
178 actionable tasks: 152 executed, 26 up-to-date
Build step 'Execute shell' marked build as failure
[FINDBUGS] Collecting findbugs analysis files...
Setting GRADLE_4_8_1_HOME=/home/jenkins/tools/gradle/4.8.1
[FINDBUGS] Searching for all files in <https://builds.apache.org/job/kafka-trunk-jdk8/ws/> that match the pattern **/build/reports/*bugs/*.xml
[FINDBUGS] Parsing 17 files in <https://builds.apache.org/job/kafka-trunk-jdk8/ws/>
[FINDBUGS] Successfully parsed file <https://builds.apache.org/job/kafka-trunk-jdk8/ws/clients/build/reports/spotbugs/main.xml> with 0 unique warnings and 0 duplicates.
[FINDBUGS] Successfully parsed file <https://builds.apache.org/job/kafka-trunk-jdk8/ws/connect/api/build/reports/spotbugs/main.xml> with 0 unique warnings and 0 duplicates.
[FINDBUGS] Successfully parsed file <https://builds.apache.org/job/kafka-trunk-jdk8/ws/connect/basic-auth-extension/build/reports/spotbugs/main.xml> with 0 unique warnings and 0 duplicates.
[FINDBUGS] Successfully parsed file <https://builds.apache.org/job/kafka-trunk-jdk8/ws/connect/file/build/reports/spotbugs/main.xml> with 0 unique warnings and 0 duplicates.
[FINDBUGS] Successfully parsed file <https://builds.apache.org/job/kafka-trunk-jdk8/ws/connect/json/build/reports/spotbugs/main.xml> with 0 unique warnings and 0 duplicates.
[FINDBUGS] Successfully parsed file <https://builds.apache.org/job/kafka-trunk-jdk8/ws/connect/runtime/build/reports/spotbugs/main.xml> with 0 unique warnings and 0 duplicates.
[FINDBUGS] Successfully parsed file <https://builds.apache.org/job/kafka-trunk-jdk8/ws/connect/transforms/build/reports/spotbugs/main.xml> with 0 unique warnings and 0 duplicates.
[FINDBUGS] Successfully parsed file <https://builds.apache.org/job/kafka-trunk-jdk8/ws/core/build/reports/spotbugs/main.xml> with 0 unique warnings and 0 duplicates.
[FINDBUGS] Successfully parsed file <https://builds.apache.org/job/kafka-trunk-jdk8/ws/examples/build/reports/spotbugs/main.xml> with 0 unique warnings and 0 duplicates.
[FINDBUGS] Successfully parsed file <https://builds.apache.org/job/kafka-trunk-jdk8/ws/generator/build/reports/spotbugs/main.xml> with 0 unique warnings and 0 duplicates.
[FINDBUGS] Successfully parsed file <https://builds.apache.org/job/kafka-trunk-jdk8/ws/jmh-benchmarks/build/reports/spotbugs/main.xml> with 0 unique warnings and 0 duplicates.
[FINDBUGS] Successfully parsed file <https://builds.apache.org/job/kafka-trunk-jdk8/ws/log4j-appender/build/reports/spotbugs/main.xml> with 0 unique warnings and 0 duplicates.
[FINDBUGS] Successfully parsed file <https://builds.apache.org/job/kafka-trunk-jdk8/ws/streams/build/reports/spotbugs/main.xml> with 0 unique warnings and 0 duplicates.
[FINDBUGS] Successfully parsed file <https://builds.apache.org/job/kafka-trunk-jdk8/ws/streams/examples/build/reports/spotbugs/main.xml> with 0 unique warnings and 0 duplicates.
[FINDBUGS] Successfully parsed file <https://builds.apache.org/job/kafka-trunk-jdk8/ws/streams/streams-scala/build/reports/spotbugs/main.xml> with 0 unique warnings and 0 duplicates.
[FINDBUGS] Successfully parsed file <https://builds.apache.org/job/kafka-trunk-jdk8/ws/streams/test-utils/build/reports/spotbugs/main.xml> with 0 unique warnings and 0 duplicates.
[FINDBUGS] Successfully parsed file <https://builds.apache.org/job/kafka-trunk-jdk8/ws/tools/build/reports/spotbugs/main.xml> with 0 unique warnings and 0 duplicates.
Setting GRADLE_4_8_1_HOME=/home/jenkins/tools/gradle/4.8.1
No credentials specified
Setting GRADLE_4_8_1_HOME=/home/jenkins/tools/gradle/4.8.1
<Git Blamer> Using GitBlamer to create author and commit information for all warnings.
<Git Blamer> GIT_COMMIT=f98e176746d663fadedbcd3c18312a7f476a20c8, workspace=<https://builds.apache.org/job/kafka-trunk-jdk8/ws/>
[FINDBUGS] Computing warning deltas based on reference build #3796
Recording test results
Setting GRADLE_4_8_1_HOME=/home/jenkins/tools/gradle/4.8.1
Setting GRADLE_4_8_1_HOME=/home/jenkins/tools/gradle/4.8.1
Not sending mail to unregistered user noreply@github.com
Not sending mail to unregistered user wangguoz@gmail.com
Not sending mail to unregistered user rajinisivaram@googlemail.com

Build failed in Jenkins: kafka-trunk-jdk8 #3806

Posted by Apache Jenkins Server <je...@builds.apache.org>.
See <https://builds.apache.org/job/kafka-trunk-jdk8/3806/display/redirect?page=changes>

Changes:

[rajinisivaram] MINOR: kafkatest - adding whitelist for interbroker sasl configs (#7093)

------------------------------------------
Started by an SCM change
[EnvInject] - Loading node environment variables.
Building remotely on H44 (ubuntu bionic) in workspace <https://builds.apache.org/job/kafka-trunk-jdk8/ws/>
[WS-CLEANUP] Deleting project workspace...
[WS-CLEANUP] Deferred wipeout is used...
[WS-CLEANUP] Done
No credentials specified
Cloning the remote Git repository
Cloning repository https://github.com/apache/kafka.git
 > git init <https://builds.apache.org/job/kafka-trunk-jdk8/ws/> # timeout=10
Fetching upstream changes from https://github.com/apache/kafka.git
 > git --version # timeout=10
 > git fetch --tags --progress https://github.com/apache/kafka.git +refs/heads/*:refs/remotes/origin/*
 > git config remote.origin.url https://github.com/apache/kafka.git # timeout=10
 > git config --add remote.origin.fetch +refs/heads/*:refs/remotes/origin/* # timeout=10
 > git config remote.origin.url https://github.com/apache/kafka.git # timeout=10
Fetching upstream changes from https://github.com/apache/kafka.git
 > git fetch --tags --progress https://github.com/apache/kafka.git +refs/heads/*:refs/remotes/origin/*
 > git rev-parse refs/remotes/origin/trunk^{commit} # timeout=10
 > git rev-parse refs/remotes/origin/origin/trunk^{commit} # timeout=10
Checking out Revision e5f7220b23ba556352d80a0575fcb6cbfe2d576d (refs/remotes/origin/trunk)
 > git config core.sparsecheckout # timeout=10
 > git checkout -f e5f7220b23ba556352d80a0575fcb6cbfe2d576d
Commit message: "MINOR: kafkatest - adding whitelist for interbroker sasl configs (#7093)"
 > git rev-list --no-walk e3524ef350830e3e1fa918ec0ae93b09d51fcf37 # timeout=10
Setting GRADLE_4_8_1_HOME=/home/jenkins/tools/gradle/4.8.1
[kafka-trunk-jdk8] $ /bin/bash -xe /tmp/jenkins8631899412759442773.sh
+ rm -rf <https://builds.apache.org/job/kafka-trunk-jdk8/ws/.gradle>
+ /home/jenkins/tools/gradle/4.8.1/bin/gradle
/tmp/jenkins8631899412759442773.sh: line 4: /home/jenkins/tools/gradle/4.8.1/bin/gradle: No such file or directory
Build step 'Execute shell' marked build as failure
[FINDBUGS] Collecting findbugs analysis files...
Setting GRADLE_4_8_1_HOME=/home/jenkins/tools/gradle/4.8.1
[FINDBUGS] Searching for all files in <https://builds.apache.org/job/kafka-trunk-jdk8/ws/> that match the pattern **/build/reports/*bugs/*.xml
[FINDBUGS] No files found. Configuration error?
Setting GRADLE_4_8_1_HOME=/home/jenkins/tools/gradle/4.8.1
No credentials specified
Setting GRADLE_4_8_1_HOME=/home/jenkins/tools/gradle/4.8.1
<Git Blamer> Using GitBlamer to create author and commit information for all warnings.
<Git Blamer> GIT_COMMIT=e5f7220b23ba556352d80a0575fcb6cbfe2d576d, workspace=<https://builds.apache.org/job/kafka-trunk-jdk8/ws/>
[FINDBUGS] Computing warning deltas based on reference build #3796
Recording test results
Setting GRADLE_4_8_1_HOME=/home/jenkins/tools/gradle/4.8.1
ERROR: Step ?Publish JUnit test result report? failed: No test report files were found. Configuration error?
Setting GRADLE_4_8_1_HOME=/home/jenkins/tools/gradle/4.8.1
Not sending mail to unregistered user noreply@github.com
Not sending mail to unregistered user wangguoz@gmail.com
Not sending mail to unregistered user rajinisivaram@googlemail.com

Build failed in Jenkins: kafka-trunk-jdk8 #3805

Posted by Apache Jenkins Server <je...@builds.apache.org>.
See <https://builds.apache.org/job/kafka-trunk-jdk8/3805/display/redirect?page=changes>

Changes:

[cmccabe] KAFKA-8435: replace delete groups request/response with automated

------------------------------------------
Started by an SCM change
Started by an SCM change
Started by an SCM change
[EnvInject] - Loading node environment variables.
Building remotely on H44 (ubuntu bionic) in workspace <https://builds.apache.org/job/kafka-trunk-jdk8/ws/>
[WS-CLEANUP] Deleting project workspace...
[WS-CLEANUP] Deferred wipeout is used...
[WS-CLEANUP] Done
No credentials specified
Cloning the remote Git repository
Cloning repository https://github.com/apache/kafka.git
 > git init <https://builds.apache.org/job/kafka-trunk-jdk8/ws/> # timeout=10
Fetching upstream changes from https://github.com/apache/kafka.git
 > git --version # timeout=10
 > git fetch --tags --progress https://github.com/apache/kafka.git +refs/heads/*:refs/remotes/origin/*
 > git config remote.origin.url https://github.com/apache/kafka.git # timeout=10
 > git config --add remote.origin.fetch +refs/heads/*:refs/remotes/origin/* # timeout=10
 > git config remote.origin.url https://github.com/apache/kafka.git # timeout=10
Fetching upstream changes from https://github.com/apache/kafka.git
 > git fetch --tags --progress https://github.com/apache/kafka.git +refs/heads/*:refs/remotes/origin/*
 > git rev-parse refs/remotes/origin/trunk^{commit} # timeout=10
 > git rev-parse refs/remotes/origin/origin/trunk^{commit} # timeout=10
Checking out Revision e3524ef350830e3e1fa918ec0ae93b09d51fcf37 (refs/remotes/origin/trunk)
 > git config core.sparsecheckout # timeout=10
 > git checkout -f e3524ef350830e3e1fa918ec0ae93b09d51fcf37
Commit message: "KAFKA-8435: replace delete groups request/response with automated protocol (#6860)"
 > git rev-list --no-walk aa8e850afb7baa447882b493eae29f99a39e35a0 # timeout=10
Setting GRADLE_4_8_1_HOME=/home/jenkins/tools/gradle/4.8.1
[kafka-trunk-jdk8] $ /bin/bash -xe /tmp/jenkins116399946338645376.sh
+ rm -rf <https://builds.apache.org/job/kafka-trunk-jdk8/ws/.gradle>
+ /home/jenkins/tools/gradle/4.8.1/bin/gradle
/tmp/jenkins116399946338645376.sh: line 4: /home/jenkins/tools/gradle/4.8.1/bin/gradle: No such file or directory
Build step 'Execute shell' marked build as failure
[FINDBUGS] Collecting findbugs analysis files...
Setting GRADLE_4_8_1_HOME=/home/jenkins/tools/gradle/4.8.1
[FINDBUGS] Searching for all files in <https://builds.apache.org/job/kafka-trunk-jdk8/ws/> that match the pattern **/build/reports/*bugs/*.xml
[FINDBUGS] No files found. Configuration error?
Setting GRADLE_4_8_1_HOME=/home/jenkins/tools/gradle/4.8.1
No credentials specified
Setting GRADLE_4_8_1_HOME=/home/jenkins/tools/gradle/4.8.1
<Git Blamer> Using GitBlamer to create author and commit information for all warnings.
<Git Blamer> GIT_COMMIT=e3524ef350830e3e1fa918ec0ae93b09d51fcf37, workspace=<https://builds.apache.org/job/kafka-trunk-jdk8/ws/>
[FINDBUGS] Computing warning deltas based on reference build #3796
Recording test results
Setting GRADLE_4_8_1_HOME=/home/jenkins/tools/gradle/4.8.1
ERROR: Step ?Publish JUnit test result report? failed: No test report files were found. Configuration error?
Setting GRADLE_4_8_1_HOME=/home/jenkins/tools/gradle/4.8.1
Not sending mail to unregistered user noreply@github.com
Not sending mail to unregistered user wangguoz@gmail.com

Build failed in Jenkins: kafka-trunk-jdk8 #3804

Posted by Apache Jenkins Server <je...@builds.apache.org>.
See <https://builds.apache.org/job/kafka-trunk-jdk8/3804/display/redirect?page=changes>

Changes:

[wangguoz] KAFKA-8392: Fix old metrics leakage by brokers that have no leadership

------------------------------------------
[...truncated 2.56 MB...]

org.apache.kafka.trogdor.rest.RestExceptionMapperTest > testToResponseSerializationException PASSED

org.apache.kafka.trogdor.rest.RestExceptionMapperTest > testToExceptionRuntimeException STARTED

org.apache.kafka.trogdor.rest.RestExceptionMapperTest > testToExceptionRuntimeException PASSED

> Task :streams:streams-scala:test

org.apache.kafka.streams.scala.WordCountTest > testShouldCountWordsMaterialized STARTED

org.apache.kafka.streams.scala.WordCountTest > testShouldCountWordsMaterialized PASSED

org.apache.kafka.streams.scala.WordCountTest > testShouldCountWordsJava STARTED

org.apache.kafka.streams.scala.WordCountTest > testShouldCountWordsJava PASSED

org.apache.kafka.streams.scala.WordCountTest > testShouldCountWords STARTED

org.apache.kafka.streams.scala.WordCountTest > testShouldCountWords PASSED

org.apache.kafka.streams.scala.TopologyTest > shouldBuildIdenticalTopologyInJavaNScalaJoin STARTED

org.apache.kafka.streams.scala.TopologyTest > shouldBuildIdenticalTopologyInJavaNScalaJoin PASSED

org.apache.kafka.streams.scala.TopologyTest > shouldBuildIdenticalTopologyInJavaNScalaSimple STARTED

org.apache.kafka.streams.scala.TopologyTest > shouldBuildIdenticalTopologyInJavaNScalaSimple PASSED

org.apache.kafka.streams.scala.TopologyTest > shouldBuildIdenticalTopologyInJavaNScalaAggregate STARTED

org.apache.kafka.streams.scala.TopologyTest > shouldBuildIdenticalTopologyInJavaNScalaAggregate PASSED

org.apache.kafka.streams.scala.TopologyTest > shouldBuildIdenticalTopologyInJavaNScalaProperties STARTED

org.apache.kafka.streams.scala.TopologyTest > shouldBuildIdenticalTopologyInJavaNScalaProperties PASSED

org.apache.kafka.streams.scala.TopologyTest > shouldBuildIdenticalTopologyInJavaNScalaTransform STARTED

org.apache.kafka.streams.scala.TopologyTest > shouldBuildIdenticalTopologyInJavaNScalaTransform PASSED

org.apache.kafka.streams.scala.kstream.JoinedTest > Create a Joined should create a Joined with Serdes STARTED

org.apache.kafka.streams.scala.kstream.JoinedTest > Create a Joined should create a Joined with Serdes PASSED

org.apache.kafka.streams.scala.kstream.JoinedTest > Create a Joined should create a Joined with Serdes and repartition topic name STARTED

org.apache.kafka.streams.scala.kstream.JoinedTest > Create a Joined should create a Joined with Serdes and repartition topic name PASSED

org.apache.kafka.streams.scala.kstream.GroupedTest > Create a Grouped should create a Grouped with Serdes STARTED

org.apache.kafka.streams.scala.kstream.GroupedTest > Create a Grouped should create a Grouped with Serdes PASSED

org.apache.kafka.streams.scala.kstream.GroupedTest > Create a Grouped with repartition topic name should create a Grouped with Serdes, and repartition topic name STARTED

org.apache.kafka.streams.scala.kstream.GroupedTest > Create a Grouped with repartition topic name should create a Grouped with Serdes, and repartition topic name PASSED

org.apache.kafka.streams.scala.kstream.ProducedTest > Create a Produced should create a Produced with Serdes STARTED

org.apache.kafka.streams.scala.kstream.ProducedTest > Create a Produced should create a Produced with Serdes PASSED

org.apache.kafka.streams.scala.kstream.ProducedTest > Create a Produced with timestampExtractor and resetPolicy should create a Consumed with Serdes, timestampExtractor and resetPolicy STARTED

org.apache.kafka.streams.scala.kstream.ProducedTest > Create a Produced with timestampExtractor and resetPolicy should create a Consumed with Serdes, timestampExtractor and resetPolicy PASSED

org.apache.kafka.streams.scala.kstream.SuppressedTest > Suppressed.untilWindowCloses should produce the correct suppression STARTED

org.apache.kafka.streams.scala.kstream.SuppressedTest > Suppressed.untilWindowCloses should produce the correct suppression PASSED

org.apache.kafka.streams.scala.kstream.SuppressedTest > Suppressed.untilTimeLimit should produce the correct suppression STARTED

org.apache.kafka.streams.scala.kstream.SuppressedTest > Suppressed.untilTimeLimit should produce the correct suppression PASSED

org.apache.kafka.streams.scala.kstream.SuppressedTest > BufferConfig.maxRecords should produce the correct buffer config STARTED

org.apache.kafka.streams.scala.kstream.SuppressedTest > BufferConfig.maxRecords should produce the correct buffer config PASSED

org.apache.kafka.streams.scala.kstream.SuppressedTest > BufferConfig.maxBytes should produce the correct buffer config STARTED

org.apache.kafka.streams.scala.kstream.SuppressedTest > BufferConfig.maxBytes should produce the correct buffer config PASSED

org.apache.kafka.streams.scala.kstream.SuppressedTest > BufferConfig.unbounded should produce the correct buffer config STARTED

org.apache.kafka.streams.scala.kstream.SuppressedTest > BufferConfig.unbounded should produce the correct buffer config PASSED

org.apache.kafka.streams.scala.kstream.SuppressedTest > BufferConfig should support very long chains of factory methods STARTED

org.apache.kafka.streams.scala.kstream.SuppressedTest > BufferConfig should support very long chains of factory methods PASSED

org.apache.kafka.streams.scala.kstream.KStreamTest > filter a KStream should filter records satisfying the predicate STARTED

org.apache.kafka.streams.scala.kstream.KStreamTest > filter a KStream should filter records satisfying the predicate PASSED

org.apache.kafka.streams.scala.kstream.KStreamTest > filterNot a KStream should filter records not satisfying the predicate STARTED

org.apache.kafka.streams.scala.kstream.KStreamTest > filterNot a KStream should filter records not satisfying the predicate PASSED

org.apache.kafka.streams.scala.kstream.KStreamTest > foreach a KStream should run foreach actions on records STARTED

org.apache.kafka.streams.scala.kstream.KStreamTest > foreach a KStream should run foreach actions on records PASSED

org.apache.kafka.streams.scala.kstream.KStreamTest > peek a KStream should run peek actions on records STARTED

org.apache.kafka.streams.scala.kstream.KStreamTest > peek a KStream should run peek actions on records PASSED

org.apache.kafka.streams.scala.kstream.KStreamTest > selectKey a KStream should select a new key STARTED

org.apache.kafka.streams.scala.kstream.KStreamTest > selectKey a KStream should select a new key PASSED

org.apache.kafka.streams.scala.kstream.KStreamTest > join 2 KStreams should join correctly records STARTED

org.apache.kafka.streams.scala.kstream.KStreamTest > join 2 KStreams should join correctly records PASSED

org.apache.kafka.streams.scala.kstream.MaterializedTest > Create a Materialized should create a Materialized with Serdes STARTED

org.apache.kafka.streams.scala.kstream.MaterializedTest > Create a Materialized should create a Materialized with Serdes PASSED

org.apache.kafka.streams.scala.kstream.MaterializedTest > Create a Materialize with a store name should create a Materialized with Serdes and a store name STARTED

org.apache.kafka.streams.scala.kstream.MaterializedTest > Create a Materialize with a store name should create a Materialized with Serdes and a store name PASSED

org.apache.kafka.streams.scala.kstream.MaterializedTest > Create a Materialize with a window store supplier should create a Materialized with Serdes and a store supplier STARTED

org.apache.kafka.streams.scala.kstream.MaterializedTest > Create a Materialize with a window store supplier should create a Materialized with Serdes and a store supplier PASSED

org.apache.kafka.streams.scala.kstream.MaterializedTest > Create a Materialize with a key value store supplier should create a Materialized with Serdes and a store supplier STARTED

org.apache.kafka.streams.scala.kstream.MaterializedTest > Create a Materialize with a key value store supplier should create a Materialized with Serdes and a store supplier PASSED

org.apache.kafka.streams.scala.kstream.MaterializedTest > Create a Materialize with a session store supplier should create a Materialized with Serdes and a store supplier STARTED

org.apache.kafka.streams.scala.kstream.MaterializedTest > Create a Materialize with a session store supplier should create a Materialized with Serdes and a store supplier PASSED

org.apache.kafka.streams.scala.kstream.KTableTest > filter a KTable should filter records satisfying the predicate STARTED

org.apache.kafka.streams.scala.kstream.KTableTest > filter a KTable should filter records satisfying the predicate PASSED

org.apache.kafka.streams.scala.kstream.KTableTest > filterNot a KTable should filter records not satisfying the predicate STARTED

org.apache.kafka.streams.scala.kstream.KTableTest > filterNot a KTable should filter records not satisfying the predicate PASSED

org.apache.kafka.streams.scala.kstream.KTableTest > join 2 KTables should join correctly records STARTED

org.apache.kafka.streams.scala.kstream.KTableTest > join 2 KTables should join correctly records PASSED

org.apache.kafka.streams.scala.kstream.KTableTest > join 2 KTables with a Materialized should join correctly records and state store STARTED

org.apache.kafka.streams.scala.kstream.KTableTest > join 2 KTables with a Materialized should join correctly records and state store PASSED

org.apache.kafka.streams.scala.kstream.KTableTest > windowed KTable#suppress should correctly suppress results using Suppressed.untilTimeLimit STARTED

org.apache.kafka.streams.scala.kstream.KTableTest > windowed KTable#suppress should correctly suppress results using Suppressed.untilTimeLimit PASSED

org.apache.kafka.streams.scala.kstream.KTableTest > windowed KTable#suppress should correctly suppress results using Suppressed.untilWindowCloses STARTED

org.apache.kafka.streams.scala.kstream.KTableTest > windowed KTable#suppress should correctly suppress results using Suppressed.untilWindowCloses PASSED

org.apache.kafka.streams.scala.kstream.KTableTest > session windowed KTable#suppress should correctly suppress results using Suppressed.untilWindowCloses STARTED

org.apache.kafka.streams.scala.kstream.KTableTest > session windowed KTable#suppress should correctly suppress results using Suppressed.untilWindowCloses PASSED

org.apache.kafka.streams.scala.kstream.KTableTest > non-windowed KTable#suppress should correctly suppress results using Suppressed.untilTimeLimit STARTED

org.apache.kafka.streams.scala.kstream.KTableTest > non-windowed KTable#suppress should correctly suppress results using Suppressed.untilTimeLimit PASSED

org.apache.kafka.streams.scala.kstream.ConsumedTest > Create a Consumed should create a Consumed with Serdes STARTED

org.apache.kafka.streams.scala.kstream.ConsumedTest > Create a Consumed should create a Consumed with Serdes PASSED

org.apache.kafka.streams.scala.kstream.ConsumedTest > Create a Consumed with timestampExtractor and resetPolicy should create a Consumed with Serdes, timestampExtractor and resetPolicy STARTED

org.apache.kafka.streams.scala.kstream.ConsumedTest > Create a Consumed with timestampExtractor and resetPolicy should create a Consumed with Serdes, timestampExtractor and resetPolicy PASSED

org.apache.kafka.streams.scala.kstream.ConsumedTest > Create a Consumed with timestampExtractor should create a Consumed with Serdes and timestampExtractor STARTED

org.apache.kafka.streams.scala.kstream.ConsumedTest > Create a Consumed with timestampExtractor should create a Consumed with Serdes and timestampExtractor PASSED

org.apache.kafka.streams.scala.kstream.ConsumedTest > Create a Consumed with resetPolicy should create a Consumed with Serdes and resetPolicy STARTED

org.apache.kafka.streams.scala.kstream.ConsumedTest > Create a Consumed with resetPolicy should create a Consumed with Serdes and resetPolicy PASSED

org.apache.kafka.streams.scala.StreamToTableJoinScalaIntegrationTestImplicitSerdes > testShouldCountClicksPerRegionWithNamedRepartitionTopic STARTED

org.apache.kafka.streams.scala.StreamToTableJoinScalaIntegrationTestImplicitSerdes > testShouldCountClicksPerRegionWithNamedRepartitionTopic PASSED

org.apache.kafka.streams.scala.StreamToTableJoinScalaIntegrationTestImplicitSerdes > testShouldCountClicksPerRegionJava STARTED

org.apache.kafka.streams.scala.StreamToTableJoinScalaIntegrationTestImplicitSerdes > testShouldCountClicksPerRegionJava PASSED

org.apache.kafka.streams.scala.StreamToTableJoinScalaIntegrationTestImplicitSerdes > testShouldCountClicksPerRegion STARTED

org.apache.kafka.streams.scala.StreamToTableJoinScalaIntegrationTestImplicitSerdes > testShouldCountClicksPerRegion PASSED

> Task :streams:examples:test

org.apache.kafka.streams.examples.wordcount.WordCountProcessorTest > test STARTED

org.apache.kafka.streams.examples.wordcount.WordCountProcessorTest > test PASSED

FAILURE: Build failed with an exception.

* What went wrong:
Execution failed for task ':connect:runtime:test'.
> There were failing tests. See the report at: file://<https://builds.apache.org/job/kafka-trunk-jdk8/ws/connect/runtime/build/reports/tests/test/index.html>

* Try:
Run with --stacktrace option to get the stack trace. Run with --info or --debug option to get more log output. Run with --scan to get full insights.

* Get more help at https://help.gradle.org

Deprecated Gradle features were used in this build, making it incompatible with Gradle 6.0.
Use '--warning-mode all' to show the individual deprecation warnings.
See https://docs.gradle.org/5.4.1/userguide/command_line_interface.html#sec:command_line_warnings

BUILD FAILED in 3h 12m 46s
178 actionable tasks: 152 executed, 26 up-to-date
Build step 'Execute shell' marked build as failure
[FINDBUGS] Collecting findbugs analysis files...
Setting GRADLE_4_8_1_HOME=/home/jenkins/tools/gradle/4.8.1
[FINDBUGS] Searching for all files in <https://builds.apache.org/job/kafka-trunk-jdk8/ws/> that match the pattern **/build/reports/*bugs/*.xml
[FINDBUGS] Parsing 17 files in <https://builds.apache.org/job/kafka-trunk-jdk8/ws/>
[FINDBUGS] Successfully parsed file <https://builds.apache.org/job/kafka-trunk-jdk8/ws/clients/build/reports/spotbugs/main.xml> with 0 unique warnings and 0 duplicates.
[FINDBUGS] Successfully parsed file <https://builds.apache.org/job/kafka-trunk-jdk8/ws/connect/api/build/reports/spotbugs/main.xml> with 0 unique warnings and 0 duplicates.
[FINDBUGS] Successfully parsed file <https://builds.apache.org/job/kafka-trunk-jdk8/ws/connect/basic-auth-extension/build/reports/spotbugs/main.xml> with 0 unique warnings and 0 duplicates.
[FINDBUGS] Successfully parsed file <https://builds.apache.org/job/kafka-trunk-jdk8/ws/connect/file/build/reports/spotbugs/main.xml> with 0 unique warnings and 0 duplicates.
[FINDBUGS] Successfully parsed file <https://builds.apache.org/job/kafka-trunk-jdk8/ws/connect/json/build/reports/spotbugs/main.xml> with 0 unique warnings and 0 duplicates.
[FINDBUGS] Successfully parsed file <https://builds.apache.org/job/kafka-trunk-jdk8/ws/connect/runtime/build/reports/spotbugs/main.xml> with 0 unique warnings and 0 duplicates.
[FINDBUGS] Successfully parsed file <https://builds.apache.org/job/kafka-trunk-jdk8/ws/connect/transforms/build/reports/spotbugs/main.xml> with 0 unique warnings and 0 duplicates.
[FINDBUGS] Successfully parsed file <https://builds.apache.org/job/kafka-trunk-jdk8/ws/core/build/reports/spotbugs/main.xml> with 0 unique warnings and 0 duplicates.
[FINDBUGS] Successfully parsed file <https://builds.apache.org/job/kafka-trunk-jdk8/ws/examples/build/reports/spotbugs/main.xml> with 0 unique warnings and 0 duplicates.
[FINDBUGS] Successfully parsed file <https://builds.apache.org/job/kafka-trunk-jdk8/ws/generator/build/reports/spotbugs/main.xml> with 0 unique warnings and 0 duplicates.
[FINDBUGS] Successfully parsed file <https://builds.apache.org/job/kafka-trunk-jdk8/ws/jmh-benchmarks/build/reports/spotbugs/main.xml> with 0 unique warnings and 0 duplicates.
[FINDBUGS] Successfully parsed file <https://builds.apache.org/job/kafka-trunk-jdk8/ws/log4j-appender/build/reports/spotbugs/main.xml> with 0 unique warnings and 0 duplicates.
[FINDBUGS] Successfully parsed file <https://builds.apache.org/job/kafka-trunk-jdk8/ws/streams/build/reports/spotbugs/main.xml> with 0 unique warnings and 0 duplicates.
[FINDBUGS] Successfully parsed file <https://builds.apache.org/job/kafka-trunk-jdk8/ws/streams/examples/build/reports/spotbugs/main.xml> with 0 unique warnings and 0 duplicates.
[FINDBUGS] Successfully parsed file <https://builds.apache.org/job/kafka-trunk-jdk8/ws/streams/streams-scala/build/reports/spotbugs/main.xml> with 0 unique warnings and 0 duplicates.
[FINDBUGS] Successfully parsed file <https://builds.apache.org/job/kafka-trunk-jdk8/ws/streams/test-utils/build/reports/spotbugs/main.xml> with 0 unique warnings and 0 duplicates.
[FINDBUGS] Successfully parsed file <https://builds.apache.org/job/kafka-trunk-jdk8/ws/tools/build/reports/spotbugs/main.xml> with 0 unique warnings and 0 duplicates.
Setting GRADLE_4_8_1_HOME=/home/jenkins/tools/gradle/4.8.1
No credentials specified
Setting GRADLE_4_8_1_HOME=/home/jenkins/tools/gradle/4.8.1
<Git Blamer> Using GitBlamer to create author and commit information for all warnings.
<Git Blamer> GIT_COMMIT=aa8e850afb7baa447882b493eae29f99a39e35a0, workspace=<https://builds.apache.org/job/kafka-trunk-jdk8/ws/>
[FINDBUGS] Computing warning deltas based on reference build #3796
Recording test results
Setting GRADLE_4_8_1_HOME=/home/jenkins/tools/gradle/4.8.1
Setting GRADLE_4_8_1_HOME=/home/jenkins/tools/gradle/4.8.1
Not sending mail to unregistered user noreply@github.com
Not sending mail to unregistered user wangguoz@gmail.com

Build failed in Jenkins: kafka-trunk-jdk8 #3803

Posted by Apache Jenkins Server <je...@builds.apache.org>.
See <https://builds.apache.org/job/kafka-trunk-jdk8/3803/display/redirect?page=changes>

Changes:

[github] MINOR: Update documentation for enabling optimizations (#7099)

[matthias] KAFKA-8513: Add kafka-streams-application-reset.bat for Windows platform

------------------------------------------
Started by an SCM change
[EnvInject] - Loading node environment variables.
Building remotely on H44 (ubuntu bionic) in workspace <https://builds.apache.org/job/kafka-trunk-jdk8/ws/>
[WS-CLEANUP] Deleting project workspace...
[WS-CLEANUP] Deferred wipeout is used...
[WS-CLEANUP] Done
No credentials specified
Cloning the remote Git repository
Cloning repository https://github.com/apache/kafka.git
 > git init <https://builds.apache.org/job/kafka-trunk-jdk8/ws/> # timeout=10
Fetching upstream changes from https://github.com/apache/kafka.git
 > git --version # timeout=10
 > git fetch --tags --progress https://github.com/apache/kafka.git +refs/heads/*:refs/remotes/origin/*
 > git config remote.origin.url https://github.com/apache/kafka.git # timeout=10
 > git config --add remote.origin.fetch +refs/heads/*:refs/remotes/origin/* # timeout=10
 > git config remote.origin.url https://github.com/apache/kafka.git # timeout=10
Fetching upstream changes from https://github.com/apache/kafka.git
 > git fetch --tags --progress https://github.com/apache/kafka.git +refs/heads/*:refs/remotes/origin/*
 > git rev-parse refs/remotes/origin/trunk^{commit} # timeout=10
 > git rev-parse refs/remotes/origin/origin/trunk^{commit} # timeout=10
Checking out Revision 58938a045fd1eab517bdd3317be309b1be324dec (refs/remotes/origin/trunk)
 > git config core.sparsecheckout # timeout=10
 > git checkout -f 58938a045fd1eab517bdd3317be309b1be324dec
Commit message: "KAFKA-8513: Add kafka-streams-application-reset.bat for Windows platform (#6909)"
 > git rev-list --no-walk 9829c726996f52bf02547951a13548ee4057e46f # timeout=10
Setting GRADLE_4_8_1_HOME=/home/jenkins/tools/gradle/4.8.1
[kafka-trunk-jdk8] $ /bin/bash -xe /tmp/jenkins4842931755041821671.sh
+ rm -rf <https://builds.apache.org/job/kafka-trunk-jdk8/ws/.gradle>
+ /home/jenkins/tools/gradle/4.8.1/bin/gradle
/tmp/jenkins4842931755041821671.sh: line 4: /home/jenkins/tools/gradle/4.8.1/bin/gradle: No such file or directory
Build step 'Execute shell' marked build as failure
[FINDBUGS] Collecting findbugs analysis files...
Setting GRADLE_4_8_1_HOME=/home/jenkins/tools/gradle/4.8.1
[FINDBUGS] Searching for all files in <https://builds.apache.org/job/kafka-trunk-jdk8/ws/> that match the pattern **/build/reports/*bugs/*.xml
[FINDBUGS] No files found. Configuration error?
Setting GRADLE_4_8_1_HOME=/home/jenkins/tools/gradle/4.8.1
No credentials specified
Setting GRADLE_4_8_1_HOME=/home/jenkins/tools/gradle/4.8.1
<Git Blamer> Using GitBlamer to create author and commit information for all warnings.
<Git Blamer> GIT_COMMIT=58938a045fd1eab517bdd3317be309b1be324dec, workspace=<https://builds.apache.org/job/kafka-trunk-jdk8/ws/>
[FINDBUGS] Computing warning deltas based on reference build #3796
Recording test results
Setting GRADLE_4_8_1_HOME=/home/jenkins/tools/gradle/4.8.1
ERROR: Step ?Publish JUnit test result report? failed: No test report files were found. Configuration error?
Setting GRADLE_4_8_1_HOME=/home/jenkins/tools/gradle/4.8.1
Not sending mail to unregistered user noreply@github.com
Not sending mail to unregistered user wangguoz@gmail.com

Build failed in Jenkins: kafka-trunk-jdk8 #3802

Posted by Apache Jenkins Server <je...@builds.apache.org>.
See <https://builds.apache.org/job/kafka-trunk-jdk8/3802/display/redirect?page=changes>

Changes:

[bbejeck] MINOR: Remove stale streams producer retry default docs. (#6844)

------------------------------------------
Started by an SCM change
[EnvInject] - Loading node environment variables.
Building remotely on H44 (ubuntu bionic) in workspace <https://builds.apache.org/job/kafka-trunk-jdk8/ws/>
[WS-CLEANUP] Deleting project workspace...
[WS-CLEANUP] Deferred wipeout is used...
[WS-CLEANUP] Done
No credentials specified
Cloning the remote Git repository
Cloning repository https://github.com/apache/kafka.git
 > git init <https://builds.apache.org/job/kafka-trunk-jdk8/ws/> # timeout=10
Fetching upstream changes from https://github.com/apache/kafka.git
 > git --version # timeout=10
 > git fetch --tags --progress https://github.com/apache/kafka.git +refs/heads/*:refs/remotes/origin/*
 > git config remote.origin.url https://github.com/apache/kafka.git # timeout=10
 > git config --add remote.origin.fetch +refs/heads/*:refs/remotes/origin/* # timeout=10
 > git config remote.origin.url https://github.com/apache/kafka.git # timeout=10
Fetching upstream changes from https://github.com/apache/kafka.git
 > git fetch --tags --progress https://github.com/apache/kafka.git +refs/heads/*:refs/remotes/origin/*
 > git rev-parse refs/remotes/origin/trunk^{commit} # timeout=10
 > git rev-parse refs/remotes/origin/origin/trunk^{commit} # timeout=10
Checking out Revision 9829c726996f52bf02547951a13548ee4057e46f (refs/remotes/origin/trunk)
 > git config core.sparsecheckout # timeout=10
 > git checkout -f 9829c726996f52bf02547951a13548ee4057e46f
Commit message: "MINOR: Remove stale streams producer retry default docs. (#6844)"
 > git rev-list --no-walk 2e26a46358d97112b9b912a7c5c29a2d6fb517cf # timeout=10
Setting GRADLE_4_8_1_HOME=/home/jenkins/tools/gradle/4.8.1
[kafka-trunk-jdk8] $ /bin/bash -xe /tmp/jenkins1765160268688545589.sh
+ rm -rf <https://builds.apache.org/job/kafka-trunk-jdk8/ws/.gradle>
+ /home/jenkins/tools/gradle/4.8.1/bin/gradle
/tmp/jenkins1765160268688545589.sh: line 4: /home/jenkins/tools/gradle/4.8.1/bin/gradle: No such file or directory
Build step 'Execute shell' marked build as failure
[FINDBUGS] Collecting findbugs analysis files...
Setting GRADLE_4_8_1_HOME=/home/jenkins/tools/gradle/4.8.1
[FINDBUGS] Searching for all files in <https://builds.apache.org/job/kafka-trunk-jdk8/ws/> that match the pattern **/build/reports/*bugs/*.xml
[FINDBUGS] No files found. Configuration error?
Setting GRADLE_4_8_1_HOME=/home/jenkins/tools/gradle/4.8.1
No credentials specified
Setting GRADLE_4_8_1_HOME=/home/jenkins/tools/gradle/4.8.1
<Git Blamer> Using GitBlamer to create author and commit information for all warnings.
<Git Blamer> GIT_COMMIT=9829c726996f52bf02547951a13548ee4057e46f, workspace=<https://builds.apache.org/job/kafka-trunk-jdk8/ws/>
[FINDBUGS] Computing warning deltas based on reference build #3796
Recording test results
Setting GRADLE_4_8_1_HOME=/home/jenkins/tools/gradle/4.8.1
ERROR: Step ?Publish JUnit test result report? failed: No test report files were found. Configuration error?
Setting GRADLE_4_8_1_HOME=/home/jenkins/tools/gradle/4.8.1
Not sending mail to unregistered user wangguoz@gmail.com

Build failed in Jenkins: kafka-trunk-jdk8 #3801

Posted by Apache Jenkins Server <je...@builds.apache.org>.
See <https://builds.apache.org/job/kafka-trunk-jdk8/3801/display/redirect?page=changes>

Changes:

[jason] KAFKA-8635; Skip client poll in Sender loop when no request is sent

------------------------------------------
Started by an SCM change
[EnvInject] - Loading node environment variables.
Building remotely on H44 (ubuntu bionic) in workspace <https://builds.apache.org/job/kafka-trunk-jdk8/ws/>
[WS-CLEANUP] Deleting project workspace...
[WS-CLEANUP] Deferred wipeout is used...
[WS-CLEANUP] Done
No credentials specified
Cloning the remote Git repository
Cloning repository https://github.com/apache/kafka.git
 > git init <https://builds.apache.org/job/kafka-trunk-jdk8/ws/> # timeout=10
Fetching upstream changes from https://github.com/apache/kafka.git
 > git --version # timeout=10
 > git fetch --tags --progress https://github.com/apache/kafka.git +refs/heads/*:refs/remotes/origin/*
 > git config remote.origin.url https://github.com/apache/kafka.git # timeout=10
 > git config --add remote.origin.fetch +refs/heads/*:refs/remotes/origin/* # timeout=10
 > git config remote.origin.url https://github.com/apache/kafka.git # timeout=10
Fetching upstream changes from https://github.com/apache/kafka.git
 > git fetch --tags --progress https://github.com/apache/kafka.git +refs/heads/*:refs/remotes/origin/*
 > git rev-parse refs/remotes/origin/trunk^{commit} # timeout=10
 > git rev-parse refs/remotes/origin/origin/trunk^{commit} # timeout=10
Checking out Revision 2e26a46358d97112b9b912a7c5c29a2d6fb517cf (refs/remotes/origin/trunk)
 > git config core.sparsecheckout # timeout=10
 > git checkout -f 2e26a46358d97112b9b912a7c5c29a2d6fb517cf
Commit message: "KAFKA-8635; Skip client poll in Sender loop when no request is sent (#7085)"
 > git rev-list --no-walk 62fbc92e3d9d84617dab46329c279835d157bda4 # timeout=10
Setting GRADLE_4_8_1_HOME=/home/jenkins/tools/gradle/4.8.1
[kafka-trunk-jdk8] $ /bin/bash -xe /tmp/jenkins9191358911679547305.sh
+ rm -rf <https://builds.apache.org/job/kafka-trunk-jdk8/ws/.gradle>
+ /home/jenkins/tools/gradle/4.8.1/bin/gradle
/tmp/jenkins9191358911679547305.sh: line 4: /home/jenkins/tools/gradle/4.8.1/bin/gradle: No such file or directory
Build step 'Execute shell' marked build as failure
[FINDBUGS] Collecting findbugs analysis files...
Setting GRADLE_4_8_1_HOME=/home/jenkins/tools/gradle/4.8.1
[FINDBUGS] Searching for all files in <https://builds.apache.org/job/kafka-trunk-jdk8/ws/> that match the pattern **/build/reports/*bugs/*.xml
[FINDBUGS] No files found. Configuration error?
Setting GRADLE_4_8_1_HOME=/home/jenkins/tools/gradle/4.8.1
No credentials specified
Setting GRADLE_4_8_1_HOME=/home/jenkins/tools/gradle/4.8.1
<Git Blamer> Using GitBlamer to create author and commit information for all warnings.
<Git Blamer> GIT_COMMIT=2e26a46358d97112b9b912a7c5c29a2d6fb517cf, workspace=<https://builds.apache.org/job/kafka-trunk-jdk8/ws/>
[FINDBUGS] Computing warning deltas based on reference build #3796
Recording test results
Setting GRADLE_4_8_1_HOME=/home/jenkins/tools/gradle/4.8.1
ERROR: Step ?Publish JUnit test result report? failed: No test report files were found. Configuration error?
Setting GRADLE_4_8_1_HOME=/home/jenkins/tools/gradle/4.8.1
Not sending mail to unregistered user wangguoz@gmail.com

Build failed in Jenkins: kafka-trunk-jdk8 #3800

Posted by Apache Jenkins Server <je...@builds.apache.org>.
See <https://builds.apache.org/job/kafka-trunk-jdk8/3800/display/redirect?page=changes>

Changes:

[jason] KAFKA-8670; Fix exception for kafka-topics.sh --describe without --topic

[wangguoz] KAFKA-8615: Change to track partition time breaks TimestampExtractor

------------------------------------------
Started by an SCM change
[EnvInject] - Loading node environment variables.
Building remotely on H44 (ubuntu bionic) in workspace <https://builds.apache.org/job/kafka-trunk-jdk8/ws/>
[WS-CLEANUP] Deleting project workspace...
[WS-CLEANUP] Deferred wipeout is used...
No credentials specified
Cloning the remote Git repository
Cloning repository https://github.com/apache/kafka.git
 > git init <https://builds.apache.org/job/kafka-trunk-jdk8/ws/> # timeout=10
Fetching upstream changes from https://github.com/apache/kafka.git
 > git --version # timeout=10
 > git fetch --tags --progress https://github.com/apache/kafka.git +refs/heads/*:refs/remotes/origin/*
 > git config remote.origin.url https://github.com/apache/kafka.git # timeout=10
 > git config --add remote.origin.fetch +refs/heads/*:refs/remotes/origin/* # timeout=10
 > git config remote.origin.url https://github.com/apache/kafka.git # timeout=10
Fetching upstream changes from https://github.com/apache/kafka.git
 > git fetch --tags --progress https://github.com/apache/kafka.git +refs/heads/*:refs/remotes/origin/*
 > git rev-parse refs/remotes/origin/trunk^{commit} # timeout=10
 > git rev-parse refs/remotes/origin/origin/trunk^{commit} # timeout=10
Checking out Revision 62fbc92e3d9d84617dab46329c279835d157bda4 (refs/remotes/origin/trunk)
 > git config core.sparsecheckout # timeout=10
 > git checkout -f 62fbc92e3d9d84617dab46329c279835d157bda4
Commit message: "KAFKA-8615: Change to track partition time breaks TimestampExtractor (#7054)"
 > git rev-list --no-walk f8994897d30ef7508756dceb1d19171d6204f2a2 # timeout=10
Setting GRADLE_4_8_1_HOME=/home/jenkins/tools/gradle/4.8.1
[kafka-trunk-jdk8] $ /bin/bash -xe /tmp/jenkins120559094274316284.sh
+ rm -rf <https://builds.apache.org/job/kafka-trunk-jdk8/ws/.gradle>
+ /home/jenkins/tools/gradle/4.8.1/bin/gradle
/tmp/jenkins120559094274316284.sh: line 4: /home/jenkins/tools/gradle/4.8.1/bin/gradle: No such file or directory
Build step 'Execute shell' marked build as failure
[FINDBUGS] Collecting findbugs analysis files...
Setting GRADLE_4_8_1_HOME=/home/jenkins/tools/gradle/4.8.1
[FINDBUGS] Searching for all files in <https://builds.apache.org/job/kafka-trunk-jdk8/ws/> that match the pattern **/build/reports/*bugs/*.xml
[FINDBUGS] No files found. Configuration error?
Setting GRADLE_4_8_1_HOME=/home/jenkins/tools/gradle/4.8.1
No credentials specified
Setting GRADLE_4_8_1_HOME=/home/jenkins/tools/gradle/4.8.1
<Git Blamer> Using GitBlamer to create author and commit information for all warnings.
<Git Blamer> GIT_COMMIT=62fbc92e3d9d84617dab46329c279835d157bda4, workspace=<https://builds.apache.org/job/kafka-trunk-jdk8/ws/>
[FINDBUGS] Computing warning deltas based on reference build #3796
Recording test results
Setting GRADLE_4_8_1_HOME=/home/jenkins/tools/gradle/4.8.1
ERROR: Step ?Publish JUnit test result report? failed: No test report files were found. Configuration error?
Setting GRADLE_4_8_1_HOME=/home/jenkins/tools/gradle/4.8.1
Not sending mail to unregistered user wangguoz@gmail.com

Build failed in Jenkins: kafka-trunk-jdk8 #3799

Posted by Apache Jenkins Server <je...@builds.apache.org>.
See <https://builds.apache.org/job/kafka-trunk-jdk8/3799/display/redirect?page=changes>

Changes:

[bbejeck]  MINOR: improve error message for incorrect window-serde initialization

------------------------------------------
[...truncated 8.73 MB...]

kafka.server.ListOffsetsRequestTest > testListOffsetsErrorCodes PASSED

kafka.server.ListOffsetsRequestTest > testCurrentEpochValidation STARTED

kafka.server.ListOffsetsRequestTest > testCurrentEpochValidation PASSED

kafka.server.ListOffsetsRequestTest > testResponseIncludesLeaderEpoch STARTED

kafka.server.ListOffsetsRequestTest > testResponseIncludesLeaderEpoch PASSED

kafka.server.SaslApiVersionsRequestTest > testApiVersionsRequestWithUnsupportedVersion STARTED

kafka.server.SaslApiVersionsRequestTest > testApiVersionsRequestWithUnsupportedVersion PASSED

kafka.server.SaslApiVersionsRequestTest > testApiVersionsRequestBeforeSaslHandshakeRequest STARTED

kafka.server.SaslApiVersionsRequestTest > testApiVersionsRequestBeforeSaslHandshakeRequest PASSED

kafka.server.SaslApiVersionsRequestTest > testApiVersionsRequestAfterSaslHandshakeRequest STARTED

kafka.server.SaslApiVersionsRequestTest > testApiVersionsRequestAfterSaslHandshakeRequest PASSED

kafka.server.DeleteTopicsRequestTest > testValidDeleteTopicRequests STARTED

kafka.server.DeleteTopicsRequestTest > testValidDeleteTopicRequests PASSED

kafka.server.DeleteTopicsRequestTest > testErrorDeleteTopicRequests STARTED

kafka.server.DeleteTopicsRequestTest > testErrorDeleteTopicRequests PASSED

kafka.server.DeleteTopicsRequestTest > testNotController STARTED

kafka.server.DeleteTopicsRequestTest > testNotController PASSED

kafka.server.epoch.LeaderEpochFileCacheTest > shouldFetchLatestEpochOfEmptyCache STARTED

kafka.server.epoch.LeaderEpochFileCacheTest > shouldFetchLatestEpochOfEmptyCache PASSED

kafka.server.epoch.LeaderEpochFileCacheTest > shouldNotUpdateEpochAndStartOffsetIfItDidNotChange STARTED

kafka.server.epoch.LeaderEpochFileCacheTest > shouldNotUpdateEpochAndStartOffsetIfItDidNotChange PASSED

kafka.server.epoch.LeaderEpochFileCacheTest > shouldDropEntriesBetweenEpochBoundaryWhenRemovingNewest STARTED

kafka.server.epoch.LeaderEpochFileCacheTest > shouldDropEntriesBetweenEpochBoundaryWhenRemovingNewest PASSED

kafka.server.epoch.LeaderEpochFileCacheTest > shouldReturnLogEndOffsetIfLatestEpochRequested STARTED

kafka.server.epoch.LeaderEpochFileCacheTest > shouldReturnLogEndOffsetIfLatestEpochRequested PASSED

kafka.server.epoch.LeaderEpochFileCacheTest > shouldNotClearAnythingIfOffsetToEarly STARTED

kafka.server.epoch.LeaderEpochFileCacheTest > shouldNotClearAnythingIfOffsetToEarly PASSED

kafka.server.epoch.LeaderEpochFileCacheTest > shouldIncreaseAndTrackEpochsAsFollowerReceivesManyMessages STARTED

kafka.server.epoch.LeaderEpochFileCacheTest > shouldIncreaseAndTrackEpochsAsFollowerReceivesManyMessages PASSED

kafka.server.epoch.LeaderEpochFileCacheTest > shouldTruncateIfMatchingEpochButEarlierStartingOffset STARTED

kafka.server.epoch.LeaderEpochFileCacheTest > shouldTruncateIfMatchingEpochButEarlierStartingOffset PASSED

kafka.server.epoch.LeaderEpochFileCacheTest > shouldNotOverwriteOffsetForALeaderEpochOnceItHasBeenAssigned STARTED

kafka.server.epoch.LeaderEpochFileCacheTest > shouldNotOverwriteOffsetForALeaderEpochOnceItHasBeenAssigned PASSED

kafka.server.epoch.LeaderEpochFileCacheTest > shouldNotOverwriteLogEndOffsetForALeaderEpochOnceItHasBeenAssigned STARTED

kafka.server.epoch.LeaderEpochFileCacheTest > shouldNotOverwriteLogEndOffsetForALeaderEpochOnceItHasBeenAssigned PASSED

kafka.server.epoch.LeaderEpochFileCacheTest > shouldReturnUndefinedOffsetIfUndefinedEpochRequested STARTED

kafka.server.epoch.LeaderEpochFileCacheTest > shouldReturnUndefinedOffsetIfUndefinedEpochRequested PASSED

kafka.server.epoch.LeaderEpochFileCacheTest > shouldIncreaseAndTrackEpochsAsLeadersChangeManyTimes STARTED

kafka.server.epoch.LeaderEpochFileCacheTest > shouldIncreaseAndTrackEpochsAsLeadersChangeManyTimes PASSED

kafka.server.epoch.LeaderEpochFileCacheTest > shouldReturnFirstEpochIfRequestedEpochLessThanFirstEpoch STARTED

kafka.server.epoch.LeaderEpochFileCacheTest > shouldReturnFirstEpochIfRequestedEpochLessThanFirstEpoch PASSED

kafka.server.epoch.LeaderEpochFileCacheTest > shouldSupportEpochsThatDoNotStartFromZero STARTED

kafka.server.epoch.LeaderEpochFileCacheTest > shouldSupportEpochsThatDoNotStartFromZero PASSED

kafka.server.epoch.LeaderEpochFileCacheTest > shouldReturnNextAvailableEpochIfThereIsNoExactEpochForTheOneRequested STARTED

kafka.server.epoch.LeaderEpochFileCacheTest > shouldReturnNextAvailableEpochIfThereIsNoExactEpochForTheOneRequested PASSED

kafka.server.epoch.LeaderEpochFileCacheTest > shouldAddEpochAndMessageOffsetToCache STARTED

kafka.server.epoch.LeaderEpochFileCacheTest > shouldAddEpochAndMessageOffsetToCache PASSED

kafka.server.epoch.LeaderEpochFileCacheTest > shouldDropEntriesOnEpochBoundaryWhenRemovingLatestEntries STARTED

kafka.server.epoch.LeaderEpochFileCacheTest > shouldDropEntriesOnEpochBoundaryWhenRemovingLatestEntries PASSED

kafka.server.epoch.LeaderEpochFileCacheTest > shouldUpdateSavedOffsetWhenOffsetToClearToIsBetweenEpochs STARTED

kafka.server.epoch.LeaderEpochFileCacheTest > shouldUpdateSavedOffsetWhenOffsetToClearToIsBetweenEpochs PASSED

kafka.server.epoch.LeaderEpochFileCacheTest > shouldNotResetEpochHistoryTailIfUndefinedPassed STARTED

kafka.server.epoch.LeaderEpochFileCacheTest > shouldNotResetEpochHistoryTailIfUndefinedPassed PASSED

kafka.server.epoch.LeaderEpochFileCacheTest > shouldReturnUnsupportedIfNoEpochRecorded STARTED

kafka.server.epoch.LeaderEpochFileCacheTest > shouldReturnUnsupportedIfNoEpochRecorded PASSED

kafka.server.epoch.LeaderEpochFileCacheTest > shouldReturnUnsupportedIfNoEpochRecordedAndUndefinedEpochRequested STARTED

kafka.server.epoch.LeaderEpochFileCacheTest > shouldReturnUnsupportedIfNoEpochRecordedAndUndefinedEpochRequested PASSED

kafka.server.epoch.LeaderEpochFileCacheTest > shouldRetainLatestEpochOnClearAllEarliest STARTED

kafka.server.epoch.LeaderEpochFileCacheTest > shouldRetainLatestEpochOnClearAllEarliest PASSED

kafka.server.epoch.LeaderEpochFileCacheTest > shouldPersistEpochsBetweenInstances STARTED

kafka.server.epoch.LeaderEpochFileCacheTest > shouldPersistEpochsBetweenInstances PASSED

kafka.server.epoch.LeaderEpochFileCacheTest > shouldEnforceMonotonicallyIncreasingEpochs STARTED

kafka.server.epoch.LeaderEpochFileCacheTest > shouldEnforceMonotonicallyIncreasingEpochs PASSED

kafka.server.epoch.LeaderEpochFileCacheTest > shouldNotClearAnythingIfOffsetToFirstOffset STARTED

kafka.server.epoch.LeaderEpochFileCacheTest > shouldNotClearAnythingIfOffsetToFirstOffset PASSED

kafka.server.epoch.LeaderEpochFileCacheTest > shouldGetFirstOffsetOfSubsequentEpochWhenOffsetRequestedForPreviousEpoch STARTED

kafka.server.epoch.LeaderEpochFileCacheTest > shouldGetFirstOffsetOfSubsequentEpochWhenOffsetRequestedForPreviousEpoch PASSED

kafka.server.epoch.LeaderEpochFileCacheTest > shouldEnforceOffsetsIncreaseMonotonically STARTED

kafka.server.epoch.LeaderEpochFileCacheTest > shouldEnforceOffsetsIncreaseMonotonically PASSED

kafka.server.epoch.LeaderEpochFileCacheTest > shouldUpdateOffsetBetweenEpochBoundariesOnClearEarliest2 STARTED

kafka.server.epoch.LeaderEpochFileCacheTest > shouldUpdateOffsetBetweenEpochBoundariesOnClearEarliest2 PASSED

kafka.server.epoch.LeaderEpochFileCacheTest > shouldClearEarliestOnEmptyCache STARTED

kafka.server.epoch.LeaderEpochFileCacheTest > shouldClearEarliestOnEmptyCache PASSED

kafka.server.epoch.LeaderEpochFileCacheTest > shouldPreserveResetOffsetOnClearEarliestIfOneExists STARTED

kafka.server.epoch.LeaderEpochFileCacheTest > shouldPreserveResetOffsetOnClearEarliestIfOneExists PASSED

kafka.server.epoch.LeaderEpochFileCacheTest > shouldUpdateOffsetBetweenEpochBoundariesOnClearEarliest STARTED

kafka.server.epoch.LeaderEpochFileCacheTest > shouldUpdateOffsetBetweenEpochBoundariesOnClearEarliest PASSED

kafka.server.epoch.LeaderEpochFileCacheTest > shouldReturnInvalidOffsetIfEpochIsRequestedWhichIsNotCurrentlyTracked STARTED

kafka.server.epoch.LeaderEpochFileCacheTest > shouldReturnInvalidOffsetIfEpochIsRequestedWhichIsNotCurrentlyTracked PASSED

kafka.server.epoch.LeaderEpochFileCacheTest > shouldEnforceMonotonicallyIncreasingStartOffsets STARTED

kafka.server.epoch.LeaderEpochFileCacheTest > shouldEnforceMonotonicallyIncreasingStartOffsets PASSED

kafka.server.epoch.LeaderEpochFileCacheTest > shouldFetchEndOffsetOfEmptyCache STARTED

kafka.server.epoch.LeaderEpochFileCacheTest > shouldFetchEndOffsetOfEmptyCache PASSED

kafka.server.epoch.LeaderEpochFileCacheTest > shouldRetainLatestEpochOnClearAllEarliestAndUpdateItsOffset STARTED

kafka.server.epoch.LeaderEpochFileCacheTest > shouldRetainLatestEpochOnClearAllEarliestAndUpdateItsOffset PASSED

kafka.server.epoch.LeaderEpochFileCacheTest > shouldClearAllEntries STARTED

kafka.server.epoch.LeaderEpochFileCacheTest > shouldClearAllEntries PASSED

kafka.server.epoch.LeaderEpochFileCacheTest > shouldClearLatestOnEmptyCache STARTED

kafka.server.epoch.LeaderEpochFileCacheTest > shouldClearLatestOnEmptyCache PASSED

kafka.server.epoch.LeaderEpochFileCacheTest > shouldNotResetEpochHistoryHeadIfUndefinedPassed STARTED

kafka.server.epoch.LeaderEpochFileCacheTest > shouldNotResetEpochHistoryHeadIfUndefinedPassed PASSED

kafka.server.epoch.EpochDrivenReplicationProtocolAcceptanceTest > shouldSurviveFastLeaderChange STARTED

kafka.server.epoch.EpochDrivenReplicationProtocolAcceptanceTest > shouldSurviveFastLeaderChange PASSED

kafka.server.epoch.EpochDrivenReplicationProtocolAcceptanceTest > offsetsShouldNotGoBackwards STARTED

kafka.server.epoch.EpochDrivenReplicationProtocolAcceptanceTest > offsetsShouldNotGoBackwards PASSED

kafka.server.epoch.EpochDrivenReplicationProtocolAcceptanceTest > shouldFollowLeaderEpochBasicWorkflow STARTED

kafka.server.epoch.EpochDrivenReplicationProtocolAcceptanceTest > shouldFollowLeaderEpochBasicWorkflow PASSED

kafka.server.epoch.EpochDrivenReplicationProtocolAcceptanceTest > shouldNotAllowDivergentLogs STARTED
ERROR: Could not install GRADLE_4_8_1_HOME
java.lang.NullPointerException
Build timed out (after 600 minutes). Marking the build as failed.
Build was aborted
[FINDBUGS] Collecting findbugs analysis files...
Setting GRADLE_4_8_1_HOME=/home/jenkins/tools/gradle/4.8.1

kafka.server.epoch.EpochDrivenReplicationProtocolAcceptanceTest > shouldNotAllowDivergentLogs SKIPPED

> Task :core:test FAILED
> Task :streams:upgrade-system-tests-0100:compileJava NO-SOURCE
> Task :streams:upgrade-system-tests-0100:processResources NO-SOURCE
> Task :streams:upgrade-system-tests-0100:classes UP-TO-DATE
> Task :streams:upgrade-system-tests-0100:checkstyleMain NO-SOURCE
> Task :streams:upgrade-system-tests-0100:compileTestJava
> Task :streams:upgrade-system-tests-0100:processTestResources NO-SOURCE
> Task :streams:upgrade-system-tests-0100:testClasses
> Task :streams:upgrade-system-tests-0100:checkstyleTest
> Task :streams:upgrade-system-tests-0100:spotbugsMain NO-SOURCE
> Task :streams:upgrade-system-tests-0100:test
> Task :streams:upgrade-system-tests-0101:compileJava NO-SOURCE
> Task :streams:upgrade-system-tests-0101:processResources NO-SOURCE
The message received from the daemon indicates that the daemon has disappeared.
Build request sent: Build{id=887ede3e-abe8-4e15-a40d-d12c742891fd, currentDir=<https://builds.apache.org/job/kafka-trunk-jdk8/ws/}>
Attempting to read last messages from the daemon log...
[FINDBUGS] Searching for all files in <https://builds.apache.org/job/kafka-trunk-jdk8/ws/> that match the pattern **/build/reports/*bugs/*.xml
[FINDBUGS] Parsing 17 files in <https://builds.apache.org/job/kafka-trunk-jdk8/ws/>
[FINDBUGS] Successfully parsed file <https://builds.apache.org/job/kafka-trunk-jdk8/ws/clients/build/reports/spotbugs/main.xml> with 0 unique warnings and 0 duplicates.
[FINDBUGS] Successfully parsed file <https://builds.apache.org/job/kafka-trunk-jdk8/ws/connect/api/build/reports/spotbugs/main.xml> with 0 unique warnings and 0 duplicates.
[FINDBUGS] Successfully parsed file <https://builds.apache.org/job/kafka-trunk-jdk8/ws/connect/basic-auth-extension/build/reports/spotbugs/main.xml> with 0 unique warnings and 0 duplicates.
[FINDBUGS] Successfully parsed file <https://builds.apache.org/job/kafka-trunk-jdk8/ws/connect/file/build/reports/spotbugs/main.xml> with 0 unique warnings and 0 duplicates.
[FINDBUGS] Successfully parsed file <https://builds.apache.org/job/kafka-trunk-jdk8/ws/connect/json/build/reports/spotbugs/main.xml> with 0 unique warnings and 0 duplicates.
[FINDBUGS] Successfully parsed file <https://builds.apache.org/job/kafka-trunk-jdk8/ws/connect/runtime/build/reports/spotbugs/main.xml> with 0 unique warnings and 0 duplicates.
[FINDBUGS] Successfully parsed file <https://builds.apache.org/job/kafka-trunk-jdk8/ws/connect/transforms/build/reports/spotbugs/main.xml> with 0 unique warnings and 0 duplicates.
[FINDBUGS] Successfully parsed file <https://builds.apache.org/job/kafka-trunk-jdk8/ws/core/build/reports/spotbugs/main.xml> with 0 unique warnings and 0 duplicates.
[FINDBUGS] Successfully parsed file <https://builds.apache.org/job/kafka-trunk-jdk8/ws/examples/build/reports/spotbugs/main.xml> with 0 unique warnings and 0 duplicates.
[FINDBUGS] Successfully parsed file <https://builds.apache.org/job/kafka-trunk-jdk8/ws/generator/build/reports/spotbugs/main.xml> with 0 unique warnings and 0 duplicates.
[FINDBUGS] Successfully parsed file <https://builds.apache.org/job/kafka-trunk-jdk8/ws/jmh-benchmarks/build/reports/spotbugs/main.xml> with 0 unique warnings and 0 duplicates.
[FINDBUGS] Successfully parsed file <https://builds.apache.org/job/kafka-trunk-jdk8/ws/log4j-appender/build/reports/spotbugs/main.xml> with 0 unique warnings and 0 duplicates.
[FINDBUGS] Successfully parsed file <https://builds.apache.org/job/kafka-trunk-jdk8/ws/streams/build/reports/spotbugs/main.xml> with 0 unique warnings and 0 duplicates.
[FINDBUGS] Successfully parsed file <https://builds.apache.org/job/kafka-trunk-jdk8/ws/streams/examples/build/reports/spotbugs/main.xml> with 0 unique warnings and 0 duplicates.
[FINDBUGS] Successfully parsed file <https://builds.apache.org/job/kafka-trunk-jdk8/ws/streams/streams-scala/build/reports/spotbugs/main.xml> with 0 unique warnings and 0 duplicates.
[FINDBUGS] Successfully parsed file <https://builds.apache.org/job/kafka-trunk-jdk8/ws/streams/test-utils/build/reports/spotbugs/main.xml> with 0 unique warnings and 0 duplicates.
[FINDBUGS] Successfully parsed file <https://builds.apache.org/job/kafka-trunk-jdk8/ws/tools/build/reports/spotbugs/main.xml> with 0 unique warnings and 0 duplicates.
Setting GRADLE_4_8_1_HOME=/home/jenkins/tools/gradle/4.8.1
No credentials specified
Setting GRADLE_4_8_1_HOME=/home/jenkins/tools/gradle/4.8.1
<Git Blamer> Using GitBlamer to create author and commit information for all warnings.
<Git Blamer> GIT_COMMIT=f8994897d30ef7508756dceb1d19171d6204f2a2, workspace=<https://builds.apache.org/job/kafka-trunk-jdk8/ws/>
[FINDBUGS] Computing warning deltas based on reference build #3796
Recording test results
Setting GRADLE_4_8_1_HOME=/home/jenkins/tools/gradle/4.8.1
Setting GRADLE_4_8_1_HOME=/home/jenkins/tools/gradle/4.8.1

Build failed in Jenkins: kafka-trunk-jdk8 #3798

Posted by Apache Jenkins Server <je...@builds.apache.org>.
See <https://builds.apache.org/job/kafka-trunk-jdk8/3798/display/redirect>

------------------------------------------
Started by an SCM change
[EnvInject] - Loading node environment variables.
Building remotely on H35 (ubuntu xenial) in workspace <https://builds.apache.org/job/kafka-trunk-jdk8/ws/>
[WS-CLEANUP] Deleting project workspace...
[WS-CLEANUP] Deferred wipeout is used...
[WS-CLEANUP] Done
No credentials specified
Cloning the remote Git repository
Cloning repository https://github.com/apache/kafka.git
 > git init <https://builds.apache.org/job/kafka-trunk-jdk8/ws/> # timeout=10
Fetching upstream changes from https://github.com/apache/kafka.git
 > git --version # timeout=10
 > git fetch --tags --progress https://github.com/apache/kafka.git +refs/heads/*:refs/remotes/origin/*
ERROR: Error cloning remote repo 'origin'
hudson.plugins.git.GitException: Command "git fetch --tags --progress https://github.com/apache/kafka.git +refs/heads/*:refs/remotes/origin/*" returned status code 128:
stdout: 
stderr: fatal: unable to access 'https://github.com/apache/kafka.git/': Could not resolve host: github.com

	at org.jenkinsci.plugins.gitclient.CliGitAPIImpl.launchCommandIn(CliGitAPIImpl.java:2042)
	at org.jenkinsci.plugins.gitclient.CliGitAPIImpl.launchCommandWithCredentials(CliGitAPIImpl.java:1761)
	at org.jenkinsci.plugins.gitclient.CliGitAPIImpl.access$400(CliGitAPIImpl.java:72)
	at org.jenkinsci.plugins.gitclient.CliGitAPIImpl$1.execute(CliGitAPIImpl.java:442)
	at org.jenkinsci.plugins.gitclient.CliGitAPIImpl$2.execute(CliGitAPIImpl.java:655)
	at org.jenkinsci.plugins.gitclient.RemoteGitImpl$CommandInvocationHandler$1.call(RemoteGitImpl.java:153)
	at org.jenkinsci.plugins.gitclient.RemoteGitImpl$CommandInvocationHandler$1.call(RemoteGitImpl.java:146)
	at hudson.remoting.UserRequest.perform(UserRequest.java:212)
	at hudson.remoting.UserRequest.perform(UserRequest.java:54)
	at hudson.remoting.Request$2.run(Request.java:369)
	at hudson.remoting.InterceptingExecutorService$1.call(InterceptingExecutorService.java:72)
	at java.util.concurrent.FutureTask.run(FutureTask.java:266)
	at java.util.concurrent.ThreadPoolExecutor.runWorker(ThreadPoolExecutor.java:1142)
	at java.util.concurrent.ThreadPoolExecutor$Worker.run(ThreadPoolExecutor.java:617)
	at java.lang.Thread.run(Thread.java:748)
	Suppressed: hudson.remoting.Channel$CallSiteStackTrace: Remote call to H35
		at hudson.remoting.Channel.attachCallSiteStackTrace(Channel.java:1741)
		at hudson.remoting.UserRequest$ExceptionResponse.retrieve(UserRequest.java:357)
		at hudson.remoting.Channel.call(Channel.java:955)
		at org.jenkinsci.plugins.gitclient.RemoteGitImpl$CommandInvocationHandler.execute(RemoteGitImpl.java:146)
		at sun.reflect.GeneratedMethodAccessor974.invoke(Unknown Source)
		at sun.reflect.DelegatingMethodAccessorImpl.invoke(DelegatingMethodAccessorImpl.java:43)
		at java.lang.reflect.Method.invoke(Method.java:498)
		at org.jenkinsci.plugins.gitclient.RemoteGitImpl$CommandInvocationHandler.invoke(RemoteGitImpl.java:132)
		at com.sun.proxy.$Proxy135.execute(Unknown Source)
		at hudson.plugins.git.GitSCM.retrieveChanges(GitSCM.java:1152)
		at hudson.plugins.git.GitSCM.checkout(GitSCM.java:1192)
		at hudson.scm.SCM.checkout(SCM.java:504)
		at hudson.model.AbstractProject.checkout(AbstractProject.java:1208)
		at hudson.model.AbstractBuild$AbstractBuildExecution.defaultCheckout(AbstractBuild.java:574)
		at jenkins.scm.SCMCheckoutStrategy.checkout(SCMCheckoutStrategy.java:86)
		at hudson.model.AbstractBuild$AbstractBuildExecution.run(AbstractBuild.java:499)
		at hudson.model.Run.execute(Run.java:1810)
		at hudson.model.FreeStyleBuild.run(FreeStyleBuild.java:43)
		at hudson.model.ResourceController.execute(ResourceController.java:97)
		at hudson.model.Executor.run(Executor.java:429)
ERROR: Error cloning remote repo 'origin'
Retrying after 10 seconds
No credentials specified
 > git rev-parse --is-inside-work-tree # timeout=10
Fetching changes from the remote Git repository
 > git config remote.origin.url https://github.com/apache/kafka.git # timeout=10
Fetching upstream changes from https://github.com/apache/kafka.git
 > git --version # timeout=10
 > git fetch --tags --progress https://github.com/apache/kafka.git +refs/heads/*:refs/remotes/origin/*
ERROR: Error fetching remote repo 'origin'
hudson.plugins.git.GitException: Failed to fetch from https://github.com/apache/kafka.git
	at hudson.plugins.git.GitSCM.fetchFrom(GitSCM.java:894)
	at hudson.plugins.git.GitSCM.retrieveChanges(GitSCM.java:1161)
	at hudson.plugins.git.GitSCM.checkout(GitSCM.java:1192)
	at hudson.scm.SCM.checkout(SCM.java:504)
	at hudson.model.AbstractProject.checkout(AbstractProject.java:1208)
	at hudson.model.AbstractBuild$AbstractBuildExecution.defaultCheckout(AbstractBuild.java:574)
	at jenkins.scm.SCMCheckoutStrategy.checkout(SCMCheckoutStrategy.java:86)
	at hudson.model.AbstractBuild$AbstractBuildExecution.run(AbstractBuild.java:499)
	at hudson.model.Run.execute(Run.java:1810)
	at hudson.model.FreeStyleBuild.run(FreeStyleBuild.java:43)
	at hudson.model.ResourceController.execute(ResourceController.java:97)
	at hudson.model.Executor.run(Executor.java:429)
Caused by: hudson.plugins.git.GitException: Command "git fetch --tags --progress https://github.com/apache/kafka.git +refs/heads/*:refs/remotes/origin/*" returned status code 128:
stdout: 
stderr: fatal: unable to access 'https://github.com/apache/kafka.git/': Could not resolve host: github.com

	at org.jenkinsci.plugins.gitclient.CliGitAPIImpl.launchCommandIn(CliGitAPIImpl.java:2042)
	at org.jenkinsci.plugins.gitclient.CliGitAPIImpl.launchCommandWithCredentials(CliGitAPIImpl.java:1761)
	at org.jenkinsci.plugins.gitclient.CliGitAPIImpl.access$400(CliGitAPIImpl.java:72)
	at org.jenkinsci.plugins.gitclient.CliGitAPIImpl$1.execute(CliGitAPIImpl.java:442)
	at org.jenkinsci.plugins.gitclient.RemoteGitImpl$CommandInvocationHandler$1.call(RemoteGitImpl.java:153)
	at org.jenkinsci.plugins.gitclient.RemoteGitImpl$CommandInvocationHandler$1.call(RemoteGitImpl.java:146)
	at hudson.remoting.UserRequest.perform(UserRequest.java:212)
	at hudson.remoting.UserRequest.perform(UserRequest.java:54)
	at hudson.remoting.Request$2.run(Request.java:369)
	at hudson.remoting.InterceptingExecutorService$1.call(InterceptingExecutorService.java:72)
	at java.util.concurrent.FutureTask.run(FutureTask.java:266)
	at java.util.concurrent.ThreadPoolExecutor.runWorker(ThreadPoolExecutor.java:1142)
	at java.util.concurrent.ThreadPoolExecutor$Worker.run(ThreadPoolExecutor.java:617)
	at java.lang.Thread.run(Thread.java:748)
	Suppressed: hudson.remoting.Channel$CallSiteStackTrace: Remote call to H35
		at hudson.remoting.Channel.attachCallSiteStackTrace(Channel.java:1741)
		at hudson.remoting.UserRequest$ExceptionResponse.retrieve(UserRequest.java:357)
		at hudson.remoting.Channel.call(Channel.java:955)
		at org.jenkinsci.plugins.gitclient.RemoteGitImpl$CommandInvocationHandler.execute(RemoteGitImpl.java:146)
		at sun.reflect.GeneratedMethodAccessor974.invoke(Unknown Source)
		at sun.reflect.DelegatingMethodAccessorImpl.invoke(DelegatingMethodAccessorImpl.java:43)
		at java.lang.reflect.Method.invoke(Method.java:498)
		at org.jenkinsci.plugins.gitclient.RemoteGitImpl$CommandInvocationHandler.invoke(RemoteGitImpl.java:132)
		at com.sun.proxy.$Proxy115.execute(Unknown Source)
		at hudson.plugins.git.GitSCM.fetchFrom(GitSCM.java:892)
		at hudson.plugins.git.GitSCM.retrieveChanges(GitSCM.java:1161)
		at hudson.plugins.git.GitSCM.checkout(GitSCM.java:1192)
		at hudson.scm.SCM.checkout(SCM.java:504)
		at hudson.model.AbstractProject.checkout(AbstractProject.java:1208)
		at hudson.model.AbstractBuild$AbstractBuildExecution.defaultCheckout(AbstractBuild.java:574)
		at jenkins.scm.SCMCheckoutStrategy.checkout(SCMCheckoutStrategy.java:86)
		at hudson.model.AbstractBuild$AbstractBuildExecution.run(AbstractBuild.java:499)
		at hudson.model.Run.execute(Run.java:1810)
		at hudson.model.FreeStyleBuild.run(FreeStyleBuild.java:43)
		at hudson.model.ResourceController.execute(ResourceController.java:97)
		at hudson.model.Executor.run(Executor.java:429)
ERROR: Error fetching remote repo 'origin'
Retrying after 10 seconds
No credentials specified
 > git rev-parse --is-inside-work-tree # timeout=10
Fetching changes from the remote Git repository
 > git config remote.origin.url https://github.com/apache/kafka.git # timeout=10
Fetching upstream changes from https://github.com/apache/kafka.git
 > git --version # timeout=10
 > git fetch --tags --progress https://github.com/apache/kafka.git +refs/heads/*:refs/remotes/origin/*
ERROR: Error fetching remote repo 'origin'
hudson.plugins.git.GitException: Failed to fetch from https://github.com/apache/kafka.git
	at hudson.plugins.git.GitSCM.fetchFrom(GitSCM.java:894)
	at hudson.plugins.git.GitSCM.retrieveChanges(GitSCM.java:1161)
	at hudson.plugins.git.GitSCM.checkout(GitSCM.java:1192)
	at hudson.scm.SCM.checkout(SCM.java:504)
	at hudson.model.AbstractProject.checkout(AbstractProject.java:1208)
	at hudson.model.AbstractBuild$AbstractBuildExecution.defaultCheckout(AbstractBuild.java:574)
	at jenkins.scm.SCMCheckoutStrategy.checkout(SCMCheckoutStrategy.java:86)
	at hudson.model.AbstractBuild$AbstractBuildExecution.run(AbstractBuild.java:499)
	at hudson.model.Run.execute(Run.java:1810)
	at hudson.model.FreeStyleBuild.run(FreeStyleBuild.java:43)
	at hudson.model.ResourceController.execute(ResourceController.java:97)
	at hudson.model.Executor.run(Executor.java:429)
Caused by: hudson.plugins.git.GitException: Command "git fetch --tags --progress https://github.com/apache/kafka.git +refs/heads/*:refs/remotes/origin/*" returned status code 128:
stdout: 
stderr: fatal: unable to access 'https://github.com/apache/kafka.git/': Could not resolve host: github.com

	at org.jenkinsci.plugins.gitclient.CliGitAPIImpl.launchCommandIn(CliGitAPIImpl.java:2042)
	at org.jenkinsci.plugins.gitclient.CliGitAPIImpl.launchCommandWithCredentials(CliGitAPIImpl.java:1761)
	at org.jenkinsci.plugins.gitclient.CliGitAPIImpl.access$400(CliGitAPIImpl.java:72)
	at org.jenkinsci.plugins.gitclient.CliGitAPIImpl$1.execute(CliGitAPIImpl.java:442)
	at org.jenkinsci.plugins.gitclient.RemoteGitImpl$CommandInvocationHandler$1.call(RemoteGitImpl.java:153)
	at org.jenkinsci.plugins.gitclient.RemoteGitImpl$CommandInvocationHandler$1.call(RemoteGitImpl.java:146)
	at hudson.remoting.UserRequest.perform(UserRequest.java:212)
	at hudson.remoting.UserRequest.perform(UserRequest.java:54)
	at hudson.remoting.Request$2.run(Request.java:369)
	at hudson.remoting.InterceptingExecutorService$1.call(InterceptingExecutorService.java:72)
	at java.util.concurrent.FutureTask.run(FutureTask.java:266)
	at java.util.concurrent.ThreadPoolExecutor.runWorker(ThreadPoolExecutor.java:1142)
	at java.util.concurrent.ThreadPoolExecutor$Worker.run(ThreadPoolExecutor.java:617)
	at java.lang.Thread.run(Thread.java:748)
	Suppressed: hudson.remoting.Channel$CallSiteStackTrace: Remote call to H35
		at hudson.remoting.Channel.attachCallSiteStackTrace(Channel.java:1741)
		at hudson.remoting.UserRequest$ExceptionResponse.retrieve(UserRequest.java:357)
		at hudson.remoting.Channel.call(Channel.java:955)
		at org.jenkinsci.plugins.gitclient.RemoteGitImpl$CommandInvocationHandler.execute(RemoteGitImpl.java:146)
		at sun.reflect.GeneratedMethodAccessor974.invoke(Unknown Source)
		at sun.reflect.DelegatingMethodAccessorImpl.invoke(DelegatingMethodAccessorImpl.java:43)
		at java.lang.reflect.Method.invoke(Method.java:498)
		at org.jenkinsci.plugins.gitclient.RemoteGitImpl$CommandInvocationHandler.invoke(RemoteGitImpl.java:132)
		at com.sun.proxy.$Proxy115.execute(Unknown Source)
		at hudson.plugins.git.GitSCM.fetchFrom(GitSCM.java:892)
		at hudson.plugins.git.GitSCM.retrieveChanges(GitSCM.java:1161)
		at hudson.plugins.git.GitSCM.checkout(GitSCM.java:1192)
		at hudson.scm.SCM.checkout(SCM.java:504)
		at hudson.model.AbstractProject.checkout(AbstractProject.java:1208)
		at hudson.model.AbstractBuild$AbstractBuildExecution.defaultCheckout(AbstractBuild.java:574)
		at jenkins.scm.SCMCheckoutStrategy.checkout(SCMCheckoutStrategy.java:86)
		at hudson.model.AbstractBuild$AbstractBuildExecution.run(AbstractBuild.java:499)
		at hudson.model.Run.execute(Run.java:1810)
		at hudson.model.FreeStyleBuild.run(FreeStyleBuild.java:43)
		at hudson.model.ResourceController.execute(ResourceController.java:97)
		at hudson.model.Executor.run(Executor.java:429)
ERROR: Error fetching remote repo 'origin'
[FINDBUGS] Collecting findbugs analysis files...
[FINDBUGS] Searching for all files in <https://builds.apache.org/job/kafka-trunk-jdk8/ws/> that match the pattern **/build/reports/*bugs/*.xml
[FINDBUGS] No files found. Configuration error?
No credentials specified
<Git Blamer> Using GitBlamer to create author and commit information for all warnings.
<Git Blamer> GIT_COMMIT=53b10a37a42769b0c1b91c3a66fbe7f60917cab5, workspace=<https://builds.apache.org/job/kafka-trunk-jdk8/ws/>
[FINDBUGS] Computing warning deltas based on reference build #3796
Recording test results
ERROR: Step ?Publish JUnit test result report? failed: No test report files were found. Configuration error?