You are viewing a plain text version of this content. The canonical link for it is here.
Posted to dev@zookeeper.apache.org by Apache Jenkins Server <je...@builds.apache.org> on 2017/02/13 18:55:53 UTC

ZooKeeper_branch34_solaris - Build # 1471 - Still Failing

See https://builds.apache.org/job/ZooKeeper_branch34_solaris/1471/

###################################################################################
########################## LAST 60 LINES OF THE CONSOLE ###########################
[...truncated 195458 lines...]
    [junit] 2017-02-13 18:57:17,490 [myid:] - INFO  [main:PrepRequestProcessor@764] - Shutting down
    [junit] 2017-02-13 18:57:17,490 [myid:] - INFO  [main:SyncRequestProcessor@208] - Shutting down
    [junit] 2017-02-13 18:57:17,490 [myid:] - INFO  [ProcessThread(sid:0 cport:11221)::PrepRequestProcessor@143] - PrepRequestProcessor exited loop!
    [junit] 2017-02-13 18:57:17,490 [myid:] - INFO  [SyncThread:0:SyncRequestProcessor@186] - SyncRequestProcessor exited!
    [junit] 2017-02-13 18:57:17,490 [myid:] - INFO  [main:FinalRequestProcessor@402] - shutdown of request processor complete
    [junit] 2017-02-13 18:57:17,491 [myid:] - INFO  [main:FourLetterWordMain@62] - connecting to 127.0.0.1 11221
    [junit] 2017-02-13 18:57:17,491 [myid:] - INFO  [main:JMXEnv@147] - ensureOnly:[]
    [junit] 2017-02-13 18:57:17,492 [myid:] - INFO  [main:ClientBase@445] - STARTING server
    [junit] 2017-02-13 18:57:17,492 [myid:] - INFO  [main:ClientBase@366] - CREATING server instance 127.0.0.1:11221
    [junit] 2017-02-13 18:57:17,492 [myid:] - INFO  [main:NIOServerCnxnFactory@89] - binding to port 0.0.0.0/0.0.0.0:11221
    [junit] 2017-02-13 18:57:17,493 [myid:] - INFO  [main:ClientBase@341] - STARTING server instance 127.0.0.1:11221
    [junit] 2017-02-13 18:57:17,493 [myid:] - INFO  [main:ZooKeeperServer@173] - Created server with tickTime 3000 minSessionTimeout 6000 maxSessionTimeout 60000 datadir /zonestorage/hudson_solaris/home/hudson/hudson-slave/workspace/ZooKeeper_branch34_solaris/build/test/tmp/test6694551422313537779.junit.dir/version-2 snapdir /zonestorage/hudson_solaris/home/hudson/hudson-slave/workspace/ZooKeeper_branch34_solaris/build/test/tmp/test6694551422313537779.junit.dir/version-2
    [junit] 2017-02-13 18:57:17,495 [myid:] - ERROR [main:ZooKeeperServer@472] - ZKShutdownHandler is not registered, so ZooKeeper server won't take any action on ERROR or SHUTDOWN server state changes
    [junit] 2017-02-13 18:57:17,496 [myid:] - INFO  [main:FourLetterWordMain@62] - connecting to 127.0.0.1 11221
    [junit] 2017-02-13 18:57:17,496 [myid:] - INFO  [NIOServerCxn.Factory:0.0.0.0/0.0.0.0:11221:NIOServerCnxnFactory@192] - Accepted socket connection from /127.0.0.1:58341
    [junit] 2017-02-13 18:57:17,496 [myid:] - INFO  [NIOServerCxn.Factory:0.0.0.0/0.0.0.0:11221:NIOServerCnxn@838] - Processing stat command from /127.0.0.1:58341
    [junit] 2017-02-13 18:57:17,496 [myid:] - INFO  [Thread-5:NIOServerCnxn$StatCommand@674] - Stat command output
    [junit] 2017-02-13 18:57:17,497 [myid:] - INFO  [Thread-5:NIOServerCnxn@1019] - Closed socket connection for client /127.0.0.1:58341 (no session established for client)
    [junit] 2017-02-13 18:57:17,497 [myid:] - INFO  [main:JMXEnv@230] - ensureParent:[InMemoryDataTree, StandaloneServer_port]
    [junit] 2017-02-13 18:57:17,498 [myid:] - INFO  [main:JMXEnv@247] - expect:InMemoryDataTree
    [junit] 2017-02-13 18:57:17,498 [myid:] - INFO  [main:JMXEnv@251] - found:InMemoryDataTree org.apache.ZooKeeperService:name0=StandaloneServer_port11221,name1=InMemoryDataTree
    [junit] 2017-02-13 18:57:17,498 [myid:] - INFO  [main:JMXEnv@247] - expect:StandaloneServer_port
    [junit] 2017-02-13 18:57:17,499 [myid:] - INFO  [main:JMXEnv@251] - found:StandaloneServer_port org.apache.ZooKeeperService:name0=StandaloneServer_port11221
    [junit] 2017-02-13 18:57:17,499 [myid:] - INFO  [main:JUnit4ZKTestRunner$LoggedInvokeMethod@58] - Memory used 9200
    [junit] 2017-02-13 18:57:17,499 [myid:] - INFO  [main:JUnit4ZKTestRunner$LoggedInvokeMethod@63] - Number of threads 20
    [junit] 2017-02-13 18:57:17,499 [myid:] - INFO  [main:JUnit4ZKTestRunner$LoggedInvokeMethod@78] - FINISHED TEST METHOD testQuota
    [junit] 2017-02-13 18:57:17,499 [myid:] - INFO  [main:ClientBase@522] - tearDown starting
    [junit] 2017-02-13 18:57:17,581 [myid:] - INFO  [main:ZooKeeper@684] - Session: 0x15a38d60f0d0000 closed
    [junit] 2017-02-13 18:57:17,581 [myid:] - INFO  [main-EventThread:ClientCnxn$EventThread@519] - EventThread shut down for session: 0x15a38d60f0d0000
    [junit] 2017-02-13 18:57:17,582 [myid:] - INFO  [main:ClientBase@492] - STOPPING server
    [junit] 2017-02-13 18:57:17,582 [myid:] - INFO  [main:ZooKeeperServer@497] - shutting down
    [junit] 2017-02-13 18:57:17,582 [myid:] - ERROR [main:ZooKeeperServer@472] - ZKShutdownHandler is not registered, so ZooKeeper server won't take any action on ERROR or SHUTDOWN server state changes
    [junit] 2017-02-13 18:57:17,583 [myid:] - INFO  [main:SessionTrackerImpl@225] - Shutting down
    [junit] 2017-02-13 18:57:17,583 [myid:] - INFO  [main:PrepRequestProcessor@764] - Shutting down
    [junit] 2017-02-13 18:57:17,583 [myid:] - INFO  [main:SyncRequestProcessor@208] - Shutting down
    [junit] 2017-02-13 18:57:17,583 [myid:] - INFO  [ProcessThread(sid:0 cport:11221)::PrepRequestProcessor@143] - PrepRequestProcessor exited loop!
    [junit] 2017-02-13 18:57:17,583 [myid:] - INFO  [SyncThread:0:SyncRequestProcessor@186] - SyncRequestProcessor exited!
    [junit] 2017-02-13 18:57:17,584 [myid:] - INFO  [main:FinalRequestProcessor@402] - shutdown of request processor complete
    [junit] 2017-02-13 18:57:17,584 [myid:] - INFO  [main:FourLetterWordMain@62] - connecting to 127.0.0.1 11221
    [junit] 2017-02-13 18:57:17,584 [myid:] - INFO  [main:JMXEnv@147] - ensureOnly:[]
    [junit] 2017-02-13 18:57:17,588 [myid:] - INFO  [main:ClientBase@547] - fdcount after test is: 95 at start it was 81
    [junit] 2017-02-13 18:57:17,588 [myid:] - INFO  [main:ClientBase@549] - sleeping for 20 secs
    [junit] 2017-02-13 18:57:17,589 [myid:] - INFO  [main:ZKTestCase$1@65] - SUCCEEDED testQuota
    [junit] 2017-02-13 18:57:17,589 [myid:] - INFO  [main:ZKTestCase$1@60] - FINISHED testQuota
    [junit] Tests run: 1, Failures: 0, Errors: 0, Time elapsed: 0.913 sec

fail.build.on.test.failure:

BUILD FAILED
/zonestorage/hudson_solaris/home/hudson/hudson-slave/workspace/ZooKeeper_branch34_solaris/build.xml:1328: The following error occurred while executing this line:
/zonestorage/hudson_solaris/home/hudson/hudson-slave/workspace/ZooKeeper_branch34_solaris/build.xml:1331: Tests failed!

Total time: 31 minutes 33 seconds
Build step 'Invoke Ant' marked build as failure
[locks-and-latches] Releasing all the locks
[locks-and-latches] All the locks released
Recording test results
Email was triggered for: Failure - Any
Sending email for trigger: Failure - Any



###################################################################################
############################## FAILED TESTS (if any) ##############################
1 tests failed.
FAILED:  org.apache.zookeeper.server.quorum.auth.QuorumKerberosAuthTest.testValidCredentials

Error Message:
waiting for server 0 being up

Stack Trace:
junit.framework.AssertionFailedError: waiting for server 0 being up
	at org.apache.zookeeper.server.quorum.auth.QuorumAuthTestBase.startQuorum(QuorumAuthTestBase.java:74)
	at org.apache.zookeeper.server.quorum.auth.QuorumKerberosAuthTest.testValidCredentials(QuorumKerberosAuthTest.java:101)
	at org.apache.zookeeper.JUnit4ZKTestRunner$LoggedInvokeMethod.evaluate(JUnit4ZKTestRunner.java:55)



ZooKeeper_branch34_solaris - Build # 1488 - Still Failing

Posted by Apache Jenkins Server <je...@builds.apache.org>.
See https://builds.apache.org/job/ZooKeeper_branch34_solaris/1488/

###################################################################################
########################## LAST 60 LINES OF THE CONSOLE ###########################
[...truncated 25.25 MB...]
    [junit] 2017-02-27 13:57:26,376 [myid:] - INFO  [main:PrepRequestProcessor@764] - Shutting down
    [junit] 2017-02-27 13:57:26,376 [myid:] - INFO  [main:SyncRequestProcessor@208] - Shutting down
    [junit] 2017-02-27 13:57:26,376 [myid:] - INFO  [ProcessThread(sid:0 cport:11221)::PrepRequestProcessor@143] - PrepRequestProcessor exited loop!
    [junit] 2017-02-27 13:57:26,376 [myid:] - INFO  [SyncThread:0:SyncRequestProcessor@186] - SyncRequestProcessor exited!
    [junit] 2017-02-27 13:57:26,376 [myid:] - INFO  [main:FinalRequestProcessor@402] - shutdown of request processor complete
    [junit] 2017-02-27 13:57:26,377 [myid:] - INFO  [main:FourLetterWordMain@62] - connecting to 127.0.0.1 11221
    [junit] 2017-02-27 13:57:26,377 [myid:] - INFO  [main:JMXEnv@147] - ensureOnly:[]
    [junit] 2017-02-27 13:57:26,378 [myid:] - INFO  [main:ClientBase@445] - STARTING server
    [junit] 2017-02-27 13:57:26,378 [myid:] - INFO  [main:ClientBase@366] - CREATING server instance 127.0.0.1:11221
    [junit] 2017-02-27 13:57:26,378 [myid:] - INFO  [main:NIOServerCnxnFactory@89] - binding to port 0.0.0.0/0.0.0.0:11221
    [junit] 2017-02-27 13:57:26,379 [myid:] - INFO  [main:ClientBase@341] - STARTING server instance 127.0.0.1:11221
    [junit] 2017-02-27 13:57:26,379 [myid:] - INFO  [main:ZooKeeperServer@173] - Created server with tickTime 3000 minSessionTimeout 6000 maxSessionTimeout 60000 datadir /zonestorage/hudson_solaris/home/hudson/hudson-slave/workspace/ZooKeeper_branch34_solaris/build/test/tmp/test7937223335647959738.junit.dir/version-2 snapdir /zonestorage/hudson_solaris/home/hudson/hudson-slave/workspace/ZooKeeper_branch34_solaris/build/test/tmp/test7937223335647959738.junit.dir/version-2
    [junit] 2017-02-27 13:57:26,381 [myid:] - ERROR [main:ZooKeeperServer@472] - ZKShutdownHandler is not registered, so ZooKeeper server won't take any action on ERROR or SHUTDOWN server state changes
    [junit] 2017-02-27 13:57:26,381 [myid:] - INFO  [main:FourLetterWordMain@62] - connecting to 127.0.0.1 11221
    [junit] 2017-02-27 13:57:26,382 [myid:] - INFO  [NIOServerCxn.Factory:0.0.0.0/0.0.0.0:11221:NIOServerCnxnFactory@192] - Accepted socket connection from /127.0.0.1:63314
    [junit] 2017-02-27 13:57:26,382 [myid:] - INFO  [NIOServerCxn.Factory:0.0.0.0/0.0.0.0:11221:NIOServerCnxn@838] - Processing stat command from /127.0.0.1:63314
    [junit] 2017-02-27 13:57:26,382 [myid:] - INFO  [Thread-5:NIOServerCnxn$StatCommand@674] - Stat command output
    [junit] 2017-02-27 13:57:26,383 [myid:] - INFO  [Thread-5:NIOServerCnxn@1019] - Closed socket connection for client /127.0.0.1:63314 (no session established for client)
    [junit] 2017-02-27 13:57:26,383 [myid:] - INFO  [main:JMXEnv@230] - ensureParent:[InMemoryDataTree, StandaloneServer_port]
    [junit] 2017-02-27 13:57:26,384 [myid:] - INFO  [main:JMXEnv@247] - expect:InMemoryDataTree
    [junit] 2017-02-27 13:57:26,384 [myid:] - INFO  [main:JMXEnv@251] - found:InMemoryDataTree org.apache.ZooKeeperService:name0=StandaloneServer_port11221,name1=InMemoryDataTree
    [junit] 2017-02-27 13:57:26,384 [myid:] - INFO  [main:JMXEnv@247] - expect:StandaloneServer_port
    [junit] 2017-02-27 13:57:26,384 [myid:] - INFO  [main:JMXEnv@251] - found:StandaloneServer_port org.apache.ZooKeeperService:name0=StandaloneServer_port11221
    [junit] 2017-02-27 13:57:26,385 [myid:] - INFO  [main:JUnit4ZKTestRunner$LoggedInvokeMethod@58] - Memory used 9193
    [junit] 2017-02-27 13:57:26,385 [myid:] - INFO  [main:JUnit4ZKTestRunner$LoggedInvokeMethod@63] - Number of threads 20
    [junit] 2017-02-27 13:57:26,385 [myid:] - INFO  [main:JUnit4ZKTestRunner$LoggedInvokeMethod@78] - FINISHED TEST METHOD testQuota
    [junit] 2017-02-27 13:57:26,385 [myid:] - INFO  [main:ClientBase@522] - tearDown starting
    [junit] 2017-02-27 13:57:26,462 [myid:] - INFO  [main:ZooKeeper@684] - Session: 0x15a7fdc917e0000 closed
    [junit] 2017-02-27 13:57:26,462 [myid:] - INFO  [main-EventThread:ClientCnxn$EventThread@519] - EventThread shut down for session: 0x15a7fdc917e0000
    [junit] 2017-02-27 13:57:26,462 [myid:] - INFO  [main:ClientBase@492] - STOPPING server
    [junit] 2017-02-27 13:57:26,463 [myid:] - INFO  [main:ZooKeeperServer@505] - shutting down
    [junit] 2017-02-27 13:57:26,463 [myid:] - ERROR [main:ZooKeeperServer@472] - ZKShutdownHandler is not registered, so ZooKeeper server won't take any action on ERROR or SHUTDOWN server state changes
    [junit] 2017-02-27 13:57:26,463 [myid:] - INFO  [main:SessionTrackerImpl@225] - Shutting down
    [junit] 2017-02-27 13:57:26,463 [myid:] - INFO  [main:PrepRequestProcessor@764] - Shutting down
    [junit] 2017-02-27 13:57:26,463 [myid:] - INFO  [main:SyncRequestProcessor@208] - Shutting down
    [junit] 2017-02-27 13:57:26,464 [myid:] - INFO  [ProcessThread(sid:0 cport:11221)::PrepRequestProcessor@143] - PrepRequestProcessor exited loop!
    [junit] 2017-02-27 13:57:26,464 [myid:] - INFO  [SyncThread:0:SyncRequestProcessor@186] - SyncRequestProcessor exited!
    [junit] 2017-02-27 13:57:26,464 [myid:] - INFO  [main:FinalRequestProcessor@402] - shutdown of request processor complete
    [junit] 2017-02-27 13:57:26,464 [myid:] - INFO  [main:FourLetterWordMain@62] - connecting to 127.0.0.1 11221
    [junit] 2017-02-27 13:57:26,465 [myid:] - INFO  [main:JMXEnv@147] - ensureOnly:[]
    [junit] 2017-02-27 13:57:26,467 [myid:] - INFO  [main:ClientBase@547] - fdcount after test is: 95 at start it was 81
    [junit] 2017-02-27 13:57:26,467 [myid:] - INFO  [main:ClientBase@549] - sleeping for 20 secs
    [junit] 2017-02-27 13:57:26,468 [myid:] - INFO  [main:ZKTestCase$1@65] - SUCCEEDED testQuota
    [junit] 2017-02-27 13:57:26,468 [myid:] - INFO  [main:ZKTestCase$1@60] - FINISHED testQuota
    [junit] Tests run: 1, Failures: 0, Errors: 0, Time elapsed: 0.829 sec

fail.build.on.test.failure:

BUILD FAILED
/zonestorage/hudson_solaris/home/hudson/hudson-slave/workspace/ZooKeeper_branch34_solaris/build.xml:1328: The following error occurred while executing this line:
/zonestorage/hudson_solaris/home/hudson/hudson-slave/workspace/ZooKeeper_branch34_solaris/build.xml:1331: Tests failed!

Total time: 31 minutes 3 seconds
Build step 'Invoke Ant' marked build as failure
[locks-and-latches] Releasing all the locks
[locks-and-latches] All the locks released
Recording test results
Email was triggered for: Failure - Any
Sending email for trigger: Failure - Any



###################################################################################
############################## FAILED TESTS (if any) ##############################
2 tests failed.
FAILED:  org.apache.zookeeper.server.quorum.auth.QuorumKerberosHostBasedAuthTest.testValidCredentials

Error Message:
waiting for server 0 being up

Stack Trace:
junit.framework.AssertionFailedError: waiting for server 0 being up
	at org.apache.zookeeper.server.quorum.auth.QuorumAuthTestBase.startQuorum(QuorumAuthTestBase.java:74)
	at org.apache.zookeeper.server.quorum.auth.QuorumKerberosHostBasedAuthTest.testValidCredentials(QuorumKerberosHostBasedAuthTest.java:125)
	at org.apache.zookeeper.JUnit4ZKTestRunner$LoggedInvokeMethod.evaluate(JUnit4ZKTestRunner.java:55)


FAILED:  org.apache.zookeeper.server.quorum.auth.QuorumKerberosAuthTest.testValidCredentials

Error Message:
waiting for server 1 being up

Stack Trace:
junit.framework.AssertionFailedError: waiting for server 1 being up
	at org.apache.zookeeper.server.quorum.auth.QuorumAuthTestBase.startQuorum(QuorumAuthTestBase.java:74)
	at org.apache.zookeeper.server.quorum.auth.QuorumKerberosAuthTest.testValidCredentials(QuorumKerberosAuthTest.java:101)
	at org.apache.zookeeper.JUnit4ZKTestRunner$LoggedInvokeMethod.evaluate(JUnit4ZKTestRunner.java:55)



ZooKeeper_branch34_solaris - Build # 1487 - Still Failing

Posted by Apache Jenkins Server <je...@builds.apache.org>.
See https://builds.apache.org/job/ZooKeeper_branch34_solaris/1487/

###################################################################################
########################## LAST 60 LINES OF THE CONSOLE ###########################
[...truncated 25.39 MB...]
    [junit] 2017-02-27 06:58:10,938 [myid:] - INFO  [main:PrepRequestProcessor@764] - Shutting down
    [junit] 2017-02-27 06:58:10,938 [myid:] - INFO  [main:SyncRequestProcessor@208] - Shutting down
    [junit] 2017-02-27 06:58:10,938 [myid:] - INFO  [ProcessThread(sid:0 cport:11221)::PrepRequestProcessor@143] - PrepRequestProcessor exited loop!
    [junit] 2017-02-27 06:58:10,939 [myid:] - INFO  [SyncThread:0:SyncRequestProcessor@186] - SyncRequestProcessor exited!
    [junit] 2017-02-27 06:58:10,939 [myid:] - INFO  [main:FinalRequestProcessor@402] - shutdown of request processor complete
    [junit] 2017-02-27 06:58:10,939 [myid:] - INFO  [main:FourLetterWordMain@62] - connecting to 127.0.0.1 11221
    [junit] 2017-02-27 06:58:10,939 [myid:] - INFO  [main:JMXEnv@147] - ensureOnly:[]
    [junit] 2017-02-27 06:58:10,940 [myid:] - INFO  [main:ClientBase@445] - STARTING server
    [junit] 2017-02-27 06:58:10,940 [myid:] - INFO  [main:ClientBase@366] - CREATING server instance 127.0.0.1:11221
    [junit] 2017-02-27 06:58:10,941 [myid:] - INFO  [main:NIOServerCnxnFactory@89] - binding to port 0.0.0.0/0.0.0.0:11221
    [junit] 2017-02-27 06:58:10,941 [myid:] - INFO  [main:ClientBase@341] - STARTING server instance 127.0.0.1:11221
    [junit] 2017-02-27 06:58:10,941 [myid:] - INFO  [main:ZooKeeperServer@173] - Created server with tickTime 3000 minSessionTimeout 6000 maxSessionTimeout 60000 datadir /zonestorage/hudson_solaris/home/hudson/hudson-slave/workspace/ZooKeeper_branch34_solaris/build/test/tmp/test1142776102585266325.junit.dir/version-2 snapdir /zonestorage/hudson_solaris/home/hudson/hudson-slave/workspace/ZooKeeper_branch34_solaris/build/test/tmp/test1142776102585266325.junit.dir/version-2
    [junit] 2017-02-27 06:58:10,944 [myid:] - ERROR [main:ZooKeeperServer@472] - ZKShutdownHandler is not registered, so ZooKeeper server won't take any action on ERROR or SHUTDOWN server state changes
    [junit] 2017-02-27 06:58:10,944 [myid:] - INFO  [main:FourLetterWordMain@62] - connecting to 127.0.0.1 11221
    [junit] 2017-02-27 06:58:10,945 [myid:] - INFO  [NIOServerCxn.Factory:0.0.0.0/0.0.0.0:11221:NIOServerCnxnFactory@192] - Accepted socket connection from /127.0.0.1:63042
    [junit] 2017-02-27 06:58:10,945 [myid:] - INFO  [NIOServerCxn.Factory:0.0.0.0/0.0.0.0:11221:NIOServerCnxn@838] - Processing stat command from /127.0.0.1:63042
    [junit] 2017-02-27 06:58:10,945 [myid:] - INFO  [Thread-5:NIOServerCnxn$StatCommand@674] - Stat command output
    [junit] 2017-02-27 06:58:10,946 [myid:] - INFO  [Thread-5:NIOServerCnxn@1019] - Closed socket connection for client /127.0.0.1:63042 (no session established for client)
    [junit] 2017-02-27 06:58:10,946 [myid:] - INFO  [main:JMXEnv@230] - ensureParent:[InMemoryDataTree, StandaloneServer_port]
    [junit] 2017-02-27 06:58:10,947 [myid:] - INFO  [main:JMXEnv@247] - expect:InMemoryDataTree
    [junit] 2017-02-27 06:58:10,947 [myid:] - INFO  [main:JMXEnv@251] - found:InMemoryDataTree org.apache.ZooKeeperService:name0=StandaloneServer_port11221,name1=InMemoryDataTree
    [junit] 2017-02-27 06:58:10,947 [myid:] - INFO  [main:JMXEnv@247] - expect:StandaloneServer_port
    [junit] 2017-02-27 06:58:10,948 [myid:] - INFO  [main:JMXEnv@251] - found:StandaloneServer_port org.apache.ZooKeeperService:name0=StandaloneServer_port11221
    [junit] 2017-02-27 06:58:10,948 [myid:] - INFO  [main:JUnit4ZKTestRunner$LoggedInvokeMethod@58] - Memory used 8862
    [junit] 2017-02-27 06:58:10,948 [myid:] - INFO  [main:JUnit4ZKTestRunner$LoggedInvokeMethod@63] - Number of threads 20
    [junit] 2017-02-27 06:58:10,948 [myid:] - INFO  [main:JUnit4ZKTestRunner$LoggedInvokeMethod@78] - FINISHED TEST METHOD testQuota
    [junit] 2017-02-27 06:58:10,948 [myid:] - INFO  [main:ClientBase@522] - tearDown starting
    [junit] 2017-02-27 06:58:11,032 [myid:] - INFO  [main:ZooKeeper@684] - Session: 0x15a7e5cbae60000 closed
    [junit] 2017-02-27 06:58:11,032 [myid:] - INFO  [main-EventThread:ClientCnxn$EventThread@519] - EventThread shut down for session: 0x15a7e5cbae60000
    [junit] 2017-02-27 06:58:11,032 [myid:] - INFO  [main:ClientBase@492] - STOPPING server
    [junit] 2017-02-27 06:58:11,033 [myid:] - INFO  [main:ZooKeeperServer@505] - shutting down
    [junit] 2017-02-27 06:58:11,033 [myid:] - ERROR [main:ZooKeeperServer@472] - ZKShutdownHandler is not registered, so ZooKeeper server won't take any action on ERROR or SHUTDOWN server state changes
    [junit] 2017-02-27 06:58:11,033 [myid:] - INFO  [main:SessionTrackerImpl@225] - Shutting down
    [junit] 2017-02-27 06:58:11,033 [myid:] - INFO  [main:PrepRequestProcessor@764] - Shutting down
    [junit] 2017-02-27 06:58:11,033 [myid:] - INFO  [main:SyncRequestProcessor@208] - Shutting down
    [junit] 2017-02-27 06:58:11,033 [myid:] - INFO  [ProcessThread(sid:0 cport:11221)::PrepRequestProcessor@143] - PrepRequestProcessor exited loop!
    [junit] 2017-02-27 06:58:11,034 [myid:] - INFO  [SyncThread:0:SyncRequestProcessor@186] - SyncRequestProcessor exited!
    [junit] 2017-02-27 06:58:11,034 [myid:] - INFO  [main:FinalRequestProcessor@402] - shutdown of request processor complete
    [junit] 2017-02-27 06:58:11,034 [myid:] - INFO  [main:FourLetterWordMain@62] - connecting to 127.0.0.1 11221
    [junit] 2017-02-27 06:58:11,035 [myid:] - INFO  [main:JMXEnv@147] - ensureOnly:[]
    [junit] 2017-02-27 06:58:11,038 [myid:] - INFO  [main:ClientBase@547] - fdcount after test is: 95 at start it was 81
    [junit] 2017-02-27 06:58:11,038 [myid:] - INFO  [main:ClientBase@549] - sleeping for 20 secs
    [junit] 2017-02-27 06:58:11,039 [myid:] - INFO  [main:ZKTestCase$1@65] - SUCCEEDED testQuota
    [junit] 2017-02-27 06:58:11,039 [myid:] - INFO  [main:ZKTestCase$1@60] - FINISHED testQuota
    [junit] Tests run: 1, Failures: 0, Errors: 0, Time elapsed: 1.151 sec

fail.build.on.test.failure:

BUILD FAILED
/zonestorage/hudson_solaris/home/hudson/hudson-slave/workspace/ZooKeeper_branch34_solaris/build.xml:1328: The following error occurred while executing this line:
/zonestorage/hudson_solaris/home/hudson/hudson-slave/workspace/ZooKeeper_branch34_solaris/build.xml:1331: Tests failed!

Total time: 31 minutes 50 seconds
Build step 'Invoke Ant' marked build as failure
[locks-and-latches] Releasing all the locks
[locks-and-latches] All the locks released
Recording test results
Email was triggered for: Failure - Any
Sending email for trigger: Failure - Any



###################################################################################
############################## FAILED TESTS (if any) ##############################
1 tests failed.
FAILED:  org.apache.zookeeper.server.quorum.auth.QuorumKerberosAuthTest.testValidCredentials

Error Message:
waiting for server 0 being up

Stack Trace:
junit.framework.AssertionFailedError: waiting for server 0 being up
	at org.apache.zookeeper.server.quorum.auth.QuorumAuthTestBase.startQuorum(QuorumAuthTestBase.java:74)
	at org.apache.zookeeper.server.quorum.auth.QuorumKerberosAuthTest.testValidCredentials(QuorumKerberosAuthTest.java:101)
	at org.apache.zookeeper.JUnit4ZKTestRunner$LoggedInvokeMethod.evaluate(JUnit4ZKTestRunner.java:55)



ZooKeeper_branch34_solaris - Build # 1486 - Still Failing

Posted by Apache Jenkins Server <je...@builds.apache.org>.
See https://builds.apache.org/job/ZooKeeper_branch34_solaris/1486/

###################################################################################
########################## LAST 60 LINES OF THE CONSOLE ###########################
[...truncated 25.32 MB...]
    [junit] 2017-02-26 13:58:39,347 [myid:] - INFO  [main:PrepRequestProcessor@764] - Shutting down
    [junit] 2017-02-26 13:58:39,347 [myid:] - INFO  [main:SyncRequestProcessor@208] - Shutting down
    [junit] 2017-02-26 13:58:39,347 [myid:] - INFO  [ProcessThread(sid:0 cport:11221)::PrepRequestProcessor@143] - PrepRequestProcessor exited loop!
    [junit] 2017-02-26 13:58:39,347 [myid:] - INFO  [SyncThread:0:SyncRequestProcessor@186] - SyncRequestProcessor exited!
    [junit] 2017-02-26 13:58:39,347 [myid:] - INFO  [main:FinalRequestProcessor@402] - shutdown of request processor complete
    [junit] 2017-02-26 13:58:39,348 [myid:] - INFO  [main:FourLetterWordMain@62] - connecting to 127.0.0.1 11221
    [junit] 2017-02-26 13:58:39,348 [myid:] - INFO  [main:JMXEnv@147] - ensureOnly:[]
    [junit] 2017-02-26 13:58:39,349 [myid:] - INFO  [main:ClientBase@445] - STARTING server
    [junit] 2017-02-26 13:58:39,349 [myid:] - INFO  [main:ClientBase@366] - CREATING server instance 127.0.0.1:11221
    [junit] 2017-02-26 13:58:39,349 [myid:] - INFO  [main:NIOServerCnxnFactory@89] - binding to port 0.0.0.0/0.0.0.0:11221
    [junit] 2017-02-26 13:58:39,349 [myid:] - INFO  [main:ClientBase@341] - STARTING server instance 127.0.0.1:11221
    [junit] 2017-02-26 13:58:39,350 [myid:] - INFO  [main:ZooKeeperServer@173] - Created server with tickTime 3000 minSessionTimeout 6000 maxSessionTimeout 60000 datadir /zonestorage/hudson_solaris/home/hudson/hudson-slave/workspace/ZooKeeper_branch34_solaris/build/test/tmp/test8170079688655117722.junit.dir/version-2 snapdir /zonestorage/hudson_solaris/home/hudson/hudson-slave/workspace/ZooKeeper_branch34_solaris/build/test/tmp/test8170079688655117722.junit.dir/version-2
    [junit] 2017-02-26 13:58:39,352 [myid:] - ERROR [main:ZooKeeperServer@472] - ZKShutdownHandler is not registered, so ZooKeeper server won't take any action on ERROR or SHUTDOWN server state changes
    [junit] 2017-02-26 13:58:39,352 [myid:] - INFO  [main:FourLetterWordMain@62] - connecting to 127.0.0.1 11221
    [junit] 2017-02-26 13:58:39,353 [myid:] - INFO  [NIOServerCxn.Factory:0.0.0.0/0.0.0.0:11221:NIOServerCnxnFactory@192] - Accepted socket connection from /127.0.0.1:35204
    [junit] 2017-02-26 13:58:39,353 [myid:] - INFO  [NIOServerCxn.Factory:0.0.0.0/0.0.0.0:11221:NIOServerCnxn@838] - Processing stat command from /127.0.0.1:35204
    [junit] 2017-02-26 13:58:39,353 [myid:] - INFO  [Thread-5:NIOServerCnxn$StatCommand@674] - Stat command output
    [junit] 2017-02-26 13:58:39,354 [myid:] - INFO  [Thread-5:NIOServerCnxn@1019] - Closed socket connection for client /127.0.0.1:35204 (no session established for client)
    [junit] 2017-02-26 13:58:39,354 [myid:] - INFO  [main:JMXEnv@230] - ensureParent:[InMemoryDataTree, StandaloneServer_port]
    [junit] 2017-02-26 13:58:39,355 [myid:] - INFO  [main:JMXEnv@247] - expect:InMemoryDataTree
    [junit] 2017-02-26 13:58:39,355 [myid:] - INFO  [main:JMXEnv@251] - found:InMemoryDataTree org.apache.ZooKeeperService:name0=StandaloneServer_port11221,name1=InMemoryDataTree
    [junit] 2017-02-26 13:58:39,355 [myid:] - INFO  [main:JMXEnv@247] - expect:StandaloneServer_port
    [junit] 2017-02-26 13:58:39,355 [myid:] - INFO  [main:JMXEnv@251] - found:StandaloneServer_port org.apache.ZooKeeperService:name0=StandaloneServer_port11221
    [junit] 2017-02-26 13:58:39,355 [myid:] - INFO  [main:JUnit4ZKTestRunner$LoggedInvokeMethod@58] - Memory used 9052
    [junit] 2017-02-26 13:58:39,356 [myid:] - INFO  [main:JUnit4ZKTestRunner$LoggedInvokeMethod@63] - Number of threads 20
    [junit] 2017-02-26 13:58:39,356 [myid:] - INFO  [main:JUnit4ZKTestRunner$LoggedInvokeMethod@78] - FINISHED TEST METHOD testQuota
    [junit] 2017-02-26 13:58:39,356 [myid:] - INFO  [main:ClientBase@522] - tearDown starting
    [junit] 2017-02-26 13:58:39,442 [myid:] - INFO  [main:ZooKeeper@684] - Session: 0x15a7ab753580000 closed
    [junit] 2017-02-26 13:58:39,442 [myid:] - INFO  [main-EventThread:ClientCnxn$EventThread@519] - EventThread shut down for session: 0x15a7ab753580000
    [junit] 2017-02-26 13:58:39,442 [myid:] - INFO  [main:ClientBase@492] - STOPPING server
    [junit] 2017-02-26 13:58:39,442 [myid:] - INFO  [main:ZooKeeperServer@505] - shutting down
    [junit] 2017-02-26 13:58:39,443 [myid:] - ERROR [main:ZooKeeperServer@472] - ZKShutdownHandler is not registered, so ZooKeeper server won't take any action on ERROR or SHUTDOWN server state changes
    [junit] 2017-02-26 13:58:39,443 [myid:] - INFO  [main:SessionTrackerImpl@225] - Shutting down
    [junit] 2017-02-26 13:58:39,443 [myid:] - INFO  [main:PrepRequestProcessor@764] - Shutting down
    [junit] 2017-02-26 13:58:39,443 [myid:] - INFO  [main:SyncRequestProcessor@208] - Shutting down
    [junit] 2017-02-26 13:58:39,443 [myid:] - INFO  [ProcessThread(sid:0 cport:11221)::PrepRequestProcessor@143] - PrepRequestProcessor exited loop!
    [junit] 2017-02-26 13:58:39,443 [myid:] - INFO  [SyncThread:0:SyncRequestProcessor@186] - SyncRequestProcessor exited!
    [junit] 2017-02-26 13:58:39,444 [myid:] - INFO  [main:FinalRequestProcessor@402] - shutdown of request processor complete
    [junit] 2017-02-26 13:58:39,444 [myid:] - INFO  [main:FourLetterWordMain@62] - connecting to 127.0.0.1 11221
    [junit] 2017-02-26 13:58:39,444 [myid:] - INFO  [main:JMXEnv@147] - ensureOnly:[]
    [junit] 2017-02-26 13:58:39,454 [myid:] - INFO  [main:ClientBase@547] - fdcount after test is: 95 at start it was 81
    [junit] 2017-02-26 13:58:39,454 [myid:] - INFO  [main:ClientBase@549] - sleeping for 20 secs
    [junit] 2017-02-26 13:58:39,454 [myid:] - INFO  [main:ZKTestCase$1@65] - SUCCEEDED testQuota
    [junit] 2017-02-26 13:58:39,454 [myid:] - INFO  [main:ZKTestCase$1@60] - FINISHED testQuota
    [junit] Tests run: 1, Failures: 0, Errors: 0, Time elapsed: 0.637 sec

fail.build.on.test.failure:

BUILD FAILED
/zonestorage/hudson_solaris/home/hudson/hudson-slave/workspace/ZooKeeper_branch34_solaris/build.xml:1328: The following error occurred while executing this line:
/zonestorage/hudson_solaris/home/hudson/hudson-slave/workspace/ZooKeeper_branch34_solaris/build.xml:1331: Tests failed!

Total time: 33 minutes 37 seconds
Build step 'Invoke Ant' marked build as failure
[locks-and-latches] Releasing all the locks
[locks-and-latches] All the locks released
Recording test results
Email was triggered for: Failure - Any
Sending email for trigger: Failure - Any



###################################################################################
############################## FAILED TESTS (if any) ##############################
1 tests failed.
FAILED:  org.apache.zookeeper.server.quorum.auth.QuorumKerberosHostBasedAuthTest.testValidCredentials

Error Message:
waiting for server 2 being up

Stack Trace:
junit.framework.AssertionFailedError: waiting for server 2 being up
	at org.apache.zookeeper.server.quorum.auth.QuorumAuthTestBase.startQuorum(QuorumAuthTestBase.java:74)
	at org.apache.zookeeper.server.quorum.auth.QuorumKerberosHostBasedAuthTest.testValidCredentials(QuorumKerberosHostBasedAuthTest.java:125)
	at org.apache.zookeeper.JUnit4ZKTestRunner$LoggedInvokeMethod.evaluate(JUnit4ZKTestRunner.java:55)



ZooKeeper_branch34_solaris - Build # 1485 - Still Failing

Posted by Apache Jenkins Server <je...@builds.apache.org>.
See https://builds.apache.org/job/ZooKeeper_branch34_solaris/1485/

###################################################################################
########################## LAST 60 LINES OF THE CONSOLE ###########################
[...truncated 25.25 MB...]
    [junit] 2017-02-25 13:58:09,454 [myid:] - INFO  [main:PrepRequestProcessor@764] - Shutting down
    [junit] 2017-02-25 13:58:09,454 [myid:] - INFO  [main:SyncRequestProcessor@208] - Shutting down
    [junit] 2017-02-25 13:58:09,454 [myid:] - INFO  [ProcessThread(sid:0 cport:11221)::PrepRequestProcessor@143] - PrepRequestProcessor exited loop!
    [junit] 2017-02-25 13:58:09,454 [myid:] - INFO  [SyncThread:0:SyncRequestProcessor@186] - SyncRequestProcessor exited!
    [junit] 2017-02-25 13:58:09,454 [myid:] - INFO  [main:FinalRequestProcessor@402] - shutdown of request processor complete
    [junit] 2017-02-25 13:58:09,455 [myid:] - INFO  [main:FourLetterWordMain@62] - connecting to 127.0.0.1 11221
    [junit] 2017-02-25 13:58:09,455 [myid:] - INFO  [main:JMXEnv@147] - ensureOnly:[]
    [junit] 2017-02-25 13:58:09,456 [myid:] - INFO  [main:ClientBase@445] - STARTING server
    [junit] 2017-02-25 13:58:09,456 [myid:] - INFO  [main:ClientBase@366] - CREATING server instance 127.0.0.1:11221
    [junit] 2017-02-25 13:58:09,457 [myid:] - INFO  [main:NIOServerCnxnFactory@89] - binding to port 0.0.0.0/0.0.0.0:11221
    [junit] 2017-02-25 13:58:09,457 [myid:] - INFO  [main:ClientBase@341] - STARTING server instance 127.0.0.1:11221
    [junit] 2017-02-25 13:58:09,458 [myid:] - INFO  [main:ZooKeeperServer@173] - Created server with tickTime 3000 minSessionTimeout 6000 maxSessionTimeout 60000 datadir /zonestorage/hudson_solaris/home/hudson/hudson-slave/workspace/ZooKeeper_branch34_solaris/build/test/tmp/test5610133150878147916.junit.dir/version-2 snapdir /zonestorage/hudson_solaris/home/hudson/hudson-slave/workspace/ZooKeeper_branch34_solaris/build/test/tmp/test5610133150878147916.junit.dir/version-2
    [junit] 2017-02-25 13:58:09,461 [myid:] - ERROR [main:ZooKeeperServer@472] - ZKShutdownHandler is not registered, so ZooKeeper server won't take any action on ERROR or SHUTDOWN server state changes
    [junit] 2017-02-25 13:58:09,462 [myid:] - INFO  [main:FourLetterWordMain@62] - connecting to 127.0.0.1 11221
    [junit] 2017-02-25 13:58:09,462 [myid:] - INFO  [NIOServerCxn.Factory:0.0.0.0/0.0.0.0:11221:NIOServerCnxnFactory@192] - Accepted socket connection from /127.0.0.1:50850
    [junit] 2017-02-25 13:58:09,463 [myid:] - INFO  [NIOServerCxn.Factory:0.0.0.0/0.0.0.0:11221:NIOServerCnxn@838] - Processing stat command from /127.0.0.1:50850
    [junit] 2017-02-25 13:58:09,463 [myid:] - INFO  [Thread-5:NIOServerCnxn$StatCommand@674] - Stat command output
    [junit] 2017-02-25 13:58:09,464 [myid:] - INFO  [Thread-5:NIOServerCnxn@1019] - Closed socket connection for client /127.0.0.1:50850 (no session established for client)
    [junit] 2017-02-25 13:58:09,464 [myid:] - INFO  [main:JMXEnv@230] - ensureParent:[InMemoryDataTree, StandaloneServer_port]
    [junit] 2017-02-25 13:58:09,465 [myid:] - INFO  [main:JMXEnv@247] - expect:InMemoryDataTree
    [junit] 2017-02-25 13:58:09,466 [myid:] - INFO  [main:JMXEnv@251] - found:InMemoryDataTree org.apache.ZooKeeperService:name0=StandaloneServer_port11221,name1=InMemoryDataTree
    [junit] 2017-02-25 13:58:09,466 [myid:] - INFO  [main:JMXEnv@247] - expect:StandaloneServer_port
    [junit] 2017-02-25 13:58:09,466 [myid:] - INFO  [main:JMXEnv@251] - found:StandaloneServer_port org.apache.ZooKeeperService:name0=StandaloneServer_port11221
    [junit] 2017-02-25 13:58:09,467 [myid:] - INFO  [main:JUnit4ZKTestRunner$LoggedInvokeMethod@58] - Memory used 9184
    [junit] 2017-02-25 13:58:09,467 [myid:] - INFO  [main:JUnit4ZKTestRunner$LoggedInvokeMethod@63] - Number of threads 20
    [junit] 2017-02-25 13:58:09,467 [myid:] - INFO  [main:JUnit4ZKTestRunner$LoggedInvokeMethod@78] - FINISHED TEST METHOD testQuota
    [junit] 2017-02-25 13:58:09,468 [myid:] - INFO  [main:ClientBase@522] - tearDown starting
    [junit] 2017-02-25 13:58:09,545 [myid:] - INFO  [main:ZooKeeper@684] - Session: 0x15a7590807f0000 closed
    [junit] 2017-02-25 13:58:09,545 [myid:] - INFO  [main-EventThread:ClientCnxn$EventThread@519] - EventThread shut down for session: 0x15a7590807f0000
    [junit] 2017-02-25 13:58:09,546 [myid:] - INFO  [main:ClientBase@492] - STOPPING server
    [junit] 2017-02-25 13:58:09,547 [myid:] - INFO  [main:ZooKeeperServer@505] - shutting down
    [junit] 2017-02-25 13:58:09,548 [myid:] - ERROR [main:ZooKeeperServer@472] - ZKShutdownHandler is not registered, so ZooKeeper server won't take any action on ERROR or SHUTDOWN server state changes
    [junit] 2017-02-25 13:58:09,548 [myid:] - INFO  [main:SessionTrackerImpl@225] - Shutting down
    [junit] 2017-02-25 13:58:09,548 [myid:] - INFO  [main:PrepRequestProcessor@764] - Shutting down
    [junit] 2017-02-25 13:58:09,548 [myid:] - INFO  [main:SyncRequestProcessor@208] - Shutting down
    [junit] 2017-02-25 13:58:09,548 [myid:] - INFO  [ProcessThread(sid:0 cport:11221)::PrepRequestProcessor@143] - PrepRequestProcessor exited loop!
    [junit] 2017-02-25 13:58:09,548 [myid:] - INFO  [SyncThread:0:SyncRequestProcessor@186] - SyncRequestProcessor exited!
    [junit] 2017-02-25 13:58:09,548 [myid:] - INFO  [main:FinalRequestProcessor@402] - shutdown of request processor complete
    [junit] 2017-02-25 13:58:09,549 [myid:] - INFO  [main:FourLetterWordMain@62] - connecting to 127.0.0.1 11221
    [junit] 2017-02-25 13:58:09,550 [myid:] - INFO  [main:JMXEnv@147] - ensureOnly:[]
    [junit] 2017-02-25 13:58:09,579 [myid:] - INFO  [main:ClientBase@547] - fdcount after test is: 95 at start it was 81
    [junit] 2017-02-25 13:58:09,580 [myid:] - INFO  [main:ClientBase@549] - sleeping for 20 secs
    [junit] 2017-02-25 13:58:09,581 [myid:] - INFO  [main:ZKTestCase$1@65] - SUCCEEDED testQuota
    [junit] 2017-02-25 13:58:09,581 [myid:] - INFO  [main:ZKTestCase$1@60] - FINISHED testQuota
    [junit] Tests run: 1, Failures: 0, Errors: 0, Time elapsed: 2.548 sec

fail.build.on.test.failure:

BUILD FAILED
/zonestorage/hudson_solaris/home/hudson/hudson-slave/workspace/ZooKeeper_branch34_solaris/build.xml:1328: The following error occurred while executing this line:
/zonestorage/hudson_solaris/home/hudson/hudson-slave/workspace/ZooKeeper_branch34_solaris/build.xml:1331: Tests failed!

Total time: 31 minutes 39 seconds
Build step 'Invoke Ant' marked build as failure
[locks-and-latches] Releasing all the locks
[locks-and-latches] All the locks released
Recording test results
Email was triggered for: Failure - Any
Sending email for trigger: Failure - Any



###################################################################################
############################## FAILED TESTS (if any) ##############################
2 tests failed.
FAILED:  org.apache.zookeeper.server.quorum.auth.QuorumKerberosHostBasedAuthTest.testValidCredentials

Error Message:
waiting for server 1 being up

Stack Trace:
junit.framework.AssertionFailedError: waiting for server 1 being up
	at org.apache.zookeeper.server.quorum.auth.QuorumAuthTestBase.startQuorum(QuorumAuthTestBase.java:74)
	at org.apache.zookeeper.server.quorum.auth.QuorumKerberosHostBasedAuthTest.testValidCredentials(QuorumKerberosHostBasedAuthTest.java:125)
	at org.apache.zookeeper.JUnit4ZKTestRunner$LoggedInvokeMethod.evaluate(JUnit4ZKTestRunner.java:55)


FAILED:  org.apache.zookeeper.server.quorum.auth.QuorumKerberosAuthTest.testValidCredentials

Error Message:
waiting for server 0 being up

Stack Trace:
junit.framework.AssertionFailedError: waiting for server 0 being up
	at org.apache.zookeeper.server.quorum.auth.QuorumAuthTestBase.startQuorum(QuorumAuthTestBase.java:74)
	at org.apache.zookeeper.server.quorum.auth.QuorumKerberosAuthTest.testValidCredentials(QuorumKerberosAuthTest.java:101)
	at org.apache.zookeeper.JUnit4ZKTestRunner$LoggedInvokeMethod.evaluate(JUnit4ZKTestRunner.java:55)



ZooKeeper_branch34_solaris - Build # 1484 - Still Failing

Posted by Apache Jenkins Server <je...@builds.apache.org>.
See https://builds.apache.org/job/ZooKeeper_branch34_solaris/1484/

###################################################################################
########################## LAST 60 LINES OF THE CONSOLE ###########################
[...truncated 25.57 MB...]
    [junit] 2017-02-24 13:59:31,614 [myid:] - INFO  [main:PrepRequestProcessor@764] - Shutting down
    [junit] 2017-02-24 13:59:31,615 [myid:] - INFO  [main:SyncRequestProcessor@208] - Shutting down
    [junit] 2017-02-24 13:59:31,615 [myid:] - INFO  [ProcessThread(sid:0 cport:11221)::PrepRequestProcessor@143] - PrepRequestProcessor exited loop!
    [junit] 2017-02-24 13:59:31,615 [myid:] - INFO  [SyncThread:0:SyncRequestProcessor@186] - SyncRequestProcessor exited!
    [junit] 2017-02-24 13:59:31,615 [myid:] - INFO  [main:FinalRequestProcessor@402] - shutdown of request processor complete
    [junit] 2017-02-24 13:59:31,615 [myid:] - INFO  [main:FourLetterWordMain@62] - connecting to 127.0.0.1 11221
    [junit] 2017-02-24 13:59:31,616 [myid:] - INFO  [main:JMXEnv@147] - ensureOnly:[]
    [junit] 2017-02-24 13:59:31,616 [myid:] - INFO  [main:ClientBase@445] - STARTING server
    [junit] 2017-02-24 13:59:31,617 [myid:] - INFO  [main:ClientBase@366] - CREATING server instance 127.0.0.1:11221
    [junit] 2017-02-24 13:59:31,617 [myid:] - INFO  [main:NIOServerCnxnFactory@89] - binding to port 0.0.0.0/0.0.0.0:11221
    [junit] 2017-02-24 13:59:31,617 [myid:] - INFO  [main:ClientBase@341] - STARTING server instance 127.0.0.1:11221
    [junit] 2017-02-24 13:59:31,618 [myid:] - INFO  [main:ZooKeeperServer@173] - Created server with tickTime 3000 minSessionTimeout 6000 maxSessionTimeout 60000 datadir /zonestorage/hudson_solaris/home/hudson/hudson-slave/workspace/ZooKeeper_branch34_solaris/build/test/tmp/test6612566389044951071.junit.dir/version-2 snapdir /zonestorage/hudson_solaris/home/hudson/hudson-slave/workspace/ZooKeeper_branch34_solaris/build/test/tmp/test6612566389044951071.junit.dir/version-2
    [junit] 2017-02-24 13:59:31,620 [myid:] - ERROR [main:ZooKeeperServer@472] - ZKShutdownHandler is not registered, so ZooKeeper server won't take any action on ERROR or SHUTDOWN server state changes
    [junit] 2017-02-24 13:59:31,620 [myid:] - INFO  [main:FourLetterWordMain@62] - connecting to 127.0.0.1 11221
    [junit] 2017-02-24 13:59:31,620 [myid:] - INFO  [NIOServerCxn.Factory:0.0.0.0/0.0.0.0:11221:NIOServerCnxnFactory@192] - Accepted socket connection from /127.0.0.1:36608
    [junit] 2017-02-24 13:59:31,621 [myid:] - INFO  [NIOServerCxn.Factory:0.0.0.0/0.0.0.0:11221:NIOServerCnxn@838] - Processing stat command from /127.0.0.1:36608
    [junit] 2017-02-24 13:59:31,621 [myid:] - INFO  [Thread-5:NIOServerCnxn$StatCommand@674] - Stat command output
    [junit] 2017-02-24 13:59:31,621 [myid:] - INFO  [Thread-5:NIOServerCnxn@1019] - Closed socket connection for client /127.0.0.1:36608 (no session established for client)
    [junit] 2017-02-24 13:59:31,621 [myid:] - INFO  [main:JMXEnv@230] - ensureParent:[InMemoryDataTree, StandaloneServer_port]
    [junit] 2017-02-24 13:59:31,622 [myid:] - INFO  [main:JMXEnv@247] - expect:InMemoryDataTree
    [junit] 2017-02-24 13:59:31,622 [myid:] - INFO  [main:JMXEnv@251] - found:InMemoryDataTree org.apache.ZooKeeperService:name0=StandaloneServer_port11221,name1=InMemoryDataTree
    [junit] 2017-02-24 13:59:31,623 [myid:] - INFO  [main:JMXEnv@247] - expect:StandaloneServer_port
    [junit] 2017-02-24 13:59:31,623 [myid:] - INFO  [main:JMXEnv@251] - found:StandaloneServer_port org.apache.ZooKeeperService:name0=StandaloneServer_port11221
    [junit] 2017-02-24 13:59:31,623 [myid:] - INFO  [main:JUnit4ZKTestRunner$LoggedInvokeMethod@58] - Memory used 9051
    [junit] 2017-02-24 13:59:31,623 [myid:] - INFO  [main:JUnit4ZKTestRunner$LoggedInvokeMethod@63] - Number of threads 20
    [junit] 2017-02-24 13:59:31,623 [myid:] - INFO  [main:JUnit4ZKTestRunner$LoggedInvokeMethod@78] - FINISHED TEST METHOD testQuota
    [junit] 2017-02-24 13:59:31,623 [myid:] - INFO  [main:ClientBase@522] - tearDown starting
    [junit] 2017-02-24 13:59:31,701 [myid:] - INFO  [main:ZooKeeper@684] - Session: 0x15a706b67000000 closed
    [junit] 2017-02-24 13:59:31,701 [myid:] - INFO  [main:ClientBase@492] - STOPPING server
    [junit] 2017-02-24 13:59:31,701 [myid:] - INFO  [main-EventThread:ClientCnxn$EventThread@519] - EventThread shut down for session: 0x15a706b67000000
    [junit] 2017-02-24 13:59:31,702 [myid:] - INFO  [main:ZooKeeperServer@505] - shutting down
    [junit] 2017-02-24 13:59:31,702 [myid:] - ERROR [main:ZooKeeperServer@472] - ZKShutdownHandler is not registered, so ZooKeeper server won't take any action on ERROR or SHUTDOWN server state changes
    [junit] 2017-02-24 13:59:31,703 [myid:] - INFO  [main:SessionTrackerImpl@225] - Shutting down
    [junit] 2017-02-24 13:59:31,703 [myid:] - INFO  [main:PrepRequestProcessor@764] - Shutting down
    [junit] 2017-02-24 13:59:31,703 [myid:] - INFO  [main:SyncRequestProcessor@208] - Shutting down
    [junit] 2017-02-24 13:59:31,703 [myid:] - INFO  [ProcessThread(sid:0 cport:11221)::PrepRequestProcessor@143] - PrepRequestProcessor exited loop!
    [junit] 2017-02-24 13:59:31,703 [myid:] - INFO  [SyncThread:0:SyncRequestProcessor@186] - SyncRequestProcessor exited!
    [junit] 2017-02-24 13:59:31,703 [myid:] - INFO  [main:FinalRequestProcessor@402] - shutdown of request processor complete
    [junit] 2017-02-24 13:59:31,704 [myid:] - INFO  [main:FourLetterWordMain@62] - connecting to 127.0.0.1 11221
    [junit] 2017-02-24 13:59:31,704 [myid:] - INFO  [main:JMXEnv@147] - ensureOnly:[]
    [junit] 2017-02-24 13:59:31,707 [myid:] - INFO  [main:ClientBase@547] - fdcount after test is: 95 at start it was 81
    [junit] 2017-02-24 13:59:31,707 [myid:] - INFO  [main:ClientBase@549] - sleeping for 20 secs
    [junit] 2017-02-24 13:59:31,707 [myid:] - INFO  [main:ZKTestCase$1@65] - SUCCEEDED testQuota
    [junit] 2017-02-24 13:59:31,707 [myid:] - INFO  [main:ZKTestCase$1@60] - FINISHED testQuota
    [junit] Tests run: 1, Failures: 0, Errors: 0, Time elapsed: 1.777 sec

fail.build.on.test.failure:

BUILD FAILED
/zonestorage/hudson_solaris/home/hudson/hudson-slave/workspace/ZooKeeper_branch34_solaris/build.xml:1328: The following error occurred while executing this line:
/zonestorage/hudson_solaris/home/hudson/hudson-slave/workspace/ZooKeeper_branch34_solaris/build.xml:1331: Tests failed!

Total time: 34 minutes 32 seconds
Build step 'Invoke Ant' marked build as failure
[locks-and-latches] Releasing all the locks
[locks-and-latches] All the locks released
Recording test results
Email was triggered for: Failure - Any
Sending email for trigger: Failure - Any



###################################################################################
############################## FAILED TESTS (if any) ##############################
1 tests failed.
FAILED:  org.apache.zookeeper.server.quorum.auth.QuorumKerberosAuthTest.testValidCredentials

Error Message:
waiting for server 2 being up

Stack Trace:
junit.framework.AssertionFailedError: waiting for server 2 being up
	at org.apache.zookeeper.server.quorum.auth.QuorumAuthTestBase.startQuorum(QuorumAuthTestBase.java:74)
	at org.apache.zookeeper.server.quorum.auth.QuorumKerberosAuthTest.testValidCredentials(QuorumKerberosAuthTest.java:101)
	at org.apache.zookeeper.JUnit4ZKTestRunner$LoggedInvokeMethod.evaluate(JUnit4ZKTestRunner.java:55)



ZooKeeper_branch34_solaris - Build # 1483 - Still Failing

Posted by Apache Jenkins Server <je...@builds.apache.org>.
See https://builds.apache.org/job/ZooKeeper_branch34_solaris/1483/

###################################################################################
########################## LAST 60 LINES OF THE CONSOLE ###########################
[...truncated 25.08 MB...]
    [junit] 2017-02-23 13:58:22,413 [myid:] - INFO  [main:PrepRequestProcessor@764] - Shutting down
    [junit] 2017-02-23 13:58:22,413 [myid:] - INFO  [main:SyncRequestProcessor@208] - Shutting down
    [junit] 2017-02-23 13:58:22,414 [myid:] - INFO  [ProcessThread(sid:0 cport:11221)::PrepRequestProcessor@143] - PrepRequestProcessor exited loop!
    [junit] 2017-02-23 13:58:22,414 [myid:] - INFO  [SyncThread:0:SyncRequestProcessor@186] - SyncRequestProcessor exited!
    [junit] 2017-02-23 13:58:22,414 [myid:] - INFO  [main:FinalRequestProcessor@402] - shutdown of request processor complete
    [junit] 2017-02-23 13:58:22,414 [myid:] - INFO  [main:FourLetterWordMain@62] - connecting to 127.0.0.1 11221
    [junit] 2017-02-23 13:58:22,415 [myid:] - INFO  [main:JMXEnv@147] - ensureOnly:[]
    [junit] 2017-02-23 13:58:22,415 [myid:] - INFO  [main:ClientBase@445] - STARTING server
    [junit] 2017-02-23 13:58:22,416 [myid:] - INFO  [main:ClientBase@366] - CREATING server instance 127.0.0.1:11221
    [junit] 2017-02-23 13:58:22,416 [myid:] - INFO  [main:NIOServerCnxnFactory@89] - binding to port 0.0.0.0/0.0.0.0:11221
    [junit] 2017-02-23 13:58:22,416 [myid:] - INFO  [main:ClientBase@341] - STARTING server instance 127.0.0.1:11221
    [junit] 2017-02-23 13:58:22,417 [myid:] - INFO  [main:ZooKeeperServer@173] - Created server with tickTime 3000 minSessionTimeout 6000 maxSessionTimeout 60000 datadir /zonestorage/hudson_solaris/home/hudson/hudson-slave/workspace/ZooKeeper_branch34_solaris/build/test/tmp/test1524573733394292484.junit.dir/version-2 snapdir /zonestorage/hudson_solaris/home/hudson/hudson-slave/workspace/ZooKeeper_branch34_solaris/build/test/tmp/test1524573733394292484.junit.dir/version-2
    [junit] 2017-02-23 13:58:22,419 [myid:] - ERROR [main:ZooKeeperServer@472] - ZKShutdownHandler is not registered, so ZooKeeper server won't take any action on ERROR or SHUTDOWN server state changes
    [junit] 2017-02-23 13:58:22,419 [myid:] - INFO  [main:FourLetterWordMain@62] - connecting to 127.0.0.1 11221
    [junit] 2017-02-23 13:58:22,419 [myid:] - INFO  [NIOServerCxn.Factory:0.0.0.0/0.0.0.0:11221:NIOServerCnxnFactory@192] - Accepted socket connection from /127.0.0.1:53533
    [junit] 2017-02-23 13:58:22,420 [myid:] - INFO  [NIOServerCxn.Factory:0.0.0.0/0.0.0.0:11221:NIOServerCnxn@838] - Processing stat command from /127.0.0.1:53533
    [junit] 2017-02-23 13:58:22,420 [myid:] - INFO  [Thread-5:NIOServerCnxn$StatCommand@674] - Stat command output
    [junit] 2017-02-23 13:58:22,420 [myid:] - INFO  [Thread-5:NIOServerCnxn@1019] - Closed socket connection for client /127.0.0.1:53533 (no session established for client)
    [junit] 2017-02-23 13:58:22,420 [myid:] - INFO  [main:JMXEnv@230] - ensureParent:[InMemoryDataTree, StandaloneServer_port]
    [junit] 2017-02-23 13:58:22,426 [myid:] - INFO  [main:JMXEnv@247] - expect:InMemoryDataTree
    [junit] 2017-02-23 13:58:22,426 [myid:] - INFO  [main:JMXEnv@251] - found:InMemoryDataTree org.apache.ZooKeeperService:name0=StandaloneServer_port11221,name1=InMemoryDataTree
    [junit] 2017-02-23 13:58:22,426 [myid:] - INFO  [main:JMXEnv@247] - expect:StandaloneServer_port
    [junit] 2017-02-23 13:58:22,426 [myid:] - INFO  [main:JMXEnv@251] - found:StandaloneServer_port org.apache.ZooKeeperService:name0=StandaloneServer_port11221
    [junit] 2017-02-23 13:58:22,426 [myid:] - INFO  [main:JUnit4ZKTestRunner$LoggedInvokeMethod@58] - Memory used 9183
    [junit] 2017-02-23 13:58:22,426 [myid:] - INFO  [main:JUnit4ZKTestRunner$LoggedInvokeMethod@63] - Number of threads 20
    [junit] 2017-02-23 13:58:22,427 [myid:] - INFO  [main:JUnit4ZKTestRunner$LoggedInvokeMethod@78] - FINISHED TEST METHOD testQuota
    [junit] 2017-02-23 13:58:22,427 [myid:] - INFO  [main:ClientBase@522] - tearDown starting
    [junit] 2017-02-23 13:58:22,510 [myid:] - INFO  [main:ZooKeeper@684] - Session: 0x15a6b43fb1b0000 closed
    [junit] 2017-02-23 13:58:22,510 [myid:] - INFO  [main-EventThread:ClientCnxn$EventThread@519] - EventThread shut down for session: 0x15a6b43fb1b0000
    [junit] 2017-02-23 13:58:22,510 [myid:] - INFO  [main:ClientBase@492] - STOPPING server
    [junit] 2017-02-23 13:58:22,510 [myid:] - INFO  [main:ZooKeeperServer@505] - shutting down
    [junit] 2017-02-23 13:58:22,511 [myid:] - ERROR [main:ZooKeeperServer@472] - ZKShutdownHandler is not registered, so ZooKeeper server won't take any action on ERROR or SHUTDOWN server state changes
    [junit] 2017-02-23 13:58:22,511 [myid:] - INFO  [main:SessionTrackerImpl@225] - Shutting down
    [junit] 2017-02-23 13:58:22,511 [myid:] - INFO  [main:PrepRequestProcessor@764] - Shutting down
    [junit] 2017-02-23 13:58:22,511 [myid:] - INFO  [main:SyncRequestProcessor@208] - Shutting down
    [junit] 2017-02-23 13:58:22,511 [myid:] - INFO  [ProcessThread(sid:0 cport:11221)::PrepRequestProcessor@143] - PrepRequestProcessor exited loop!
    [junit] 2017-02-23 13:58:22,511 [myid:] - INFO  [SyncThread:0:SyncRequestProcessor@186] - SyncRequestProcessor exited!
    [junit] 2017-02-23 13:58:22,511 [myid:] - INFO  [main:FinalRequestProcessor@402] - shutdown of request processor complete
    [junit] 2017-02-23 13:58:22,512 [myid:] - INFO  [main:FourLetterWordMain@62] - connecting to 127.0.0.1 11221
    [junit] 2017-02-23 13:58:22,512 [myid:] - INFO  [main:JMXEnv@147] - ensureOnly:[]
    [junit] 2017-02-23 13:58:22,515 [myid:] - INFO  [main:ClientBase@547] - fdcount after test is: 95 at start it was 81
    [junit] 2017-02-23 13:58:22,515 [myid:] - INFO  [main:ClientBase@549] - sleeping for 20 secs
    [junit] 2017-02-23 13:58:22,516 [myid:] - INFO  [main:ZKTestCase$1@65] - SUCCEEDED testQuota
    [junit] 2017-02-23 13:58:22,516 [myid:] - INFO  [main:ZKTestCase$1@60] - FINISHED testQuota
    [junit] Tests run: 1, Failures: 0, Errors: 0, Time elapsed: 1.283 sec

fail.build.on.test.failure:

BUILD FAILED
/zonestorage/hudson_solaris/home/hudson/hudson-slave/workspace/ZooKeeper_branch34_solaris/build.xml:1328: The following error occurred while executing this line:
/zonestorage/hudson_solaris/home/hudson/hudson-slave/workspace/ZooKeeper_branch34_solaris/build.xml:1331: Tests failed!

Total time: 33 minutes 20 seconds
Build step 'Invoke Ant' marked build as failure
[locks-and-latches] Releasing all the locks
[locks-and-latches] All the locks released
Recording test results
Email was triggered for: Failure - Any
Sending email for trigger: Failure - Any



###################################################################################
############################## FAILED TESTS (if any) ##############################
2 tests failed.
FAILED:  org.apache.zookeeper.server.quorum.auth.QuorumKerberosAuthTest.testValidCredentials

Error Message:
waiting for server 1 being up

Stack Trace:
junit.framework.AssertionFailedError: waiting for server 1 being up
	at org.apache.zookeeper.server.quorum.auth.QuorumAuthTestBase.startQuorum(QuorumAuthTestBase.java:74)
	at org.apache.zookeeper.server.quorum.auth.QuorumKerberosAuthTest.testValidCredentials(QuorumKerberosAuthTest.java:101)
	at org.apache.zookeeper.JUnit4ZKTestRunner$LoggedInvokeMethod.evaluate(JUnit4ZKTestRunner.java:55)


FAILED:  org.apache.zookeeper.test.ReadOnlyModeTest.testSessionEstablishment

Error Message:
KeeperErrorCode = ConnectionLoss for /test

Stack Trace:
org.apache.zookeeper.KeeperException$ConnectionLossException: KeeperErrorCode = ConnectionLoss for /test
	at org.apache.zookeeper.KeeperException.create(KeeperException.java:99)
	at org.apache.zookeeper.KeeperException.create(KeeperException.java:51)
	at org.apache.zookeeper.ZooKeeper.create(ZooKeeper.java:783)
	at org.apache.zookeeper.test.ReadOnlyModeTest.testSessionEstablishment(ReadOnlyModeTest.java:216)
	at org.apache.zookeeper.JUnit4ZKTestRunner$LoggedInvokeMethod.evaluate(JUnit4ZKTestRunner.java:55)



ZooKeeper_branch34_solaris - Build # 1482 - Still Failing

Posted by Apache Jenkins Server <je...@builds.apache.org>.
See https://builds.apache.org/job/ZooKeeper_branch34_solaris/1482/

###################################################################################
########################## LAST 60 LINES OF THE CONSOLE ###########################
[...truncated 26.02 MB...]
    [junit] 2017-02-22 13:59:53,994 [myid:] - INFO  [ProcessThread(sid:0 cport:11221)::PrepRequestProcessor@143] - PrepRequestProcessor exited loop!
    [junit] 2017-02-22 13:59:53,994 [myid:] - INFO  [SyncThread:0:SyncRequestProcessor@186] - SyncRequestProcessor exited!
    [junit] 2017-02-22 13:59:53,994 [myid:] - INFO  [main:FinalRequestProcessor@402] - shutdown of request processor complete
    [junit] 2017-02-22 13:59:53,994 [myid:] - INFO  [main:FourLetterWordMain@62] - connecting to 127.0.0.1 11221
    [junit] 2017-02-22 13:59:53,995 [myid:] - INFO  [main:JMXEnv@147] - ensureOnly:[]
    [junit] 2017-02-22 13:59:53,995 [myid:] - INFO  [main:ClientBase@445] - STARTING server
    [junit] 2017-02-22 13:59:53,996 [myid:] - INFO  [main:ClientBase@366] - CREATING server instance 127.0.0.1:11221
    [junit] 2017-02-22 13:59:53,996 [myid:] - INFO  [main:NIOServerCnxnFactory@89] - binding to port 0.0.0.0/0.0.0.0:11221
    [junit] 2017-02-22 13:59:53,996 [myid:] - INFO  [main:ClientBase@341] - STARTING server instance 127.0.0.1:11221
    [junit] 2017-02-22 13:59:53,997 [myid:] - INFO  [main:ZooKeeperServer@173] - Created server with tickTime 3000 minSessionTimeout 6000 maxSessionTimeout 60000 datadir /zonestorage/hudson_solaris/home/hudson/hudson-slave/workspace/ZooKeeper_branch34_solaris/build/test/tmp/test4598309053564768091.junit.dir/version-2 snapdir /zonestorage/hudson_solaris/home/hudson/hudson-slave/workspace/ZooKeeper_branch34_solaris/build/test/tmp/test4598309053564768091.junit.dir/version-2
    [junit] 2017-02-22 13:59:53,999 [myid:] - ERROR [main:ZooKeeperServer@472] - ZKShutdownHandler is not registered, so ZooKeeper server won't take any action on ERROR or SHUTDOWN server state changes
    [junit] 2017-02-22 13:59:53,999 [myid:] - INFO  [main:FourLetterWordMain@62] - connecting to 127.0.0.1 11221
    [junit] 2017-02-22 13:59:54,000 [myid:] - INFO  [NIOServerCxn.Factory:0.0.0.0/0.0.0.0:11221:NIOServerCnxnFactory@192] - Accepted socket connection from /127.0.0.1:39560
    [junit] 2017-02-22 13:59:54,000 [myid:] - INFO  [NIOServerCxn.Factory:0.0.0.0/0.0.0.0:11221:NIOServerCnxn@838] - Processing stat command from /127.0.0.1:39560
    [junit] 2017-02-22 13:59:54,000 [myid:] - INFO  [Thread-5:NIOServerCnxn$StatCommand@674] - Stat command output
    [junit] 2017-02-22 13:59:54,000 [myid:] - INFO  [Thread-5:NIOServerCnxn@1019] - Closed socket connection for client /127.0.0.1:39560 (no session established for client)
    [junit] 2017-02-22 13:59:54,001 [myid:] - INFO  [main:JMXEnv@230] - ensureParent:[InMemoryDataTree, StandaloneServer_port]
    [junit] 2017-02-22 13:59:54,001 [myid:] - INFO  [SessionTracker:SessionTrackerImpl@162] - SessionTrackerImpl exited loop!
    [junit] 2017-02-22 13:59:54,001 [myid:] - INFO  [SessionTracker:SessionTrackerImpl@162] - SessionTrackerImpl exited loop!
    [junit] 2017-02-22 13:59:54,002 [myid:] - INFO  [main:JMXEnv@247] - expect:InMemoryDataTree
    [junit] 2017-02-22 13:59:54,002 [myid:] - INFO  [main:JMXEnv@251] - found:InMemoryDataTree org.apache.ZooKeeperService:name0=StandaloneServer_port11221,name1=InMemoryDataTree
    [junit] 2017-02-22 13:59:54,002 [myid:] - INFO  [main:JMXEnv@247] - expect:StandaloneServer_port
    [junit] 2017-02-22 13:59:54,002 [myid:] - INFO  [main:JMXEnv@251] - found:StandaloneServer_port org.apache.ZooKeeperService:name0=StandaloneServer_port11221
    [junit] 2017-02-22 13:59:54,003 [myid:] - INFO  [main:JUnit4ZKTestRunner$LoggedInvokeMethod@58] - Memory used 11642
    [junit] 2017-02-22 13:59:54,003 [myid:] - INFO  [main:JUnit4ZKTestRunner$LoggedInvokeMethod@63] - Number of threads 18
    [junit] 2017-02-22 13:59:54,003 [myid:] - INFO  [main:JUnit4ZKTestRunner$LoggedInvokeMethod@78] - FINISHED TEST METHOD testQuota
    [junit] 2017-02-22 13:59:54,003 [myid:] - INFO  [main:ClientBase@522] - tearDown starting
    [junit] 2017-02-22 13:59:54,082 [myid:] - INFO  [main:ZooKeeper@684] - Session: 0x15a661f06d00000 closed
    [junit] 2017-02-22 13:59:54,082 [myid:] - INFO  [main-EventThread:ClientCnxn$EventThread@519] - EventThread shut down for session: 0x15a661f06d00000
    [junit] 2017-02-22 13:59:54,082 [myid:] - INFO  [main:ClientBase@492] - STOPPING server
    [junit] 2017-02-22 13:59:54,084 [myid:] - INFO  [main:ZooKeeperServer@505] - shutting down
    [junit] 2017-02-22 13:59:54,084 [myid:] - ERROR [main:ZooKeeperServer@472] - ZKShutdownHandler is not registered, so ZooKeeper server won't take any action on ERROR or SHUTDOWN server state changes
    [junit] 2017-02-22 13:59:54,084 [myid:] - INFO  [main:SessionTrackerImpl@225] - Shutting down
    [junit] 2017-02-22 13:59:54,084 [myid:] - INFO  [main:PrepRequestProcessor@764] - Shutting down
    [junit] 2017-02-22 13:59:54,085 [myid:] - INFO  [main:SyncRequestProcessor@208] - Shutting down
    [junit] 2017-02-22 13:59:54,085 [myid:] - INFO  [ProcessThread(sid:0 cport:11221)::PrepRequestProcessor@143] - PrepRequestProcessor exited loop!
    [junit] 2017-02-22 13:59:54,085 [myid:] - INFO  [SyncThread:0:SyncRequestProcessor@186] - SyncRequestProcessor exited!
    [junit] 2017-02-22 13:59:54,085 [myid:] - INFO  [main:FinalRequestProcessor@402] - shutdown of request processor complete
    [junit] 2017-02-22 13:59:54,086 [myid:] - INFO  [main:FourLetterWordMain@62] - connecting to 127.0.0.1 11221
    [junit] 2017-02-22 13:59:54,087 [myid:] - INFO  [main:JMXEnv@147] - ensureOnly:[]
    [junit] 2017-02-22 13:59:54,093 [myid:] - INFO  [main:ClientBase@547] - fdcount after test is: 95 at start it was 81
    [junit] 2017-02-22 13:59:54,093 [myid:] - INFO  [main:ClientBase@549] - sleeping for 20 secs
    [junit] 2017-02-22 13:59:54,094 [myid:] - INFO  [main:ZKTestCase$1@65] - SUCCEEDED testQuota
    [junit] 2017-02-22 13:59:54,094 [myid:] - INFO  [main:ZKTestCase$1@60] - FINISHED testQuota
    [junit] Tests run: 1, Failures: 0, Errors: 0, Time elapsed: 1.118 sec

fail.build.on.test.failure:

BUILD FAILED
/zonestorage/hudson_solaris/home/hudson/hudson-slave/workspace/ZooKeeper_branch34_solaris/build.xml:1328: The following error occurred while executing this line:
/zonestorage/hudson_solaris/home/hudson/hudson-slave/workspace/ZooKeeper_branch34_solaris/build.xml:1331: Tests failed!

Total time: 33 minutes 33 seconds
Build step 'Invoke Ant' marked build as failure
[locks-and-latches] Releasing all the locks
[locks-and-latches] All the locks released
Recording test results
Email was triggered for: Failure - Any
Sending email for trigger: Failure - Any



###################################################################################
############################## FAILED TESTS (if any) ##############################
1 tests failed.
FAILED:  org.apache.zookeeper.test.ReadOnlyModeTest.testSessionEstablishment

Error Message:
KeeperErrorCode = ConnectionLoss for /test

Stack Trace:
org.apache.zookeeper.KeeperException$ConnectionLossException: KeeperErrorCode = ConnectionLoss for /test
	at org.apache.zookeeper.KeeperException.create(KeeperException.java:99)
	at org.apache.zookeeper.KeeperException.create(KeeperException.java:51)
	at org.apache.zookeeper.ZooKeeper.create(ZooKeeper.java:783)
	at org.apache.zookeeper.test.ReadOnlyModeTest.testSessionEstablishment(ReadOnlyModeTest.java:216)
	at org.apache.zookeeper.JUnit4ZKTestRunner$LoggedInvokeMethod.evaluate(JUnit4ZKTestRunner.java:55)



ZooKeeper_branch34_solaris - Build # 1481 - Still Failing

Posted by Apache Jenkins Server <je...@builds.apache.org>.
See https://builds.apache.org/job/ZooKeeper_branch34_solaris/1481/

###################################################################################
########################## LAST 60 LINES OF THE CONSOLE ###########################
[...truncated 25.43 MB...]
    [junit] 2017-02-21 13:59:22,191 [myid:] - INFO  [main:PrepRequestProcessor@764] - Shutting down
    [junit] 2017-02-21 13:59:22,191 [myid:] - INFO  [main:SyncRequestProcessor@208] - Shutting down
    [junit] 2017-02-21 13:59:22,191 [myid:] - INFO  [ProcessThread(sid:0 cport:11221)::PrepRequestProcessor@143] - PrepRequestProcessor exited loop!
    [junit] 2017-02-21 13:59:22,191 [myid:] - INFO  [SyncThread:0:SyncRequestProcessor@186] - SyncRequestProcessor exited!
    [junit] 2017-02-21 13:59:22,191 [myid:] - INFO  [main:FinalRequestProcessor@402] - shutdown of request processor complete
    [junit] 2017-02-21 13:59:22,192 [myid:] - INFO  [main:FourLetterWordMain@62] - connecting to 127.0.0.1 11221
    [junit] 2017-02-21 13:59:22,192 [myid:] - INFO  [main:JMXEnv@147] - ensureOnly:[]
    [junit] 2017-02-21 13:59:22,193 [myid:] - INFO  [main:ClientBase@445] - STARTING server
    [junit] 2017-02-21 13:59:22,193 [myid:] - INFO  [main:ClientBase@366] - CREATING server instance 127.0.0.1:11221
    [junit] 2017-02-21 13:59:22,194 [myid:] - INFO  [main:NIOServerCnxnFactory@89] - binding to port 0.0.0.0/0.0.0.0:11221
    [junit] 2017-02-21 13:59:22,194 [myid:] - INFO  [main:ClientBase@341] - STARTING server instance 127.0.0.1:11221
    [junit] 2017-02-21 13:59:22,194 [myid:] - INFO  [main:ZooKeeperServer@173] - Created server with tickTime 3000 minSessionTimeout 6000 maxSessionTimeout 60000 datadir /zonestorage/hudson_solaris/home/hudson/hudson-slave/workspace/ZooKeeper_branch34_solaris/build/test/tmp/test8150496328335636615.junit.dir/version-2 snapdir /zonestorage/hudson_solaris/home/hudson/hudson-slave/workspace/ZooKeeper_branch34_solaris/build/test/tmp/test8150496328335636615.junit.dir/version-2
    [junit] 2017-02-21 13:59:22,197 [myid:] - ERROR [main:ZooKeeperServer@472] - ZKShutdownHandler is not registered, so ZooKeeper server won't take any action on ERROR or SHUTDOWN server state changes
    [junit] 2017-02-21 13:59:22,197 [myid:] - INFO  [main:FourLetterWordMain@62] - connecting to 127.0.0.1 11221
    [junit] 2017-02-21 13:59:22,198 [myid:] - INFO  [NIOServerCxn.Factory:0.0.0.0/0.0.0.0:11221:NIOServerCnxnFactory@192] - Accepted socket connection from /127.0.0.1:58128
    [junit] 2017-02-21 13:59:22,198 [myid:] - INFO  [NIOServerCxn.Factory:0.0.0.0/0.0.0.0:11221:NIOServerCnxn@838] - Processing stat command from /127.0.0.1:58128
    [junit] 2017-02-21 13:59:22,198 [myid:] - INFO  [Thread-5:NIOServerCnxn$StatCommand@674] - Stat command output
    [junit] 2017-02-21 13:59:22,199 [myid:] - INFO  [Thread-5:NIOServerCnxn@1019] - Closed socket connection for client /127.0.0.1:58128 (no session established for client)
    [junit] 2017-02-21 13:59:22,199 [myid:] - INFO  [main:JMXEnv@230] - ensureParent:[InMemoryDataTree, StandaloneServer_port]
    [junit] 2017-02-21 13:59:22,200 [myid:] - INFO  [main:JMXEnv@247] - expect:InMemoryDataTree
    [junit] 2017-02-21 13:59:22,200 [myid:] - INFO  [main:JMXEnv@251] - found:InMemoryDataTree org.apache.ZooKeeperService:name0=StandaloneServer_port11221,name1=InMemoryDataTree
    [junit] 2017-02-21 13:59:22,201 [myid:] - INFO  [main:JMXEnv@247] - expect:StandaloneServer_port
    [junit] 2017-02-21 13:59:22,201 [myid:] - INFO  [main:JMXEnv@251] - found:StandaloneServer_port org.apache.ZooKeeperService:name0=StandaloneServer_port11221
    [junit] 2017-02-21 13:59:22,201 [myid:] - INFO  [main:JUnit4ZKTestRunner$LoggedInvokeMethod@58] - Memory used 9194
    [junit] 2017-02-21 13:59:22,201 [myid:] - INFO  [main:JUnit4ZKTestRunner$LoggedInvokeMethod@63] - Number of threads 20
    [junit] 2017-02-21 13:59:22,201 [myid:] - INFO  [main:JUnit4ZKTestRunner$LoggedInvokeMethod@78] - FINISHED TEST METHOD testQuota
    [junit] 2017-02-21 13:59:22,201 [myid:] - INFO  [main:ClientBase@522] - tearDown starting
    [junit] 2017-02-21 13:59:23,052 [myid:] - INFO  [main:ZooKeeper@684] - Session: 0x15a60f81e9d0000 closed
    [junit] 2017-02-21 13:59:23,052 [myid:] - INFO  [main-EventThread:ClientCnxn$EventThread@519] - EventThread shut down for session: 0x15a60f81e9d0000
    [junit] 2017-02-21 13:59:23,052 [myid:] - INFO  [main:ClientBase@492] - STOPPING server
    [junit] 2017-02-21 13:59:23,054 [myid:] - INFO  [main:ZooKeeperServer@505] - shutting down
    [junit] 2017-02-21 13:59:23,054 [myid:] - ERROR [main:ZooKeeperServer@472] - ZKShutdownHandler is not registered, so ZooKeeper server won't take any action on ERROR or SHUTDOWN server state changes
    [junit] 2017-02-21 13:59:23,054 [myid:] - INFO  [main:SessionTrackerImpl@225] - Shutting down
    [junit] 2017-02-21 13:59:23,054 [myid:] - INFO  [main:PrepRequestProcessor@764] - Shutting down
    [junit] 2017-02-21 13:59:23,054 [myid:] - INFO  [main:SyncRequestProcessor@208] - Shutting down
    [junit] 2017-02-21 13:59:23,054 [myid:] - INFO  [ProcessThread(sid:0 cport:11221)::PrepRequestProcessor@143] - PrepRequestProcessor exited loop!
    [junit] 2017-02-21 13:59:23,055 [myid:] - INFO  [SyncThread:0:SyncRequestProcessor@186] - SyncRequestProcessor exited!
    [junit] 2017-02-21 13:59:23,055 [myid:] - INFO  [main:FinalRequestProcessor@402] - shutdown of request processor complete
    [junit] 2017-02-21 13:59:23,055 [myid:] - INFO  [main:FourLetterWordMain@62] - connecting to 127.0.0.1 11221
    [junit] 2017-02-21 13:59:23,056 [myid:] - INFO  [main:JMXEnv@147] - ensureOnly:[]
    [junit] 2017-02-21 13:59:23,133 [myid:] - INFO  [main:ClientBase@547] - fdcount after test is: 91 at start it was 81
    [junit] 2017-02-21 13:59:23,133 [myid:] - INFO  [main:ClientBase@549] - sleeping for 20 secs
    [junit] 2017-02-21 13:59:23,150 [myid:] - INFO  [main:ZKTestCase$1@65] - SUCCEEDED testQuota
    [junit] 2017-02-21 13:59:23,150 [myid:] - INFO  [main:ZKTestCase$1@60] - FINISHED testQuota
    [junit] Tests run: 1, Failures: 0, Errors: 0, Time elapsed: 6.171 sec

fail.build.on.test.failure:

BUILD FAILED
/zonestorage/hudson_solaris/home/hudson/hudson-slave/workspace/ZooKeeper_branch34_solaris/build.xml:1328: The following error occurred while executing this line:
/zonestorage/hudson_solaris/home/hudson/hudson-slave/workspace/ZooKeeper_branch34_solaris/build.xml:1331: Tests failed!

Total time: 34 minutes 4 seconds
Build step 'Invoke Ant' marked build as failure
[locks-and-latches] Releasing all the locks
[locks-and-latches] All the locks released
Recording test results
Email was triggered for: Failure - Any
Sending email for trigger: Failure - Any



###################################################################################
############################## FAILED TESTS (if any) ##############################
2 tests failed.
FAILED:  org.apache.zookeeper.server.quorum.auth.QuorumKerberosHostBasedAuthTest.testValidCredentials

Error Message:
waiting for server 0 being up

Stack Trace:
junit.framework.AssertionFailedError: waiting for server 0 being up
	at org.apache.zookeeper.server.quorum.auth.QuorumAuthTestBase.startQuorum(QuorumAuthTestBase.java:74)
	at org.apache.zookeeper.server.quorum.auth.QuorumKerberosHostBasedAuthTest.testValidCredentials(QuorumKerberosHostBasedAuthTest.java:125)
	at org.apache.zookeeper.JUnit4ZKTestRunner$LoggedInvokeMethod.evaluate(JUnit4ZKTestRunner.java:55)


FAILED:  org.apache.zookeeper.test.ReadOnlyModeTest.testSessionEstablishment

Error Message:
KeeperErrorCode = ConnectionLoss for /test

Stack Trace:
org.apache.zookeeper.KeeperException$ConnectionLossException: KeeperErrorCode = ConnectionLoss for /test
	at org.apache.zookeeper.KeeperException.create(KeeperException.java:99)
	at org.apache.zookeeper.KeeperException.create(KeeperException.java:51)
	at org.apache.zookeeper.ZooKeeper.create(ZooKeeper.java:783)
	at org.apache.zookeeper.test.ReadOnlyModeTest.testSessionEstablishment(ReadOnlyModeTest.java:216)
	at org.apache.zookeeper.JUnit4ZKTestRunner$LoggedInvokeMethod.evaluate(JUnit4ZKTestRunner.java:55)



ZooKeeper_branch34_solaris - Build # 1480 - Still Failing

Posted by Apache Jenkins Server <je...@builds.apache.org>.
See https://builds.apache.org/job/ZooKeeper_branch34_solaris/1480/

###################################################################################
########################## LAST 60 LINES OF THE CONSOLE ###########################
[...truncated 25.87 MB...]
    [junit] 2017-02-20 13:59:31,940 [myid:] - INFO  [main:PrepRequestProcessor@764] - Shutting down
    [junit] 2017-02-20 13:59:31,940 [myid:] - INFO  [main:SyncRequestProcessor@208] - Shutting down
    [junit] 2017-02-20 13:59:31,940 [myid:] - INFO  [ProcessThread(sid:0 cport:11221)::PrepRequestProcessor@143] - PrepRequestProcessor exited loop!
    [junit] 2017-02-20 13:59:31,941 [myid:] - INFO  [SyncThread:0:SyncRequestProcessor@186] - SyncRequestProcessor exited!
    [junit] 2017-02-20 13:59:31,941 [myid:] - INFO  [main:FinalRequestProcessor@402] - shutdown of request processor complete
    [junit] 2017-02-20 13:59:31,941 [myid:] - INFO  [main:FourLetterWordMain@62] - connecting to 127.0.0.1 11221
    [junit] 2017-02-20 13:59:31,942 [myid:] - INFO  [main:JMXEnv@147] - ensureOnly:[]
    [junit] 2017-02-20 13:59:31,942 [myid:] - INFO  [main:ClientBase@445] - STARTING server
    [junit] 2017-02-20 13:59:31,943 [myid:] - INFO  [main:ClientBase@366] - CREATING server instance 127.0.0.1:11221
    [junit] 2017-02-20 13:59:31,943 [myid:] - INFO  [main:NIOServerCnxnFactory@89] - binding to port 0.0.0.0/0.0.0.0:11221
    [junit] 2017-02-20 13:59:31,943 [myid:] - INFO  [main:ClientBase@341] - STARTING server instance 127.0.0.1:11221
    [junit] 2017-02-20 13:59:31,943 [myid:] - INFO  [main:ZooKeeperServer@173] - Created server with tickTime 3000 minSessionTimeout 6000 maxSessionTimeout 60000 datadir /zonestorage/hudson_solaris/home/hudson/hudson-slave/workspace/ZooKeeper_branch34_solaris/build/test/tmp/test131906833063471163.junit.dir/version-2 snapdir /zonestorage/hudson_solaris/home/hudson/hudson-slave/workspace/ZooKeeper_branch34_solaris/build/test/tmp/test131906833063471163.junit.dir/version-2
    [junit] 2017-02-20 13:59:31,946 [myid:] - ERROR [main:ZooKeeperServer@472] - ZKShutdownHandler is not registered, so ZooKeeper server won't take any action on ERROR or SHUTDOWN server state changes
    [junit] 2017-02-20 13:59:31,946 [myid:] - INFO  [main:FourLetterWordMain@62] - connecting to 127.0.0.1 11221
    [junit] 2017-02-20 13:59:31,947 [myid:] - INFO  [NIOServerCxn.Factory:0.0.0.0/0.0.0.0:11221:NIOServerCnxnFactory@192] - Accepted socket connection from /127.0.0.1:42854
    [junit] 2017-02-20 13:59:31,947 [myid:] - INFO  [NIOServerCxn.Factory:0.0.0.0/0.0.0.0:11221:NIOServerCnxn@838] - Processing stat command from /127.0.0.1:42854
    [junit] 2017-02-20 13:59:31,947 [myid:] - INFO  [Thread-5:NIOServerCnxn$StatCommand@674] - Stat command output
    [junit] 2017-02-20 13:59:31,948 [myid:] - INFO  [Thread-5:NIOServerCnxn@1019] - Closed socket connection for client /127.0.0.1:42854 (no session established for client)
    [junit] 2017-02-20 13:59:31,948 [myid:] - INFO  [main:JMXEnv@230] - ensureParent:[InMemoryDataTree, StandaloneServer_port]
    [junit] 2017-02-20 13:59:31,949 [myid:] - INFO  [main:JMXEnv@247] - expect:InMemoryDataTree
    [junit] 2017-02-20 13:59:31,950 [myid:] - INFO  [main:JMXEnv@251] - found:InMemoryDataTree org.apache.ZooKeeperService:name0=StandaloneServer_port11221,name1=InMemoryDataTree
    [junit] 2017-02-20 13:59:31,950 [myid:] - INFO  [main:JMXEnv@247] - expect:StandaloneServer_port
    [junit] 2017-02-20 13:59:31,950 [myid:] - INFO  [main:JMXEnv@251] - found:StandaloneServer_port org.apache.ZooKeeperService:name0=StandaloneServer_port11221
    [junit] 2017-02-20 13:59:31,950 [myid:] - INFO  [main:JUnit4ZKTestRunner$LoggedInvokeMethod@58] - Memory used 9194
    [junit] 2017-02-20 13:59:31,950 [myid:] - INFO  [main:JUnit4ZKTestRunner$LoggedInvokeMethod@63] - Number of threads 20
    [junit] 2017-02-20 13:59:31,950 [myid:] - INFO  [main:JUnit4ZKTestRunner$LoggedInvokeMethod@78] - FINISHED TEST METHOD testQuota
    [junit] 2017-02-20 13:59:31,951 [myid:] - INFO  [main:ClientBase@522] - tearDown starting
    [junit] 2017-02-20 13:59:32,040 [myid:] - INFO  [main:ZooKeeper@684] - Session: 0x15a5bd1f86d0000 closed
    [junit] 2017-02-20 13:59:32,040 [myid:] - INFO  [main-EventThread:ClientCnxn$EventThread@519] - EventThread shut down for session: 0x15a5bd1f86d0000
    [junit] 2017-02-20 13:59:32,040 [myid:] - INFO  [main:ClientBase@492] - STOPPING server
    [junit] 2017-02-20 13:59:32,042 [myid:] - INFO  [main:ZooKeeperServer@505] - shutting down
    [junit] 2017-02-20 13:59:32,042 [myid:] - ERROR [main:ZooKeeperServer@472] - ZKShutdownHandler is not registered, so ZooKeeper server won't take any action on ERROR or SHUTDOWN server state changes
    [junit] 2017-02-20 13:59:32,042 [myid:] - INFO  [main:SessionTrackerImpl@225] - Shutting down
    [junit] 2017-02-20 13:59:32,042 [myid:] - INFO  [main:PrepRequestProcessor@764] - Shutting down
    [junit] 2017-02-20 13:59:32,042 [myid:] - INFO  [main:SyncRequestProcessor@208] - Shutting down
    [junit] 2017-02-20 13:59:32,042 [myid:] - INFO  [ProcessThread(sid:0 cport:11221)::PrepRequestProcessor@143] - PrepRequestProcessor exited loop!
    [junit] 2017-02-20 13:59:32,043 [myid:] - INFO  [SyncThread:0:SyncRequestProcessor@186] - SyncRequestProcessor exited!
    [junit] 2017-02-20 13:59:32,043 [myid:] - INFO  [main:FinalRequestProcessor@402] - shutdown of request processor complete
    [junit] 2017-02-20 13:59:32,043 [myid:] - INFO  [main:FourLetterWordMain@62] - connecting to 127.0.0.1 11221
    [junit] 2017-02-20 13:59:32,044 [myid:] - INFO  [main:JMXEnv@147] - ensureOnly:[]
    [junit] 2017-02-20 13:59:32,063 [myid:] - INFO  [main:ClientBase@547] - fdcount after test is: 95 at start it was 81
    [junit] 2017-02-20 13:59:32,063 [myid:] - INFO  [main:ClientBase@549] - sleeping for 20 secs
    [junit] 2017-02-20 13:59:32,064 [myid:] - INFO  [main:ZKTestCase$1@65] - SUCCEEDED testQuota
    [junit] 2017-02-20 13:59:32,064 [myid:] - INFO  [main:ZKTestCase$1@60] - FINISHED testQuota
    [junit] Tests run: 1, Failures: 0, Errors: 0, Time elapsed: 3.85 sec

fail.build.on.test.failure:

BUILD FAILED
/zonestorage/hudson_solaris/home/hudson/hudson-slave/workspace/ZooKeeper_branch34_solaris/build.xml:1328: The following error occurred while executing this line:
/zonestorage/hudson_solaris/home/hudson/hudson-slave/workspace/ZooKeeper_branch34_solaris/build.xml:1331: Tests failed!

Total time: 34 minutes 11 seconds
Build step 'Invoke Ant' marked build as failure
[locks-and-latches] Releasing all the locks
[locks-and-latches] All the locks released
Recording test results
Email was triggered for: Failure - Any
Sending email for trigger: Failure - Any



###################################################################################
############################## FAILED TESTS (if any) ##############################
1 tests failed.
FAILED:  org.apache.zookeeper.test.ReadOnlyModeTest.testSessionEstablishment

Error Message:
KeeperErrorCode = ConnectionLoss for /test

Stack Trace:
org.apache.zookeeper.KeeperException$ConnectionLossException: KeeperErrorCode = ConnectionLoss for /test
	at org.apache.zookeeper.KeeperException.create(KeeperException.java:99)
	at org.apache.zookeeper.KeeperException.create(KeeperException.java:51)
	at org.apache.zookeeper.ZooKeeper.create(ZooKeeper.java:783)
	at org.apache.zookeeper.test.ReadOnlyModeTest.testSessionEstablishment(ReadOnlyModeTest.java:216)
	at org.apache.zookeeper.JUnit4ZKTestRunner$LoggedInvokeMethod.evaluate(JUnit4ZKTestRunner.java:55)



ZooKeeper_branch34_solaris - Build # 1479 - Still Failing

Posted by Apache Jenkins Server <je...@builds.apache.org>.
See https://builds.apache.org/job/ZooKeeper_branch34_solaris/1479/

###################################################################################
########################## LAST 60 LINES OF THE CONSOLE ###########################
[...truncated 25.60 MB...]
    [junit] 2017-02-19 13:59:01,009 [myid:] - INFO  [main:PrepRequestProcessor@764] - Shutting down
    [junit] 2017-02-19 13:59:01,009 [myid:] - INFO  [main:SyncRequestProcessor@208] - Shutting down
    [junit] 2017-02-19 13:59:01,009 [myid:] - INFO  [ProcessThread(sid:0 cport:11221)::PrepRequestProcessor@143] - PrepRequestProcessor exited loop!
    [junit] 2017-02-19 13:59:01,009 [myid:] - INFO  [SyncThread:0:SyncRequestProcessor@186] - SyncRequestProcessor exited!
    [junit] 2017-02-19 13:59:01,009 [myid:] - INFO  [main:FinalRequestProcessor@402] - shutdown of request processor complete
    [junit] 2017-02-19 13:59:01,010 [myid:] - INFO  [main:FourLetterWordMain@62] - connecting to 127.0.0.1 11221
    [junit] 2017-02-19 13:59:01,010 [myid:] - INFO  [main:JMXEnv@147] - ensureOnly:[]
    [junit] 2017-02-19 13:59:01,011 [myid:] - INFO  [main:ClientBase@445] - STARTING server
    [junit] 2017-02-19 13:59:01,011 [myid:] - INFO  [main:ClientBase@366] - CREATING server instance 127.0.0.1:11221
    [junit] 2017-02-19 13:59:01,011 [myid:] - INFO  [main:NIOServerCnxnFactory@89] - binding to port 0.0.0.0/0.0.0.0:11221
    [junit] 2017-02-19 13:59:01,012 [myid:] - INFO  [main:ClientBase@341] - STARTING server instance 127.0.0.1:11221
    [junit] 2017-02-19 13:59:01,012 [myid:] - INFO  [main:ZooKeeperServer@173] - Created server with tickTime 3000 minSessionTimeout 6000 maxSessionTimeout 60000 datadir /zonestorage/hudson_solaris/home/hudson/hudson-slave/workspace/ZooKeeper_branch34_solaris/build/test/tmp/test841336337703119053.junit.dir/version-2 snapdir /zonestorage/hudson_solaris/home/hudson/hudson-slave/workspace/ZooKeeper_branch34_solaris/build/test/tmp/test841336337703119053.junit.dir/version-2
    [junit] 2017-02-19 13:59:01,014 [myid:] - ERROR [main:ZooKeeperServer@472] - ZKShutdownHandler is not registered, so ZooKeeper server won't take any action on ERROR or SHUTDOWN server state changes
    [junit] 2017-02-19 13:59:01,014 [myid:] - INFO  [main:FourLetterWordMain@62] - connecting to 127.0.0.1 11221
    [junit] 2017-02-19 13:59:01,015 [myid:] - INFO  [NIOServerCxn.Factory:0.0.0.0/0.0.0.0:11221:NIOServerCnxnFactory@192] - Accepted socket connection from /127.0.0.1:60768
    [junit] 2017-02-19 13:59:01,015 [myid:] - INFO  [NIOServerCxn.Factory:0.0.0.0/0.0.0.0:11221:NIOServerCnxn@838] - Processing stat command from /127.0.0.1:60768
    [junit] 2017-02-19 13:59:01,015 [myid:] - INFO  [Thread-5:NIOServerCnxn$StatCommand@674] - Stat command output
    [junit] 2017-02-19 13:59:01,016 [myid:] - INFO  [Thread-5:NIOServerCnxn@1019] - Closed socket connection for client /127.0.0.1:60768 (no session established for client)
    [junit] 2017-02-19 13:59:01,021 [myid:] - INFO  [main:JMXEnv@230] - ensureParent:[InMemoryDataTree, StandaloneServer_port]
    [junit] 2017-02-19 13:59:01,022 [myid:] - INFO  [main:JMXEnv@247] - expect:InMemoryDataTree
    [junit] 2017-02-19 13:59:01,022 [myid:] - INFO  [main:JMXEnv@251] - found:InMemoryDataTree org.apache.ZooKeeperService:name0=StandaloneServer_port11221,name1=InMemoryDataTree
    [junit] 2017-02-19 13:59:01,023 [myid:] - INFO  [main:JMXEnv@247] - expect:StandaloneServer_port
    [junit] 2017-02-19 13:59:01,023 [myid:] - INFO  [main:JMXEnv@251] - found:StandaloneServer_port org.apache.ZooKeeperService:name0=StandaloneServer_port11221
    [junit] 2017-02-19 13:59:01,024 [myid:] - INFO  [main:JUnit4ZKTestRunner$LoggedInvokeMethod@58] - Memory used 9052
    [junit] 2017-02-19 13:59:01,024 [myid:] - INFO  [main:JUnit4ZKTestRunner$LoggedInvokeMethod@63] - Number of threads 20
    [junit] 2017-02-19 13:59:01,024 [myid:] - INFO  [main:JUnit4ZKTestRunner$LoggedInvokeMethod@78] - FINISHED TEST METHOD testQuota
    [junit] 2017-02-19 13:59:01,024 [myid:] - INFO  [main:ClientBase@522] - tearDown starting
    [junit] 2017-02-19 13:59:01,101 [myid:] - INFO  [main:ZooKeeper@684] - Session: 0x15a56ab23220000 closed
    [junit] 2017-02-19 13:59:01,101 [myid:] - INFO  [main-EventThread:ClientCnxn$EventThread@519] - EventThread shut down for session: 0x15a56ab23220000
    [junit] 2017-02-19 13:59:01,101 [myid:] - INFO  [main:ClientBase@492] - STOPPING server
    [junit] 2017-02-19 13:59:01,102 [myid:] - INFO  [main:ZooKeeperServer@505] - shutting down
    [junit] 2017-02-19 13:59:01,103 [myid:] - ERROR [main:ZooKeeperServer@472] - ZKShutdownHandler is not registered, so ZooKeeper server won't take any action on ERROR or SHUTDOWN server state changes
    [junit] 2017-02-19 13:59:01,103 [myid:] - INFO  [main:SessionTrackerImpl@225] - Shutting down
    [junit] 2017-02-19 13:59:01,103 [myid:] - INFO  [main:PrepRequestProcessor@764] - Shutting down
    [junit] 2017-02-19 13:59:01,103 [myid:] - INFO  [main:SyncRequestProcessor@208] - Shutting down
    [junit] 2017-02-19 13:59:01,103 [myid:] - INFO  [ProcessThread(sid:0 cport:11221)::PrepRequestProcessor@143] - PrepRequestProcessor exited loop!
    [junit] 2017-02-19 13:59:01,103 [myid:] - INFO  [SyncThread:0:SyncRequestProcessor@186] - SyncRequestProcessor exited!
    [junit] 2017-02-19 13:59:01,103 [myid:] - INFO  [main:FinalRequestProcessor@402] - shutdown of request processor complete
    [junit] 2017-02-19 13:59:01,104 [myid:] - INFO  [main:FourLetterWordMain@62] - connecting to 127.0.0.1 11221
    [junit] 2017-02-19 13:59:01,104 [myid:] - INFO  [main:JMXEnv@147] - ensureOnly:[]
    [junit] 2017-02-19 13:59:01,117 [myid:] - INFO  [main:ClientBase@547] - fdcount after test is: 95 at start it was 81
    [junit] 2017-02-19 13:59:01,117 [myid:] - INFO  [main:ClientBase@549] - sleeping for 20 secs
    [junit] 2017-02-19 13:59:01,118 [myid:] - INFO  [main:ZKTestCase$1@65] - SUCCEEDED testQuota
    [junit] 2017-02-19 13:59:01,118 [myid:] - INFO  [main:ZKTestCase$1@60] - FINISHED testQuota
    [junit] Tests run: 1, Failures: 0, Errors: 0, Time elapsed: 1.721 sec

fail.build.on.test.failure:

BUILD FAILED
/zonestorage/hudson_solaris/home/hudson/hudson-slave/workspace/ZooKeeper_branch34_solaris/build.xml:1328: The following error occurred while executing this line:
/zonestorage/hudson_solaris/home/hudson/hudson-slave/workspace/ZooKeeper_branch34_solaris/build.xml:1331: Tests failed!

Total time: 33 minutes 14 seconds
Build step 'Invoke Ant' marked build as failure
[locks-and-latches] Releasing all the locks
[locks-and-latches] All the locks released
Recording test results
Email was triggered for: Failure - Any
Sending email for trigger: Failure - Any



###################################################################################
############################## FAILED TESTS (if any) ##############################
2 tests failed.
FAILED:  org.apache.zookeeper.server.quorum.auth.QuorumKerberosAuthTest.testValidCredentials

Error Message:
waiting for server 2 being up

Stack Trace:
junit.framework.AssertionFailedError: waiting for server 2 being up
	at org.apache.zookeeper.server.quorum.auth.QuorumAuthTestBase.startQuorum(QuorumAuthTestBase.java:74)
	at org.apache.zookeeper.server.quorum.auth.QuorumKerberosAuthTest.testValidCredentials(QuorumKerberosAuthTest.java:101)
	at org.apache.zookeeper.JUnit4ZKTestRunner$LoggedInvokeMethod.evaluate(JUnit4ZKTestRunner.java:55)


FAILED:  org.apache.zookeeper.server.quorum.auth.QuorumKerberosHostBasedAuthTest.testValidCredentials

Error Message:
waiting for server 0 being up

Stack Trace:
junit.framework.AssertionFailedError: waiting for server 0 being up
	at org.apache.zookeeper.server.quorum.auth.QuorumAuthTestBase.startQuorum(QuorumAuthTestBase.java:74)
	at org.apache.zookeeper.server.quorum.auth.QuorumKerberosHostBasedAuthTest.testValidCredentials(QuorumKerberosHostBasedAuthTest.java:125)
	at org.apache.zookeeper.JUnit4ZKTestRunner$LoggedInvokeMethod.evaluate(JUnit4ZKTestRunner.java:55)



ZooKeeper_branch34_solaris - Build # 1478 - Still Failing

Posted by Apache Jenkins Server <je...@builds.apache.org>.
See https://builds.apache.org/job/ZooKeeper_branch34_solaris/1478/

###################################################################################
########################## LAST 60 LINES OF THE CONSOLE ###########################
[...truncated 182 lines...]
     [java] 	at org.apache.tools.ant.taskdefs.Execute.execute(Execute.java:495)
     [java] 	at org.apache.tools.ant.taskdefs.Java.fork(Java.java:791)
     [java] 	... 19 more
     [java] Caused by: java.io.IOException: error=12, Not enough space
     [java] 	at java.lang.UNIXProcess.forkAndExec(Native Method)
     [java] 	at java.lang.UNIXProcess.<init>(UNIXProcess.java:53)
     [java] 	at java.lang.ProcessImpl.start(ProcessImpl.java:65)
     [java] 	at java.lang.ProcessBuilder.start(ProcessBuilder.java:453)
     [java] 	... 24 more
     [java] Java Result: -1
    [touch] Creating /zonestorage/hudson_solaris/home/hudson/hudson-slave/workspace/ZooKeeper_branch34_solaris/src/java/generated/.generated

ver-gen:
    [javac] Compiling 1 source file to /zonestorage/hudson_solaris/home/hudson/hudson-slave/workspace/ZooKeeper_branch34_solaris/build/classes

git-revision:
    [mkdir] Created dir: /zonestorage/hudson_solaris/home/hudson/hudson-slave/workspace/ZooKeeper_branch34_solaris/.revision

BUILD FAILED
/zonestorage/hudson_solaris/home/hudson/hudson-slave/workspace/ZooKeeper_branch34_solaris/build.xml:322: Execute failed: java.io.IOException: Cannot run program "sh": error=12, Not enough space
	at java.lang.ProcessBuilder.start(ProcessBuilder.java:460)
	at java.lang.Runtime.exec(Runtime.java:593)
	at org.apache.tools.ant.taskdefs.Execute$Java13CommandLauncher.exec(Execute.java:862)
	at org.apache.tools.ant.taskdefs.Execute.launch(Execute.java:481)
	at org.apache.tools.ant.taskdefs.Execute.execute(Execute.java:495)
	at org.apache.tools.ant.taskdefs.ExecTask.runExecute(ExecTask.java:631)
	at org.apache.tools.ant.taskdefs.ExecTask.runExec(ExecTask.java:672)
	at org.apache.tools.ant.taskdefs.ExecTask.execute(ExecTask.java:498)
	at org.apache.tools.ant.UnknownElement.execute(UnknownElement.java:291)
	at sun.reflect.GeneratedMethodAccessor4.invoke(Unknown Source)
	at sun.reflect.DelegatingMethodAccessorImpl.invoke(DelegatingMethodAccessorImpl.java:25)
	at java.lang.reflect.Method.invoke(Method.java:597)
	at org.apache.tools.ant.dispatch.DispatchUtils.execute(DispatchUtils.java:106)
	at org.apache.tools.ant.Task.perform(Task.java:348)
	at org.apache.tools.ant.Target.execute(Target.java:390)
	at org.apache.tools.ant.Target.performTasks(Target.java:411)
	at org.apache.tools.ant.Project.executeSortedTargets(Project.java:1399)
	at org.apache.tools.ant.Project.executeTarget(Project.java:1368)
	at org.apache.tools.ant.helper.DefaultExecutor.executeTargets(DefaultExecutor.java:41)
	at org.apache.tools.ant.Project.executeTargets(Project.java:1251)
	at org.apache.tools.ant.Main.runBuild(Main.java:809)
	at org.apache.tools.ant.Main.startAnt(Main.java:217)
	at org.apache.tools.ant.launch.Launcher.run(Launcher.java:280)
	at org.apache.tools.ant.launch.Launcher.main(Launcher.java:109)
Caused by: java.io.IOException: error=12, Not enough space
	at java.lang.UNIXProcess.forkAndExec(Native Method)
	at java.lang.UNIXProcess.<init>(UNIXProcess.java:53)
	at java.lang.ProcessImpl.start(ProcessImpl.java:65)
	at java.lang.ProcessBuilder.start(ProcessBuilder.java:453)
	... 23 more

Total time: 32 seconds
Build step 'Invoke Ant' marked build as failure
[locks-and-latches] Releasing all the locks
[locks-and-latches] All the locks released
Recording test results
ERROR: Step ?Publish JUnit test result report? failed: No test report files were found. Configuration error?
Email was triggered for: Failure - Any
Sending email for trigger: Failure - Any



###################################################################################
############################## FAILED TESTS (if any) ##############################
No tests ran.

ZooKeeper_branch34_solaris - Build # 1477 - Still Failing

Posted by Apache Jenkins Server <je...@builds.apache.org>.
See https://builds.apache.org/job/ZooKeeper_branch34_solaris/1477/

###################################################################################
########################## LAST 60 LINES OF THE CONSOLE ###########################
[...truncated 197511 lines...]
    [junit] 2017-02-17 13:57:15,624 [myid:] - INFO  [main:PrepRequestProcessor@764] - Shutting down
    [junit] 2017-02-17 13:57:15,624 [myid:] - INFO  [main:SyncRequestProcessor@208] - Shutting down
    [junit] 2017-02-17 13:57:15,624 [myid:] - INFO  [ProcessThread(sid:0 cport:11221)::PrepRequestProcessor@143] - PrepRequestProcessor exited loop!
    [junit] 2017-02-17 13:57:15,624 [myid:] - INFO  [SyncThread:0:SyncRequestProcessor@186] - SyncRequestProcessor exited!
    [junit] 2017-02-17 13:57:15,624 [myid:] - INFO  [main:FinalRequestProcessor@402] - shutdown of request processor complete
    [junit] 2017-02-17 13:57:15,625 [myid:] - INFO  [main:FourLetterWordMain@62] - connecting to 127.0.0.1 11221
    [junit] 2017-02-17 13:57:15,625 [myid:] - INFO  [main:JMXEnv@147] - ensureOnly:[]
    [junit] 2017-02-17 13:57:15,626 [myid:] - INFO  [main:ClientBase@445] - STARTING server
    [junit] 2017-02-17 13:57:15,626 [myid:] - INFO  [main:ClientBase@366] - CREATING server instance 127.0.0.1:11221
    [junit] 2017-02-17 13:57:15,627 [myid:] - INFO  [main:NIOServerCnxnFactory@89] - binding to port 0.0.0.0/0.0.0.0:11221
    [junit] 2017-02-17 13:57:15,627 [myid:] - INFO  [main:ClientBase@341] - STARTING server instance 127.0.0.1:11221
    [junit] 2017-02-17 13:57:15,627 [myid:] - INFO  [main:ZooKeeperServer@173] - Created server with tickTime 3000 minSessionTimeout 6000 maxSessionTimeout 60000 datadir /zonestorage/hudson_solaris/home/hudson/hudson-slave/workspace/ZooKeeper_branch34_solaris/build/test/tmp/test3823730168968069792.junit.dir/version-2 snapdir /zonestorage/hudson_solaris/home/hudson/hudson-slave/workspace/ZooKeeper_branch34_solaris/build/test/tmp/test3823730168968069792.junit.dir/version-2
    [junit] 2017-02-17 13:57:15,630 [myid:] - ERROR [main:ZooKeeperServer@472] - ZKShutdownHandler is not registered, so ZooKeeper server won't take any action on ERROR or SHUTDOWN server state changes
    [junit] 2017-02-17 13:57:15,630 [myid:] - INFO  [main:FourLetterWordMain@62] - connecting to 127.0.0.1 11221
    [junit] 2017-02-17 13:57:15,630 [myid:] - INFO  [NIOServerCxn.Factory:0.0.0.0/0.0.0.0:11221:NIOServerCnxnFactory@192] - Accepted socket connection from /127.0.0.1:37612
    [junit] 2017-02-17 13:57:15,630 [myid:] - INFO  [NIOServerCxn.Factory:0.0.0.0/0.0.0.0:11221:NIOServerCnxn@838] - Processing stat command from /127.0.0.1:37612
    [junit] 2017-02-17 13:57:15,631 [myid:] - INFO  [Thread-5:NIOServerCnxn$StatCommand@674] - Stat command output
    [junit] 2017-02-17 13:57:15,631 [myid:] - INFO  [Thread-5:NIOServerCnxn@1019] - Closed socket connection for client /127.0.0.1:37612 (no session established for client)
    [junit] 2017-02-17 13:57:15,631 [myid:] - INFO  [main:JMXEnv@230] - ensureParent:[InMemoryDataTree, StandaloneServer_port]
    [junit] 2017-02-17 13:57:15,632 [myid:] - INFO  [main:JMXEnv@247] - expect:InMemoryDataTree
    [junit] 2017-02-17 13:57:15,632 [myid:] - INFO  [main:JMXEnv@251] - found:InMemoryDataTree org.apache.ZooKeeperService:name0=StandaloneServer_port11221,name1=InMemoryDataTree
    [junit] 2017-02-17 13:57:15,632 [myid:] - INFO  [main:JMXEnv@247] - expect:StandaloneServer_port
    [junit] 2017-02-17 13:57:15,633 [myid:] - INFO  [main:JMXEnv@251] - found:StandaloneServer_port org.apache.ZooKeeperService:name0=StandaloneServer_port11221
    [junit] 2017-02-17 13:57:15,633 [myid:] - INFO  [main:JUnit4ZKTestRunner$LoggedInvokeMethod@58] - Memory used 9049
    [junit] 2017-02-17 13:57:15,633 [myid:] - INFO  [main:JUnit4ZKTestRunner$LoggedInvokeMethod@63] - Number of threads 20
    [junit] 2017-02-17 13:57:15,633 [myid:] - INFO  [main:JUnit4ZKTestRunner$LoggedInvokeMethod@78] - FINISHED TEST METHOD testQuota
    [junit] 2017-02-17 13:57:15,633 [myid:] - INFO  [main:ClientBase@522] - tearDown starting
    [junit] 2017-02-17 13:57:15,712 [myid:] - INFO  [main:ZooKeeper@684] - Session: 0x15a4c5ccf3e0000 closed
    [junit] 2017-02-17 13:57:15,712 [myid:] - INFO  [main-EventThread:ClientCnxn$EventThread@519] - EventThread shut down for session: 0x15a4c5ccf3e0000
    [junit] 2017-02-17 13:57:15,712 [myid:] - INFO  [main:ClientBase@492] - STOPPING server
    [junit] 2017-02-17 13:57:15,712 [myid:] - INFO  [main:ZooKeeperServer@505] - shutting down
    [junit] 2017-02-17 13:57:15,713 [myid:] - ERROR [main:ZooKeeperServer@472] - ZKShutdownHandler is not registered, so ZooKeeper server won't take any action on ERROR or SHUTDOWN server state changes
    [junit] 2017-02-17 13:57:15,713 [myid:] - INFO  [main:SessionTrackerImpl@225] - Shutting down
    [junit] 2017-02-17 13:57:15,713 [myid:] - INFO  [main:PrepRequestProcessor@764] - Shutting down
    [junit] 2017-02-17 13:57:15,713 [myid:] - INFO  [main:SyncRequestProcessor@208] - Shutting down
    [junit] 2017-02-17 13:57:15,713 [myid:] - INFO  [ProcessThread(sid:0 cport:11221)::PrepRequestProcessor@143] - PrepRequestProcessor exited loop!
    [junit] 2017-02-17 13:57:15,713 [myid:] - INFO  [SyncThread:0:SyncRequestProcessor@186] - SyncRequestProcessor exited!
    [junit] 2017-02-17 13:57:15,714 [myid:] - INFO  [main:FinalRequestProcessor@402] - shutdown of request processor complete
    [junit] 2017-02-17 13:57:15,714 [myid:] - INFO  [main:FourLetterWordMain@62] - connecting to 127.0.0.1 11221
    [junit] 2017-02-17 13:57:15,714 [myid:] - INFO  [main:JMXEnv@147] - ensureOnly:[]
    [junit] 2017-02-17 13:57:15,717 [myid:] - INFO  [main:ClientBase@547] - fdcount after test is: 95 at start it was 81
    [junit] 2017-02-17 13:57:15,718 [myid:] - INFO  [main:ClientBase@549] - sleeping for 20 secs
    [junit] 2017-02-17 13:57:15,718 [myid:] - INFO  [main:ZKTestCase$1@65] - SUCCEEDED testQuota
    [junit] 2017-02-17 13:57:15,719 [myid:] - INFO  [main:ZKTestCase$1@60] - FINISHED testQuota
    [junit] Tests run: 1, Failures: 0, Errors: 0, Time elapsed: 1.368 sec

fail.build.on.test.failure:

BUILD FAILED
/zonestorage/hudson_solaris/home/hudson/hudson-slave/workspace/ZooKeeper_branch34_solaris/build.xml:1328: The following error occurred while executing this line:
/zonestorage/hudson_solaris/home/hudson/hudson-slave/workspace/ZooKeeper_branch34_solaris/build.xml:1331: Tests failed!

Total time: 32 minutes 18 seconds
Build step 'Invoke Ant' marked build as failure
[locks-and-latches] Releasing all the locks
[locks-and-latches] All the locks released
Recording test results
Email was triggered for: Failure - Any
Sending email for trigger: Failure - Any



###################################################################################
############################## FAILED TESTS (if any) ##############################
2 tests failed.
FAILED:  org.apache.zookeeper.server.quorum.auth.QuorumKerberosAuthTest.testValidCredentials

Error Message:
waiting for server 2 being up

Stack Trace:
junit.framework.AssertionFailedError: waiting for server 2 being up
	at org.apache.zookeeper.server.quorum.auth.QuorumAuthTestBase.startQuorum(QuorumAuthTestBase.java:74)
	at org.apache.zookeeper.server.quorum.auth.QuorumKerberosAuthTest.testValidCredentials(QuorumKerberosAuthTest.java:101)
	at org.apache.zookeeper.JUnit4ZKTestRunner$LoggedInvokeMethod.evaluate(JUnit4ZKTestRunner.java:55)


FAILED:  org.apache.zookeeper.server.quorum.auth.QuorumKerberosHostBasedAuthTest.testValidCredentials

Error Message:
waiting for server 0 being up

Stack Trace:
junit.framework.AssertionFailedError: waiting for server 0 being up
	at org.apache.zookeeper.server.quorum.auth.QuorumAuthTestBase.startQuorum(QuorumAuthTestBase.java:74)
	at org.apache.zookeeper.server.quorum.auth.QuorumKerberosHostBasedAuthTest.testValidCredentials(QuorumKerberosHostBasedAuthTest.java:125)
	at org.apache.zookeeper.JUnit4ZKTestRunner$LoggedInvokeMethod.evaluate(JUnit4ZKTestRunner.java:55)



ZooKeeper_branch34_solaris - Build # 1476 - Still Failing

Posted by Apache Jenkins Server <je...@builds.apache.org>.
See https://builds.apache.org/job/ZooKeeper_branch34_solaris/1476/

###################################################################################
########################## LAST 60 LINES OF THE CONSOLE ###########################
[...truncated 198868 lines...]
    [junit] 2017-02-16 13:57:34,456 [myid:] - INFO  [main:PrepRequestProcessor@764] - Shutting down
    [junit] 2017-02-16 13:57:34,456 [myid:] - INFO  [main:SyncRequestProcessor@208] - Shutting down
    [junit] 2017-02-16 13:57:34,456 [myid:] - INFO  [ProcessThread(sid:0 cport:11221)::PrepRequestProcessor@143] - PrepRequestProcessor exited loop!
    [junit] 2017-02-16 13:57:34,456 [myid:] - INFO  [SyncThread:0:SyncRequestProcessor@186] - SyncRequestProcessor exited!
    [junit] 2017-02-16 13:57:34,456 [myid:] - INFO  [main:FinalRequestProcessor@402] - shutdown of request processor complete
    [junit] 2017-02-16 13:57:34,457 [myid:] - INFO  [main:FourLetterWordMain@62] - connecting to 127.0.0.1 11221
    [junit] 2017-02-16 13:57:34,457 [myid:] - INFO  [main:JMXEnv@147] - ensureOnly:[]
    [junit] 2017-02-16 13:57:34,458 [myid:] - INFO  [main:ClientBase@445] - STARTING server
    [junit] 2017-02-16 13:57:34,458 [myid:] - INFO  [main:ClientBase@366] - CREATING server instance 127.0.0.1:11221
    [junit] 2017-02-16 13:57:34,459 [myid:] - INFO  [main:NIOServerCnxnFactory@89] - binding to port 0.0.0.0/0.0.0.0:11221
    [junit] 2017-02-16 13:57:34,459 [myid:] - INFO  [main:ClientBase@341] - STARTING server instance 127.0.0.1:11221
    [junit] 2017-02-16 13:57:34,459 [myid:] - INFO  [main:ZooKeeperServer@173] - Created server with tickTime 3000 minSessionTimeout 6000 maxSessionTimeout 60000 datadir /zonestorage/hudson_solaris/home/hudson/hudson-slave/workspace/ZooKeeper_branch34_solaris/build/test/tmp/test4886073594453752273.junit.dir/version-2 snapdir /zonestorage/hudson_solaris/home/hudson/hudson-slave/workspace/ZooKeeper_branch34_solaris/build/test/tmp/test4886073594453752273.junit.dir/version-2
    [junit] 2017-02-16 13:57:34,462 [myid:] - ERROR [main:ZooKeeperServer@472] - ZKShutdownHandler is not registered, so ZooKeeper server won't take any action on ERROR or SHUTDOWN server state changes
    [junit] 2017-02-16 13:57:34,462 [myid:] - INFO  [main:FourLetterWordMain@62] - connecting to 127.0.0.1 11221
    [junit] 2017-02-16 13:57:34,463 [myid:] - INFO  [NIOServerCxn.Factory:0.0.0.0/0.0.0.0:11221:NIOServerCnxnFactory@192] - Accepted socket connection from /127.0.0.1:55703
    [junit] 2017-02-16 13:57:34,463 [myid:] - INFO  [NIOServerCxn.Factory:0.0.0.0/0.0.0.0:11221:NIOServerCnxn@838] - Processing stat command from /127.0.0.1:55703
    [junit] 2017-02-16 13:57:34,464 [myid:] - INFO  [Thread-5:NIOServerCnxn$StatCommand@674] - Stat command output
    [junit] 2017-02-16 13:57:34,465 [myid:] - INFO  [Thread-5:NIOServerCnxn@1019] - Closed socket connection for client /127.0.0.1:55703 (no session established for client)
    [junit] 2017-02-16 13:57:34,465 [myid:] - INFO  [main:JMXEnv@230] - ensureParent:[InMemoryDataTree, StandaloneServer_port]
    [junit] 2017-02-16 13:57:34,466 [myid:] - INFO  [main:JMXEnv@247] - expect:InMemoryDataTree
    [junit] 2017-02-16 13:57:34,467 [myid:] - INFO  [main:JMXEnv@251] - found:InMemoryDataTree org.apache.ZooKeeperService:name0=StandaloneServer_port11221,name1=InMemoryDataTree
    [junit] 2017-02-16 13:57:34,467 [myid:] - INFO  [main:JMXEnv@247] - expect:StandaloneServer_port
    [junit] 2017-02-16 13:57:34,467 [myid:] - INFO  [main:JMXEnv@251] - found:StandaloneServer_port org.apache.ZooKeeperService:name0=StandaloneServer_port11221
    [junit] 2017-02-16 13:57:34,467 [myid:] - INFO  [main:JUnit4ZKTestRunner$LoggedInvokeMethod@58] - Memory used 9360
    [junit] 2017-02-16 13:57:34,467 [myid:] - INFO  [main:JUnit4ZKTestRunner$LoggedInvokeMethod@63] - Number of threads 20
    [junit] 2017-02-16 13:57:34,468 [myid:] - INFO  [main:JUnit4ZKTestRunner$LoggedInvokeMethod@78] - FINISHED TEST METHOD testQuota
    [junit] 2017-02-16 13:57:34,468 [myid:] - INFO  [main:ClientBase@522] - tearDown starting
    [junit] 2017-02-16 13:57:34,542 [myid:] - INFO  [main:ZooKeeper@684] - Session: 0x15a4736bb360000 closed
    [junit] 2017-02-16 13:57:34,542 [myid:] - INFO  [main:ClientBase@492] - STOPPING server
    [junit] 2017-02-16 13:57:34,542 [myid:] - INFO  [main-EventThread:ClientCnxn$EventThread@519] - EventThread shut down for session: 0x15a4736bb360000
    [junit] 2017-02-16 13:57:34,543 [myid:] - INFO  [main:ZooKeeperServer@505] - shutting down
    [junit] 2017-02-16 13:57:34,543 [myid:] - ERROR [main:ZooKeeperServer@472] - ZKShutdownHandler is not registered, so ZooKeeper server won't take any action on ERROR or SHUTDOWN server state changes
    [junit] 2017-02-16 13:57:34,543 [myid:] - INFO  [main:SessionTrackerImpl@225] - Shutting down
    [junit] 2017-02-16 13:57:34,544 [myid:] - INFO  [main:PrepRequestProcessor@764] - Shutting down
    [junit] 2017-02-16 13:57:34,544 [myid:] - INFO  [main:SyncRequestProcessor@208] - Shutting down
    [junit] 2017-02-16 13:57:34,544 [myid:] - INFO  [ProcessThread(sid:0 cport:11221)::PrepRequestProcessor@143] - PrepRequestProcessor exited loop!
    [junit] 2017-02-16 13:57:34,544 [myid:] - INFO  [SyncThread:0:SyncRequestProcessor@186] - SyncRequestProcessor exited!
    [junit] 2017-02-16 13:57:34,546 [myid:] - INFO  [main:FinalRequestProcessor@402] - shutdown of request processor complete
    [junit] 2017-02-16 13:57:34,546 [myid:] - INFO  [main:FourLetterWordMain@62] - connecting to 127.0.0.1 11221
    [junit] 2017-02-16 13:57:34,547 [myid:] - INFO  [main:JMXEnv@147] - ensureOnly:[]
    [junit] 2017-02-16 13:57:34,644 [myid:] - INFO  [main:ClientBase@547] - fdcount after test is: 95 at start it was 81
    [junit] 2017-02-16 13:57:34,644 [myid:] - INFO  [main:ClientBase@549] - sleeping for 20 secs
    [junit] 2017-02-16 13:57:34,644 [myid:] - INFO  [main:ZKTestCase$1@65] - SUCCEEDED testQuota
    [junit] 2017-02-16 13:57:34,645 [myid:] - INFO  [main:ZKTestCase$1@60] - FINISHED testQuota
    [junit] Tests run: 1, Failures: 0, Errors: 0, Time elapsed: 9.971 sec

fail.build.on.test.failure:

BUILD FAILED
/zonestorage/hudson_solaris/home/hudson/hudson-slave/workspace/ZooKeeper_branch34_solaris/build.xml:1328: The following error occurred while executing this line:
/zonestorage/hudson_solaris/home/hudson/hudson-slave/workspace/ZooKeeper_branch34_solaris/build.xml:1331: Tests failed!

Total time: 31 minutes 41 seconds
Build step 'Invoke Ant' marked build as failure
[locks-and-latches] Releasing all the locks
[locks-and-latches] All the locks released
Recording test results
Email was triggered for: Failure - Any
Sending email for trigger: Failure - Any



###################################################################################
############################## FAILED TESTS (if any) ##############################
1 tests failed.
FAILED:  org.apache.zookeeper.server.quorum.auth.QuorumKerberosHostBasedAuthTest.testValidCredentials

Error Message:
waiting for server 0 being up

Stack Trace:
junit.framework.AssertionFailedError: waiting for server 0 being up
	at org.apache.zookeeper.server.quorum.auth.QuorumAuthTestBase.startQuorum(QuorumAuthTestBase.java:74)
	at org.apache.zookeeper.server.quorum.auth.QuorumKerberosHostBasedAuthTest.testValidCredentials(QuorumKerberosHostBasedAuthTest.java:125)
	at org.apache.zookeeper.JUnit4ZKTestRunner$LoggedInvokeMethod.evaluate(JUnit4ZKTestRunner.java:55)



ZooKeeper_branch34_solaris - Build # 1475 - Still Failing

Posted by Apache Jenkins Server <je...@builds.apache.org>.
See https://builds.apache.org/job/ZooKeeper_branch34_solaris/1475/

###################################################################################
########################## LAST 60 LINES OF THE CONSOLE ###########################
[...truncated 193574 lines...]
    [junit] 2017-02-16 00:59:37,829 [myid:] - INFO  [main:PrepRequestProcessor@764] - Shutting down
    [junit] 2017-02-16 00:59:37,830 [myid:] - INFO  [main:SyncRequestProcessor@208] - Shutting down
    [junit] 2017-02-16 00:59:37,830 [myid:] - INFO  [ProcessThread(sid:0 cport:11221)::PrepRequestProcessor@143] - PrepRequestProcessor exited loop!
    [junit] 2017-02-16 00:59:37,830 [myid:] - INFO  [SyncThread:0:SyncRequestProcessor@186] - SyncRequestProcessor exited!
    [junit] 2017-02-16 00:59:37,830 [myid:] - INFO  [main:FinalRequestProcessor@402] - shutdown of request processor complete
    [junit] 2017-02-16 00:59:37,830 [myid:] - INFO  [main:FourLetterWordMain@62] - connecting to 127.0.0.1 11221
    [junit] 2017-02-16 00:59:37,831 [myid:] - INFO  [main:JMXEnv@147] - ensureOnly:[]
    [junit] 2017-02-16 00:59:37,832 [myid:] - INFO  [main:ClientBase@445] - STARTING server
    [junit] 2017-02-16 00:59:37,832 [myid:] - INFO  [main:ClientBase@366] - CREATING server instance 127.0.0.1:11221
    [junit] 2017-02-16 00:59:37,832 [myid:] - INFO  [main:NIOServerCnxnFactory@89] - binding to port 0.0.0.0/0.0.0.0:11221
    [junit] 2017-02-16 00:59:37,832 [myid:] - INFO  [main:ClientBase@341] - STARTING server instance 127.0.0.1:11221
    [junit] 2017-02-16 00:59:37,833 [myid:] - INFO  [main:ZooKeeperServer@173] - Created server with tickTime 3000 minSessionTimeout 6000 maxSessionTimeout 60000 datadir /zonestorage/hudson_solaris/home/hudson/hudson-slave/workspace/ZooKeeper_branch34_solaris/build/test/tmp/test1505515527671075896.junit.dir/version-2 snapdir /zonestorage/hudson_solaris/home/hudson/hudson-slave/workspace/ZooKeeper_branch34_solaris/build/test/tmp/test1505515527671075896.junit.dir/version-2
    [junit] 2017-02-16 00:59:37,835 [myid:] - ERROR [main:ZooKeeperServer@472] - ZKShutdownHandler is not registered, so ZooKeeper server won't take any action on ERROR or SHUTDOWN server state changes
    [junit] 2017-02-16 00:59:37,835 [myid:] - INFO  [main:FourLetterWordMain@62] - connecting to 127.0.0.1 11221
    [junit] 2017-02-16 00:59:37,836 [myid:] - INFO  [NIOServerCxn.Factory:0.0.0.0/0.0.0.0:11221:NIOServerCnxnFactory@192] - Accepted socket connection from /127.0.0.1:53694
    [junit] 2017-02-16 00:59:37,836 [myid:] - INFO  [NIOServerCxn.Factory:0.0.0.0/0.0.0.0:11221:NIOServerCnxn@838] - Processing stat command from /127.0.0.1:53694
    [junit] 2017-02-16 00:59:37,836 [myid:] - INFO  [Thread-5:NIOServerCnxn$StatCommand@674] - Stat command output
    [junit] 2017-02-16 00:59:37,837 [myid:] - INFO  [Thread-5:NIOServerCnxn@1019] - Closed socket connection for client /127.0.0.1:53694 (no session established for client)
    [junit] 2017-02-16 00:59:37,837 [myid:] - INFO  [main:JMXEnv@230] - ensureParent:[InMemoryDataTree, StandaloneServer_port]
    [junit] 2017-02-16 00:59:37,838 [myid:] - INFO  [main:JMXEnv@247] - expect:InMemoryDataTree
    [junit] 2017-02-16 00:59:37,838 [myid:] - INFO  [main:JMXEnv@251] - found:InMemoryDataTree org.apache.ZooKeeperService:name0=StandaloneServer_port11221,name1=InMemoryDataTree
    [junit] 2017-02-16 00:59:37,838 [myid:] - INFO  [main:JMXEnv@247] - expect:StandaloneServer_port
    [junit] 2017-02-16 00:59:37,838 [myid:] - INFO  [main:JMXEnv@251] - found:StandaloneServer_port org.apache.ZooKeeperService:name0=StandaloneServer_port11221
    [junit] 2017-02-16 00:59:37,839 [myid:] - INFO  [main:JUnit4ZKTestRunner$LoggedInvokeMethod@58] - Memory used 9192
    [junit] 2017-02-16 00:59:37,839 [myid:] - INFO  [main:JUnit4ZKTestRunner$LoggedInvokeMethod@63] - Number of threads 20
    [junit] 2017-02-16 00:59:37,839 [myid:] - INFO  [main:JUnit4ZKTestRunner$LoggedInvokeMethod@78] - FINISHED TEST METHOD testQuota
    [junit] 2017-02-16 00:59:37,839 [myid:] - INFO  [main:ClientBase@522] - tearDown starting
    [junit] 2017-02-16 00:59:37,921 [myid:] - INFO  [main:ZooKeeper@684] - Session: 0x15a446e833f0000 closed
    [junit] 2017-02-16 00:59:37,922 [myid:] - INFO  [main-EventThread:ClientCnxn$EventThread@519] - EventThread shut down for session: 0x15a446e833f0000
    [junit] 2017-02-16 00:59:37,922 [myid:] - INFO  [main:ClientBase@492] - STOPPING server
    [junit] 2017-02-16 00:59:37,922 [myid:] - INFO  [main:ZooKeeperServer@505] - shutting down
    [junit] 2017-02-16 00:59:37,922 [myid:] - ERROR [main:ZooKeeperServer@472] - ZKShutdownHandler is not registered, so ZooKeeper server won't take any action on ERROR or SHUTDOWN server state changes
    [junit] 2017-02-16 00:59:37,922 [myid:] - INFO  [main:SessionTrackerImpl@225] - Shutting down
    [junit] 2017-02-16 00:59:37,923 [myid:] - INFO  [main:PrepRequestProcessor@764] - Shutting down
    [junit] 2017-02-16 00:59:37,923 [myid:] - INFO  [main:SyncRequestProcessor@208] - Shutting down
    [junit] 2017-02-16 00:59:37,923 [myid:] - INFO  [ProcessThread(sid:0 cport:11221)::PrepRequestProcessor@143] - PrepRequestProcessor exited loop!
    [junit] 2017-02-16 00:59:37,923 [myid:] - INFO  [SyncThread:0:SyncRequestProcessor@186] - SyncRequestProcessor exited!
    [junit] 2017-02-16 00:59:37,923 [myid:] - INFO  [main:FinalRequestProcessor@402] - shutdown of request processor complete
    [junit] 2017-02-16 00:59:37,924 [myid:] - INFO  [main:FourLetterWordMain@62] - connecting to 127.0.0.1 11221
    [junit] 2017-02-16 00:59:37,924 [myid:] - INFO  [main:JMXEnv@147] - ensureOnly:[]
    [junit] 2017-02-16 00:59:37,927 [myid:] - INFO  [main:ClientBase@547] - fdcount after test is: 95 at start it was 81
    [junit] 2017-02-16 00:59:37,927 [myid:] - INFO  [main:ClientBase@549] - sleeping for 20 secs
    [junit] 2017-02-16 00:59:37,928 [myid:] - INFO  [main:ZKTestCase$1@65] - SUCCEEDED testQuota
    [junit] 2017-02-16 00:59:37,928 [myid:] - INFO  [main:ZKTestCase$1@60] - FINISHED testQuota
    [junit] Tests run: 1, Failures: 0, Errors: 0, Time elapsed: 0.893 sec

fail.build.on.test.failure:

BUILD FAILED
/zonestorage/hudson_solaris/home/hudson/hudson-slave/workspace/ZooKeeper_branch34_solaris/build.xml:1328: The following error occurred while executing this line:
/zonestorage/hudson_solaris/home/hudson/hudson-slave/workspace/ZooKeeper_branch34_solaris/build.xml:1331: Tests failed!

Total time: 35 minutes 10 seconds
Build step 'Invoke Ant' marked build as failure
[locks-and-latches] Releasing all the locks
[locks-and-latches] All the locks released
Recording test results
Email was triggered for: Failure - Any
Sending email for trigger: Failure - Any



###################################################################################
############################## FAILED TESTS (if any) ##############################
2 tests failed.
FAILED:  org.apache.zookeeper.server.quorum.auth.QuorumKerberosHostBasedAuthTest.testValidCredentials

Error Message:
waiting for server 0 being up

Stack Trace:
junit.framework.AssertionFailedError: waiting for server 0 being up
	at org.apache.zookeeper.server.quorum.auth.QuorumAuthTestBase.startQuorum(QuorumAuthTestBase.java:74)
	at org.apache.zookeeper.server.quorum.auth.QuorumKerberosHostBasedAuthTest.testValidCredentials(QuorumKerberosHostBasedAuthTest.java:125)
	at org.apache.zookeeper.JUnit4ZKTestRunner$LoggedInvokeMethod.evaluate(JUnit4ZKTestRunner.java:55)


FAILED:  org.apache.zookeeper.server.quorum.auth.QuorumKerberosAuthTest.testValidCredentials

Error Message:
waiting for server 2 being up

Stack Trace:
junit.framework.AssertionFailedError: waiting for server 2 being up
	at org.apache.zookeeper.server.quorum.auth.QuorumAuthTestBase.startQuorum(QuorumAuthTestBase.java:74)
	at org.apache.zookeeper.server.quorum.auth.QuorumKerberosAuthTest.testValidCredentials(QuorumKerberosAuthTest.java:101)
	at org.apache.zookeeper.JUnit4ZKTestRunner$LoggedInvokeMethod.evaluate(JUnit4ZKTestRunner.java:55)



ZooKeeper_branch34_solaris - Build # 1474 - Still Failing

Posted by Apache Jenkins Server <je...@builds.apache.org>.
See https://builds.apache.org/job/ZooKeeper_branch34_solaris/1474/

###################################################################################
########################## LAST 60 LINES OF THE CONSOLE ###########################
[...truncated 198592 lines...]
    [junit] 2017-02-15 13:59:33,664 [myid:] - INFO  [main:PrepRequestProcessor@764] - Shutting down
    [junit] 2017-02-15 13:59:33,664 [myid:] - INFO  [main:SyncRequestProcessor@208] - Shutting down
    [junit] 2017-02-15 13:59:33,664 [myid:] - INFO  [ProcessThread(sid:0 cport:11221)::PrepRequestProcessor@143] - PrepRequestProcessor exited loop!
    [junit] 2017-02-15 13:59:33,664 [myid:] - INFO  [SyncThread:0:SyncRequestProcessor@186] - SyncRequestProcessor exited!
    [junit] 2017-02-15 13:59:33,664 [myid:] - INFO  [main:FinalRequestProcessor@402] - shutdown of request processor complete
    [junit] 2017-02-15 13:59:33,665 [myid:] - INFO  [main:FourLetterWordMain@62] - connecting to 127.0.0.1 11221
    [junit] 2017-02-15 13:59:33,665 [myid:] - INFO  [main:JMXEnv@147] - ensureOnly:[]
    [junit] 2017-02-15 13:59:33,666 [myid:] - INFO  [main:ClientBase@445] - STARTING server
    [junit] 2017-02-15 13:59:33,666 [myid:] - INFO  [main:ClientBase@366] - CREATING server instance 127.0.0.1:11221
    [junit] 2017-02-15 13:59:33,666 [myid:] - INFO  [main:NIOServerCnxnFactory@89] - binding to port 0.0.0.0/0.0.0.0:11221
    [junit] 2017-02-15 13:59:33,666 [myid:] - INFO  [main:ClientBase@341] - STARTING server instance 127.0.0.1:11221
    [junit] 2017-02-15 13:59:33,667 [myid:] - INFO  [main:ZooKeeperServer@173] - Created server with tickTime 3000 minSessionTimeout 6000 maxSessionTimeout 60000 datadir /zonestorage/hudson_solaris/home/hudson/hudson-slave/workspace/ZooKeeper_branch34_solaris/build/test/tmp/test2054658975990470913.junit.dir/version-2 snapdir /zonestorage/hudson_solaris/home/hudson/hudson-slave/workspace/ZooKeeper_branch34_solaris/build/test/tmp/test2054658975990470913.junit.dir/version-2
    [junit] 2017-02-15 13:59:33,669 [myid:] - ERROR [main:ZooKeeperServer@472] - ZKShutdownHandler is not registered, so ZooKeeper server won't take any action on ERROR or SHUTDOWN server state changes
    [junit] 2017-02-15 13:59:33,669 [myid:] - INFO  [main:FourLetterWordMain@62] - connecting to 127.0.0.1 11221
    [junit] 2017-02-15 13:59:33,670 [myid:] - INFO  [NIOServerCxn.Factory:0.0.0.0/0.0.0.0:11221:NIOServerCnxnFactory@192] - Accepted socket connection from /127.0.0.1:38950
    [junit] 2017-02-15 13:59:33,670 [myid:] - INFO  [NIOServerCxn.Factory:0.0.0.0/0.0.0.0:11221:NIOServerCnxn@838] - Processing stat command from /127.0.0.1:38950
    [junit] 2017-02-15 13:59:33,671 [myid:] - INFO  [Thread-5:NIOServerCnxn$StatCommand@674] - Stat command output
    [junit] 2017-02-15 13:59:33,671 [myid:] - INFO  [Thread-5:NIOServerCnxn@1019] - Closed socket connection for client /127.0.0.1:38950 (no session established for client)
    [junit] 2017-02-15 13:59:33,672 [myid:] - INFO  [main:JMXEnv@230] - ensureParent:[InMemoryDataTree, StandaloneServer_port]
    [junit] 2017-02-15 13:59:33,672 [myid:] - INFO  [main:JMXEnv@247] - expect:InMemoryDataTree
    [junit] 2017-02-15 13:59:33,673 [myid:] - INFO  [main:JMXEnv@251] - found:InMemoryDataTree org.apache.ZooKeeperService:name0=StandaloneServer_port11221,name1=InMemoryDataTree
    [junit] 2017-02-15 13:59:33,673 [myid:] - INFO  [main:JMXEnv@247] - expect:StandaloneServer_port
    [junit] 2017-02-15 13:59:33,673 [myid:] - INFO  [main:JMXEnv@251] - found:StandaloneServer_port org.apache.ZooKeeperService:name0=StandaloneServer_port11221
    [junit] 2017-02-15 13:59:33,673 [myid:] - INFO  [main:JUnit4ZKTestRunner$LoggedInvokeMethod@58] - Memory used 9049
    [junit] 2017-02-15 13:59:33,673 [myid:] - INFO  [main:JUnit4ZKTestRunner$LoggedInvokeMethod@63] - Number of threads 20
    [junit] 2017-02-15 13:59:33,674 [myid:] - INFO  [main:JUnit4ZKTestRunner$LoggedInvokeMethod@78] - FINISHED TEST METHOD testQuota
    [junit] 2017-02-15 13:59:33,674 [myid:] - INFO  [main:ClientBase@522] - tearDown starting
    [junit] 2017-02-15 13:59:33,752 [myid:] - INFO  [main:ZooKeeper@684] - Session: 0x15a421232f50000 closed
    [junit] 2017-02-15 13:59:33,752 [myid:] - INFO  [main:ClientBase@492] - STOPPING server
    [junit] 2017-02-15 13:59:33,752 [myid:] - INFO  [main-EventThread:ClientCnxn$EventThread@519] - EventThread shut down for session: 0x15a421232f50000
    [junit] 2017-02-15 13:59:33,754 [myid:] - INFO  [main:ZooKeeperServer@505] - shutting down
    [junit] 2017-02-15 13:59:33,754 [myid:] - ERROR [main:ZooKeeperServer@472] - ZKShutdownHandler is not registered, so ZooKeeper server won't take any action on ERROR or SHUTDOWN server state changes
    [junit] 2017-02-15 13:59:33,754 [myid:] - INFO  [main:SessionTrackerImpl@225] - Shutting down
    [junit] 2017-02-15 13:59:33,754 [myid:] - INFO  [main:PrepRequestProcessor@764] - Shutting down
    [junit] 2017-02-15 13:59:33,755 [myid:] - INFO  [main:SyncRequestProcessor@208] - Shutting down
    [junit] 2017-02-15 13:59:33,755 [myid:] - INFO  [ProcessThread(sid:0 cport:11221)::PrepRequestProcessor@143] - PrepRequestProcessor exited loop!
    [junit] 2017-02-15 13:59:33,755 [myid:] - INFO  [SyncThread:0:SyncRequestProcessor@186] - SyncRequestProcessor exited!
    [junit] 2017-02-15 13:59:33,755 [myid:] - INFO  [main:FinalRequestProcessor@402] - shutdown of request processor complete
    [junit] 2017-02-15 13:59:33,756 [myid:] - INFO  [main:FourLetterWordMain@62] - connecting to 127.0.0.1 11221
    [junit] 2017-02-15 13:59:33,756 [myid:] - INFO  [main:JMXEnv@147] - ensureOnly:[]
    [junit] 2017-02-15 13:59:33,780 [myid:] - INFO  [main:ClientBase@547] - fdcount after test is: 95 at start it was 81
    [junit] 2017-02-15 13:59:33,781 [myid:] - INFO  [main:ClientBase@549] - sleeping for 20 secs
    [junit] 2017-02-15 13:59:33,781 [myid:] - INFO  [main:ZKTestCase$1@65] - SUCCEEDED testQuota
    [junit] 2017-02-15 13:59:33,782 [myid:] - INFO  [main:ZKTestCase$1@60] - FINISHED testQuota
    [junit] Tests run: 1, Failures: 0, Errors: 0, Time elapsed: 1.46 sec

fail.build.on.test.failure:

BUILD FAILED
/zonestorage/hudson_solaris/home/hudson/hudson-slave/workspace/ZooKeeper_branch34_solaris/build.xml:1328: The following error occurred while executing this line:
/zonestorage/hudson_solaris/home/hudson/hudson-slave/workspace/ZooKeeper_branch34_solaris/build.xml:1331: Tests failed!

Total time: 33 minutes 25 seconds
Build step 'Invoke Ant' marked build as failure
[locks-and-latches] Releasing all the locks
[locks-and-latches] All the locks released
Recording test results
Email was triggered for: Failure - Any
Sending email for trigger: Failure - Any



###################################################################################
############################## FAILED TESTS (if any) ##############################
1 tests failed.
FAILED:  org.apache.zookeeper.server.quorum.auth.QuorumKerberosAuthTest.testValidCredentials

Error Message:
waiting for server 0 being up

Stack Trace:
junit.framework.AssertionFailedError: waiting for server 0 being up
	at org.apache.zookeeper.server.quorum.auth.QuorumAuthTestBase.startQuorum(QuorumAuthTestBase.java:74)
	at org.apache.zookeeper.server.quorum.auth.QuorumKerberosAuthTest.testValidCredentials(QuorumKerberosAuthTest.java:101)
	at org.apache.zookeeper.JUnit4ZKTestRunner$LoggedInvokeMethod.evaluate(JUnit4ZKTestRunner.java:55)



ZooKeeper_branch34_solaris - Build # 1473 - Still Failing

Posted by Apache Jenkins Server <je...@builds.apache.org>.
See https://builds.apache.org/job/ZooKeeper_branch34_solaris/1473/

###################################################################################
########################## LAST 60 LINES OF THE CONSOLE ###########################
[...truncated 196302 lines...]
    [junit] 2017-02-14 18:56:01,613 [myid:] - INFO  [main:PrepRequestProcessor@764] - Shutting down
    [junit] 2017-02-14 18:56:01,614 [myid:] - INFO  [main:SyncRequestProcessor@208] - Shutting down
    [junit] 2017-02-14 18:56:01,614 [myid:] - INFO  [ProcessThread(sid:0 cport:11221)::PrepRequestProcessor@143] - PrepRequestProcessor exited loop!
    [junit] 2017-02-14 18:56:01,614 [myid:] - INFO  [SyncThread:0:SyncRequestProcessor@186] - SyncRequestProcessor exited!
    [junit] 2017-02-14 18:56:01,614 [myid:] - INFO  [main:FinalRequestProcessor@402] - shutdown of request processor complete
    [junit] 2017-02-14 18:56:01,614 [myid:] - INFO  [main:FourLetterWordMain@62] - connecting to 127.0.0.1 11221
    [junit] 2017-02-14 18:56:01,615 [myid:] - INFO  [main:JMXEnv@147] - ensureOnly:[]
    [junit] 2017-02-14 18:56:01,619 [myid:] - INFO  [main:ClientBase@445] - STARTING server
    [junit] 2017-02-14 18:56:01,620 [myid:] - INFO  [main:ClientBase@366] - CREATING server instance 127.0.0.1:11221
    [junit] 2017-02-14 18:56:01,621 [myid:] - INFO  [main:NIOServerCnxnFactory@89] - binding to port 0.0.0.0/0.0.0.0:11221
    [junit] 2017-02-14 18:56:01,622 [myid:] - INFO  [main:ClientBase@341] - STARTING server instance 127.0.0.1:11221
    [junit] 2017-02-14 18:56:01,623 [myid:] - INFO  [main:ZooKeeperServer@173] - Created server with tickTime 3000 minSessionTimeout 6000 maxSessionTimeout 60000 datadir /zonestorage/hudson_solaris/home/hudson/hudson-slave/workspace/ZooKeeper_branch34_solaris/build/test/tmp/test7563789512153337856.junit.dir/version-2 snapdir /zonestorage/hudson_solaris/home/hudson/hudson-slave/workspace/ZooKeeper_branch34_solaris/build/test/tmp/test7563789512153337856.junit.dir/version-2
    [junit] 2017-02-14 18:56:01,626 [myid:] - ERROR [main:ZooKeeperServer@472] - ZKShutdownHandler is not registered, so ZooKeeper server won't take any action on ERROR or SHUTDOWN server state changes
    [junit] 2017-02-14 18:56:01,626 [myid:] - INFO  [main:FourLetterWordMain@62] - connecting to 127.0.0.1 11221
    [junit] 2017-02-14 18:56:01,627 [myid:] - INFO  [NIOServerCxn.Factory:0.0.0.0/0.0.0.0:11221:NIOServerCnxnFactory@192] - Accepted socket connection from /127.0.0.1:37998
    [junit] 2017-02-14 18:56:01,627 [myid:] - INFO  [NIOServerCxn.Factory:0.0.0.0/0.0.0.0:11221:NIOServerCnxn@838] - Processing stat command from /127.0.0.1:37998
    [junit] 2017-02-14 18:56:01,627 [myid:] - INFO  [Thread-5:NIOServerCnxn$StatCommand@674] - Stat command output
    [junit] 2017-02-14 18:56:01,628 [myid:] - INFO  [Thread-5:NIOServerCnxn@1019] - Closed socket connection for client /127.0.0.1:37998 (no session established for client)
    [junit] 2017-02-14 18:56:01,628 [myid:] - INFO  [main:JMXEnv@230] - ensureParent:[InMemoryDataTree, StandaloneServer_port]
    [junit] 2017-02-14 18:56:01,629 [myid:] - INFO  [main:JMXEnv@247] - expect:InMemoryDataTree
    [junit] 2017-02-14 18:56:01,629 [myid:] - INFO  [main:JMXEnv@251] - found:InMemoryDataTree org.apache.ZooKeeperService:name0=StandaloneServer_port11221,name1=InMemoryDataTree
    [junit] 2017-02-14 18:56:01,629 [myid:] - INFO  [main:JMXEnv@247] - expect:StandaloneServer_port
    [junit] 2017-02-14 18:56:01,630 [myid:] - INFO  [main:JMXEnv@251] - found:StandaloneServer_port org.apache.ZooKeeperService:name0=StandaloneServer_port11221
    [junit] 2017-02-14 18:56:01,630 [myid:] - INFO  [main:JUnit4ZKTestRunner$LoggedInvokeMethod@58] - Memory used 9182
    [junit] 2017-02-14 18:56:01,630 [myid:] - INFO  [main:JUnit4ZKTestRunner$LoggedInvokeMethod@63] - Number of threads 20
    [junit] 2017-02-14 18:56:01,630 [myid:] - INFO  [main:JUnit4ZKTestRunner$LoggedInvokeMethod@78] - FINISHED TEST METHOD testQuota
    [junit] 2017-02-14 18:56:01,630 [myid:] - INFO  [main:ClientBase@522] - tearDown starting
    [junit] 2017-02-14 18:56:01,701 [myid:] - INFO  [main:ZooKeeper@684] - Session: 0x15a3dfb43a00000 closed
    [junit] 2017-02-14 18:56:01,702 [myid:] - INFO  [main:ClientBase@492] - STOPPING server
    [junit] 2017-02-14 18:56:01,702 [myid:] - INFO  [main-EventThread:ClientCnxn$EventThread@519] - EventThread shut down for session: 0x15a3dfb43a00000
    [junit] 2017-02-14 18:56:01,703 [myid:] - INFO  [main:ZooKeeperServer@505] - shutting down
    [junit] 2017-02-14 18:56:01,703 [myid:] - ERROR [main:ZooKeeperServer@472] - ZKShutdownHandler is not registered, so ZooKeeper server won't take any action on ERROR or SHUTDOWN server state changes
    [junit] 2017-02-14 18:56:01,703 [myid:] - INFO  [main:SessionTrackerImpl@225] - Shutting down
    [junit] 2017-02-14 18:56:01,703 [myid:] - INFO  [main:PrepRequestProcessor@764] - Shutting down
    [junit] 2017-02-14 18:56:01,703 [myid:] - INFO  [main:SyncRequestProcessor@208] - Shutting down
    [junit] 2017-02-14 18:56:01,703 [myid:] - INFO  [ProcessThread(sid:0 cport:11221)::PrepRequestProcessor@143] - PrepRequestProcessor exited loop!
    [junit] 2017-02-14 18:56:01,703 [myid:] - INFO  [SyncThread:0:SyncRequestProcessor@186] - SyncRequestProcessor exited!
    [junit] 2017-02-14 18:56:01,703 [myid:] - INFO  [main:FinalRequestProcessor@402] - shutdown of request processor complete
    [junit] 2017-02-14 18:56:01,704 [myid:] - INFO  [main:FourLetterWordMain@62] - connecting to 127.0.0.1 11221
    [junit] 2017-02-14 18:56:01,704 [myid:] - INFO  [main:JMXEnv@147] - ensureOnly:[]
    [junit] 2017-02-14 18:56:01,707 [myid:] - INFO  [main:ClientBase@547] - fdcount after test is: 95 at start it was 81
    [junit] 2017-02-14 18:56:01,707 [myid:] - INFO  [main:ClientBase@549] - sleeping for 20 secs
    [junit] 2017-02-14 18:56:01,708 [myid:] - INFO  [main:ZKTestCase$1@65] - SUCCEEDED testQuota
    [junit] 2017-02-14 18:56:01,708 [myid:] - INFO  [main:ZKTestCase$1@60] - FINISHED testQuota
    [junit] Tests run: 1, Failures: 0, Errors: 0, Time elapsed: 0.897 sec

fail.build.on.test.failure:

BUILD FAILED
/zonestorage/hudson_solaris/home/hudson/hudson-slave/workspace/ZooKeeper_branch34_solaris/build.xml:1328: The following error occurred while executing this line:
/zonestorage/hudson_solaris/home/hudson/hudson-slave/workspace/ZooKeeper_branch34_solaris/build.xml:1331: Tests failed!

Total time: 31 minutes 35 seconds
Build step 'Invoke Ant' marked build as failure
[locks-and-latches] Releasing all the locks
[locks-and-latches] All the locks released
Recording test results
Email was triggered for: Failure - Any
Sending email for trigger: Failure - Any



###################################################################################
############################## FAILED TESTS (if any) ##############################
2 tests failed.
FAILED:  org.apache.zookeeper.test.ReadOnlyModeTest.testSessionEstablishment

Error Message:
KeeperErrorCode = ConnectionLoss for /test

Stack Trace:
org.apache.zookeeper.KeeperException$ConnectionLossException: KeeperErrorCode = ConnectionLoss for /test
	at org.apache.zookeeper.KeeperException.create(KeeperException.java:99)
	at org.apache.zookeeper.KeeperException.create(KeeperException.java:51)
	at org.apache.zookeeper.ZooKeeper.create(ZooKeeper.java:783)
	at org.apache.zookeeper.test.ReadOnlyModeTest.testSessionEstablishment(ReadOnlyModeTest.java:216)
	at org.apache.zookeeper.JUnit4ZKTestRunner$LoggedInvokeMethod.evaluate(JUnit4ZKTestRunner.java:55)


FAILED:  org.apache.zookeeper.server.quorum.auth.QuorumKerberosAuthTest.testValidCredentials

Error Message:
waiting for server 0 being up

Stack Trace:
junit.framework.AssertionFailedError: waiting for server 0 being up
	at org.apache.zookeeper.server.quorum.auth.QuorumAuthTestBase.startQuorum(QuorumAuthTestBase.java:74)
	at org.apache.zookeeper.server.quorum.auth.QuorumKerberosAuthTest.testValidCredentials(QuorumKerberosAuthTest.java:101)
	at org.apache.zookeeper.JUnit4ZKTestRunner$LoggedInvokeMethod.evaluate(JUnit4ZKTestRunner.java:55)



ZooKeeper_branch34_solaris - Build # 1472 - Still Failing

Posted by Apache Jenkins Server <je...@builds.apache.org>.
See https://builds.apache.org/job/ZooKeeper_branch34_solaris/1472/

###################################################################################
########################## LAST 60 LINES OF THE CONSOLE ###########################
[...truncated 125231 lines...]
    [junit] 	at java.net.PlainSocketImpl.doConnect(PlainSocketImpl.java:351)
    [junit] 	at java.net.PlainSocketImpl.connectToAddress(PlainSocketImpl.java:213)
    [junit] 	at java.net.PlainSocketImpl.connect(PlainSocketImpl.java:200)
    [junit] 	at java.net.SocksSocketImpl.connect(SocksSocketImpl.java:366)
    [junit] 	at java.net.Socket.connect(Socket.java:529)
    [junit] 	at org.apache.zookeeper.server.quorum.QuorumCnxManager.connectOne(QuorumCnxManager.java:562)
    [junit] 	at org.apache.zookeeper.server.quorum.QuorumCnxManager.toSend(QuorumCnxManager.java:538)
    [junit] 	at org.apache.zookeeper.server.quorum.FastLeaderElection$Messenger$WorkerSender.process(FastLeaderElection.java:452)
    [junit] 	at org.apache.zookeeper.server.quorum.FastLeaderElection$Messenger$WorkerSender.run(FastLeaderElection.java:433)
    [junit] 	at java.lang.Thread.run(Thread.java:662)
    [junit] 2017-02-14 14:09:38,389 [myid:] - INFO  [WorkerSender[myid=5]:QuorumPeer$QuorumServer@163] - Resolved hostname: 127.0.0.1 to address: /127.0.0.1
    [junit] 2017-02-14 14:09:38,391 [myid:] - WARN  [QuorumPeer[myid=5]0.0.0.0/0.0.0.0:11237:QuorumPeer@910] - Unexpected exception
    [junit] java.lang.InterruptedException
    [junit] 	at java.util.concurrent.locks.AbstractQueuedSynchronizer$ConditionObject.reportInterruptAfterWait(AbstractQueuedSynchronizer.java:1961)
    [junit] 	at java.util.concurrent.locks.AbstractQueuedSynchronizer$ConditionObject.awaitNanos(AbstractQueuedSynchronizer.java:2038)
    [junit] 	at java.util.concurrent.LinkedBlockingQueue.poll(LinkedBlockingQueue.java:424)
    [junit] 	at org.apache.zookeeper.server.quorum.FastLeaderElection.lookForLeader(FastLeaderElection.java:832)
    [junit] 	at org.apache.zookeeper.server.quorum.QuorumPeer.run(QuorumPeer.java:908)
    [junit] 2017-02-14 14:09:38,393 [myid:] - WARN  [QuorumPeer[myid=5]0.0.0.0/0.0.0.0:11237:QuorumPeer@960] - QuorumPeer main thread exited
    [junit] 2017-02-14 14:09:38,391 [myid:] - ERROR [/127.0.0.1:12242:QuorumCnxManager$Listener@763] - Exception while listening
    [junit] java.net.SocketException: Socket closed
    [junit] 	at java.net.PlainSocketImpl.socketAccept(Native Method)
    [junit] 	at java.net.PlainSocketImpl.accept(PlainSocketImpl.java:408)
    [junit] 	at java.net.ServerSocket.implAccept(ServerSocket.java:462)
    [junit] 	at java.net.ServerSocket.accept(ServerSocket.java:430)
    [junit] 	at org.apache.zookeeper.server.quorum.QuorumCnxManager$Listener.run(QuorumCnxManager.java:744)
    [junit] 2017-02-14 14:09:38,394 [myid:] - INFO  [main:QuorumBase@310] - Shutting down leader election QuorumPeer[myid=5]0.0.0.0/0.0.0.0:11237
    [junit] 2017-02-14 14:09:38,608 [myid:] - INFO  [main:QuorumBase@315] - Waiting for QuorumPeer[myid=5]0.0.0.0/0.0.0.0:11237 to exit thread
    [junit] 2017-02-14 14:09:38,608 [myid:] - INFO  [main:FourLetterWordMain@62] - connecting to 127.0.0.1 11233
    [junit] 2017-02-14 14:09:38,608 [myid:] - INFO  [main:QuorumBase@291] - 127.0.0.1:11233 is no longer accepting client connections
    [junit] 2017-02-14 14:09:38,609 [myid:] - INFO  [main:FourLetterWordMain@62] - connecting to 127.0.0.1 11234
    [junit] 2017-02-14 14:09:38,609 [myid:] - INFO  [main:QuorumBase@291] - 127.0.0.1:11234 is no longer accepting client connections
    [junit] 2017-02-14 14:09:38,609 [myid:] - INFO  [main:FourLetterWordMain@62] - connecting to 127.0.0.1 11235
    [junit] 2017-02-14 14:09:38,609 [myid:] - INFO  [main:QuorumBase@291] - 127.0.0.1:11235 is no longer accepting client connections
    [junit] 2017-02-14 14:09:38,609 [myid:] - INFO  [main:FourLetterWordMain@62] - connecting to 127.0.0.1 11236
    [junit] 2017-02-14 14:09:38,609 [myid:] - INFO  [main:QuorumBase@291] - 127.0.0.1:11236 is no longer accepting client connections
    [junit] 2017-02-14 14:09:38,609 [myid:] - INFO  [main:FourLetterWordMain@62] - connecting to 127.0.0.1 11237
    [junit] 2017-02-14 14:09:38,610 [myid:] - INFO  [main:QuorumBase@291] - 127.0.0.1:11237 is no longer accepting client connections
    [junit] 2017-02-14 14:09:38,611 [myid:] - INFO  [/127.0.0.1:12238:QuorumCnxManager$Listener@776] - Leaving listener
    [junit] 2017-02-14 14:09:38,611 [myid:] - INFO  [main:JUnit4ZKTestRunner$LoggedInvokeMethod@58] - Memory used 118134
    [junit] 2017-02-14 14:09:38,612 [myid:] - INFO  [main:JUnit4ZKTestRunner$LoggedInvokeMethod@63] - Number of threads 23
    [junit] 2017-02-14 14:09:38,612 [myid:] - INFO  [main:JUnit4ZKTestRunner$LoggedInvokeMethod@78] - FINISHED TEST METHOD testObserversHammer
    [junit] 2017-02-14 14:09:38,612 [myid:] - INFO  [main:ZKTestCase$1@65] - SUCCEEDED testObserversHammer
    [junit] 2017-02-14 14:09:38,612 [myid:] - INFO  [main:ZKTestCase$1@60] - FINISHED testObserversHammer
    [junit] 2017-02-14 14:09:38,741 [myid:] - INFO  [/127.0.0.1:12239:QuorumCnxManager$Listener@776] - Leaving listener
    [junit] Tests run: 2, Failures: 0, Errors: 0, Time elapsed: 186.217 sec
    [junit] Running org.apache.zookeeper.test.NioNettySuiteTest
    [junit] Tests run: 1, Failures: 0, Errors: 1, Time elapsed: 0 sec

BUILD FAILED
/zonestorage/hudson_solaris/home/hudson/hudson-slave/workspace/ZooKeeper_branch34_solaris/build.xml:1297: Process fork failed.

Total time: 45 minutes 16 seconds
Build step 'Invoke Ant' marked build as failure
[locks-and-latches] Releasing all the locks
[locks-and-latches] All the locks released
Recording test results
Email was triggered for: Failure - Any
Sending email for trigger: Failure - Any



###################################################################################
############################## FAILED TESTS (if any) ##############################
3 tests failed.
FAILED:  org.apache.zookeeper.server.quorum.auth.QuorumKerberosHostBasedAuthTest.testValidCredentials

Error Message:
waiting for server 0 being up

Stack Trace:
junit.framework.AssertionFailedError: waiting for server 0 being up
	at org.apache.zookeeper.server.quorum.auth.QuorumAuthTestBase.startQuorum(QuorumAuthTestBase.java:74)
	at org.apache.zookeeper.server.quorum.auth.QuorumKerberosHostBasedAuthTest.testValidCredentials(QuorumKerberosHostBasedAuthTest.java:125)
	at org.apache.zookeeper.JUnit4ZKTestRunner$LoggedInvokeMethod.evaluate(JUnit4ZKTestRunner.java:55)


FAILED:  org.apache.zookeeper.test.NioNettySuiteTest.unknown

Error Message:
Forked Java VM exited abnormally. Please note the time in the report does not reflect the time until the VM exit.

Stack Trace:
junit.framework.AssertionFailedError: Forked Java VM exited abnormally. Please note the time in the report does not reflect the time until the VM exit.


FAILED:  org.apache.zookeeper.server.quorum.auth.QuorumKerberosAuthTest.testValidCredentials

Error Message:
waiting for server 0 being up

Stack Trace:
junit.framework.AssertionFailedError: waiting for server 0 being up
	at org.apache.zookeeper.server.quorum.auth.QuorumAuthTestBase.startQuorum(QuorumAuthTestBase.java:74)
	at org.apache.zookeeper.server.quorum.auth.QuorumKerberosAuthTest.testValidCredentials(QuorumKerberosAuthTest.java:101)
	at org.apache.zookeeper.JUnit4ZKTestRunner$LoggedInvokeMethod.evaluate(JUnit4ZKTestRunner.java:55)