You are viewing a plain text version of this content. The canonical link for it is here.
Posted to dev@lucene.apache.org by Policeman Jenkins Server <je...@thetaphi.de> on 2016/04/12 21:01:55 UTC

[JENKINS] Lucene-Solr-6.x-Solaris (64bit/jdk1.8.0) - Build # 70 - Still Failing!

Build: http://jenkins.thetaphi.de/job/Lucene-Solr-6.x-Solaris/70/
Java: 64bit/jdk1.8.0 -XX:-UseCompressedOops -XX:+UseParallelGC

1 tests failed.
FAILED:  org.apache.solr.core.TestArbitraryIndexDir.testLoadNewIndexDir

Error Message:
Exception during query

Stack Trace:
java.lang.RuntimeException: Exception during query
	at __randomizedtesting.SeedInfo.seed([D6A108E82EA8EABA:3FFBB3D0B0317A12]:0)
	at org.apache.solr.SolrTestCaseJ4.assertQ(SolrTestCaseJ4.java:783)
	at org.apache.solr.core.TestArbitraryIndexDir.testLoadNewIndexDir(TestArbitraryIndexDir.java:107)
	at sun.reflect.NativeMethodAccessorImpl.invoke0(Native Method)
	at sun.reflect.NativeMethodAccessorImpl.invoke(NativeMethodAccessorImpl.java:62)
	at sun.reflect.DelegatingMethodAccessorImpl.invoke(DelegatingMethodAccessorImpl.java:43)
	at java.lang.reflect.Method.invoke(Method.java:498)
	at com.carrotsearch.randomizedtesting.RandomizedRunner.invoke(RandomizedRunner.java:1764)
	at com.carrotsearch.randomizedtesting.RandomizedRunner$8.evaluate(RandomizedRunner.java:871)
	at com.carrotsearch.randomizedtesting.RandomizedRunner$9.evaluate(RandomizedRunner.java:907)
	at com.carrotsearch.randomizedtesting.RandomizedRunner$10.evaluate(RandomizedRunner.java:921)
	at com.carrotsearch.randomizedtesting.rules.SystemPropertiesRestoreRule$1.evaluate(SystemPropertiesRestoreRule.java:57)
	at com.carrotsearch.randomizedtesting.rules.SystemPropertiesRestoreRule$1.evaluate(SystemPropertiesRestoreRule.java:57)
	at org.apache.lucene.util.TestRuleSetupTeardownChained$1.evaluate(TestRuleSetupTeardownChained.java:49)
	at org.apache.lucene.util.AbstractBeforeAfterRule$1.evaluate(AbstractBeforeAfterRule.java:45)
	at org.apache.lucene.util.TestRuleThreadAndTestName$1.evaluate(TestRuleThreadAndTestName.java:48)
	at org.apache.lucene.util.TestRuleIgnoreAfterMaxFailures$1.evaluate(TestRuleIgnoreAfterMaxFailures.java:64)
	at org.apache.lucene.util.TestRuleMarkFailure$1.evaluate(TestRuleMarkFailure.java:47)
	at com.carrotsearch.randomizedtesting.rules.StatementAdapter.evaluate(StatementAdapter.java:36)
	at com.carrotsearch.randomizedtesting.ThreadLeakControl$StatementRunner.run(ThreadLeakControl.java:367)
	at com.carrotsearch.randomizedtesting.ThreadLeakControl.forkTimeoutingTask(ThreadLeakControl.java:809)
	at com.carrotsearch.randomizedtesting.ThreadLeakControl$3.evaluate(ThreadLeakControl.java:460)
	at com.carrotsearch.randomizedtesting.RandomizedRunner.runSingleTest(RandomizedRunner.java:880)
	at com.carrotsearch.randomizedtesting.RandomizedRunner$5.evaluate(RandomizedRunner.java:781)
	at com.carrotsearch.randomizedtesting.RandomizedRunner$6.evaluate(RandomizedRunner.java:816)
	at com.carrotsearch.randomizedtesting.RandomizedRunner$7.evaluate(RandomizedRunner.java:827)
	at com.carrotsearch.randomizedtesting.rules.StatementAdapter.evaluate(StatementAdapter.java:36)
	at com.carrotsearch.randomizedtesting.rules.SystemPropertiesRestoreRule$1.evaluate(SystemPropertiesRestoreRule.java:57)
	at org.apache.lucene.util.AbstractBeforeAfterRule$1.evaluate(AbstractBeforeAfterRule.java:45)
	at com.carrotsearch.randomizedtesting.rules.StatementAdapter.evaluate(StatementAdapter.java:36)
	at org.apache.lucene.util.TestRuleStoreClassName$1.evaluate(TestRuleStoreClassName.java:41)
	at com.carrotsearch.randomizedtesting.rules.NoShadowingOrOverridesOnMethodsRule$1.evaluate(NoShadowingOrOverridesOnMethodsRule.java:40)
	at com.carrotsearch.randomizedtesting.rules.NoShadowingOrOverridesOnMethodsRule$1.evaluate(NoShadowingOrOverridesOnMethodsRule.java:40)
	at com.carrotsearch.randomizedtesting.rules.StatementAdapter.evaluate(StatementAdapter.java:36)
	at com.carrotsearch.randomizedtesting.rules.StatementAdapter.evaluate(StatementAdapter.java:36)
	at com.carrotsearch.randomizedtesting.rules.StatementAdapter.evaluate(StatementAdapter.java:36)
	at org.apache.lucene.util.TestRuleAssertionsRequired$1.evaluate(TestRuleAssertionsRequired.java:53)
	at org.apache.lucene.util.TestRuleMarkFailure$1.evaluate(TestRuleMarkFailure.java:47)
	at org.apache.lucene.util.TestRuleIgnoreAfterMaxFailures$1.evaluate(TestRuleIgnoreAfterMaxFailures.java:64)
	at org.apache.lucene.util.TestRuleIgnoreTestSuites$1.evaluate(TestRuleIgnoreTestSuites.java:54)
	at com.carrotsearch.randomizedtesting.rules.StatementAdapter.evaluate(StatementAdapter.java:36)
	at com.carrotsearch.randomizedtesting.ThreadLeakControl$StatementRunner.run(ThreadLeakControl.java:367)
	at java.lang.Thread.run(Thread.java:745)
Caused by: java.lang.RuntimeException: REQUEST FAILED: xpath=*[count(//doc)=1]
	xml response was: <?xml version="1.0" encoding="UTF-8"?>
<response>
<lst name="responseHeader"><int name="status">0</int><int name="QTime">0</int></lst><result name="response" numFound="0" start="0"></result>
</response>

	request was:q=id:2&qt=standard&start=0&rows=20&version=2.2
	at org.apache.solr.SolrTestCaseJ4.assertQ(SolrTestCaseJ4.java:776)
	... 41 more




Build Log:
[...truncated 10680 lines...]
   [junit4] Suite: org.apache.solr.core.TestArbitraryIndexDir
   [junit4]   2> Creating dataDir: /export/home/jenkins/workspace/Lucene-Solr-6.x-Solaris/solr/build/solr-core/test/J0/temp/solr.core.TestArbitraryIndexDir_D6A108E82EA8EABA-001/init-core-data-001
   [junit4]   2> 335436 INFO  (SUITE-TestArbitraryIndexDir-seed#[D6A108E82EA8EABA]-worker) [    ] o.a.s.SolrTestCaseJ4 Randomized ssl (false) and clientAuth (false)
   [junit4]   2> 335438 INFO  (TEST-TestArbitraryIndexDir.testLoadNewIndexDir-seed#[D6A108E82EA8EABA]) [    ] o.a.s.SolrTestCaseJ4 ###Starting testLoadNewIndexDir
   [junit4]   2> 335439 INFO  (TEST-TestArbitraryIndexDir.testLoadNewIndexDir-seed#[D6A108E82EA8EABA]) [    ] o.a.s.SolrTestCaseJ4 ####initCore
   [junit4]   2> 335439 INFO  (TEST-TestArbitraryIndexDir.testLoadNewIndexDir-seed#[D6A108E82EA8EABA]) [    ] o.a.s.c.SolrResourceLoader new SolrResourceLoader for directory: '/export/home/jenkins/workspace/Lucene-Solr-6.x-Solaris/solr/core/src/test-files/solr/collection1'
   [junit4]   2> 335439 INFO  (TEST-TestArbitraryIndexDir.testLoadNewIndexDir-seed#[D6A108E82EA8EABA]) [    ] o.a.s.c.SolrResourceLoader JNDI not configured for solr (NoInitialContextEx)
   [junit4]   2> 335439 INFO  (TEST-TestArbitraryIndexDir.testLoadNewIndexDir-seed#[D6A108E82EA8EABA]) [    ] o.a.s.c.SolrResourceLoader using system property solr.solr.home: /export/home/jenkins/workspace/Lucene-Solr-6.x-Solaris/solr/core/src/test-files/solr
   [junit4]   2> 335439 INFO  (TEST-TestArbitraryIndexDir.testLoadNewIndexDir-seed#[D6A108E82EA8EABA]) [    ] o.a.s.c.SolrResourceLoader Adding 'file:/export/home/jenkins/workspace/Lucene-Solr-6.x-Solaris/solr/core/src/test-files/solr/collection1/lib/classes/' to classloader
   [junit4]   2> 335439 INFO  (TEST-TestArbitraryIndexDir.testLoadNewIndexDir-seed#[D6A108E82EA8EABA]) [    ] o.a.s.c.SolrResourceLoader Adding 'file:/export/home/jenkins/workspace/Lucene-Solr-6.x-Solaris/solr/core/src/test-files/solr/collection1/lib/README' to classloader
   [junit4]   2> 335476 INFO  (TEST-TestArbitraryIndexDir.testLoadNewIndexDir-seed#[D6A108E82EA8EABA]) [    ] o.a.s.c.SolrConfig current version of requestparams : -1
   [junit4]   2> 335485 INFO  (TEST-TestArbitraryIndexDir.testLoadNewIndexDir-seed#[D6A108E82EA8EABA]) [    ] o.a.s.c.SolrConfig Using Lucene MatchVersion: 6.1.0
   [junit4]   2> 335507 INFO  (TEST-TestArbitraryIndexDir.testLoadNewIndexDir-seed#[D6A108E82EA8EABA]) [    ] o.a.s.c.SolrConfig Loaded SolrConfig: solrconfig.xml
   [junit4]   2> 335512 INFO  (TEST-TestArbitraryIndexDir.testLoadNewIndexDir-seed#[D6A108E82EA8EABA]) [    ] o.a.s.s.IndexSchema [null] Schema name=test
   [junit4]   2> 335589 INFO  (TEST-TestArbitraryIndexDir.testLoadNewIndexDir-seed#[D6A108E82EA8EABA]) [    ] o.a.s.s.IndexSchema default search field in schema is text
   [junit4]   2> 335589 INFO  (TEST-TestArbitraryIndexDir.testLoadNewIndexDir-seed#[D6A108E82EA8EABA]) [    ] o.a.s.s.IndexSchema unique key field: id
   [junit4]   2> 335590 WARN  (TEST-TestArbitraryIndexDir.testLoadNewIndexDir-seed#[D6A108E82EA8EABA]) [    ] o.a.s.s.IndexSchema Field text is not multivalued and destination for multiple copyFields (2)
   [junit4]   2> 335594 INFO  (TEST-TestArbitraryIndexDir.testLoadNewIndexDir-seed#[D6A108E82EA8EABA]) [    ] o.a.s.s.FileExchangeRateProvider Reloading exchange rates from file currency.xml
   [junit4]   2> 335596 INFO  (TEST-TestArbitraryIndexDir.testLoadNewIndexDir-seed#[D6A108E82EA8EABA]) [    ] o.a.s.s.FileExchangeRateProvider Reloading exchange rates from file currency.xml
   [junit4]   2> 335597 INFO  (TEST-TestArbitraryIndexDir.testLoadNewIndexDir-seed#[D6A108E82EA8EABA]) [    ] o.a.s.c.SolrResourceLoader JNDI not configured for solr (NoInitialContextEx)
   [junit4]   2> 335598 INFO  (TEST-TestArbitraryIndexDir.testLoadNewIndexDir-seed#[D6A108E82EA8EABA]) [    ] o.a.s.c.SolrResourceLoader using system property solr.solr.home: /export/home/jenkins/workspace/Lucene-Solr-6.x-Solaris/solr/core/src/test-files/solr
   [junit4]   2> 335598 INFO  (TEST-TestArbitraryIndexDir.testLoadNewIndexDir-seed#[D6A108E82EA8EABA]) [    ] o.a.s.c.SolrResourceLoader new SolrResourceLoader for directory: '/export/home/jenkins/workspace/Lucene-Solr-6.x-Solaris/solr/core/src/test-files/solr'
   [junit4]   2> 335598 INFO  (TEST-TestArbitraryIndexDir.testLoadNewIndexDir-seed#[D6A108E82EA8EABA]) [    ] o.a.s.c.SolrResourceLoader JNDI not configured for solr (NoInitialContextEx)
   [junit4]   2> 335598 INFO  (TEST-TestArbitraryIndexDir.testLoadNewIndexDir-seed#[D6A108E82EA8EABA]) [    ] o.a.s.c.SolrResourceLoader using system property solr.solr.home: /export/home/jenkins/workspace/Lucene-Solr-6.x-Solaris/solr/core/src/test-files/solr
   [junit4]   2> 335598 INFO  (TEST-TestArbitraryIndexDir.testLoadNewIndexDir-seed#[D6A108E82EA8EABA]) [    ] o.a.s.c.CoreContainer New CoreContainer 1552350427
   [junit4]   2> 335598 INFO  (TEST-TestArbitraryIndexDir.testLoadNewIndexDir-seed#[D6A108E82EA8EABA]) [    ] o.a.s.c.CoreContainer Loading cores into CoreContainer [instanceDir=/export/home/jenkins/workspace/Lucene-Solr-6.x-Solaris/solr/core/src/test-files/solr]
   [junit4]   2> 335598 WARN  (TEST-TestArbitraryIndexDir.testLoadNewIndexDir-seed#[D6A108E82EA8EABA]) [    ] o.a.s.c.CoreContainer Couldn't add files from /export/home/jenkins/workspace/Lucene-Solr-6.x-Solaris/solr/core/src/test-files/solr/lib to classpath: /export/home/jenkins/workspace/Lucene-Solr-6.x-Solaris/solr/core/src/test-files/solr/lib
   [junit4]   2> 335599 INFO  (TEST-TestArbitraryIndexDir.testLoadNewIndexDir-seed#[D6A108E82EA8EABA]) [    ] o.a.s.h.c.HttpShardHandlerFactory created with socketTimeout : 600000,connTimeout : 60000,maxConnectionsPerHost : 20,maxConnections : 10000,corePoolSize : 0,maximumPoolSize : 2147483647,maxThreadIdleTime : 5,sizeOfQueue : -1,fairnessPolicy : false,useRetries : false,
   [junit4]   2> 335600 INFO  (TEST-TestArbitraryIndexDir.testLoadNewIndexDir-seed#[D6A108E82EA8EABA]) [    ] o.a.s.u.UpdateShardHandler Creating UpdateShardHandler HTTP client with params: socketTimeout=30000&connTimeout=30000&retry=true
   [junit4]   2> 335601 INFO  (TEST-TestArbitraryIndexDir.testLoadNewIndexDir-seed#[D6A108E82EA8EABA]) [    ] o.a.s.l.LogWatcher SLF4J impl is org.slf4j.impl.Log4jLoggerFactory
   [junit4]   2> 335601 INFO  (TEST-TestArbitraryIndexDir.testLoadNewIndexDir-seed#[D6A108E82EA8EABA]) [    ] o.a.s.l.LogWatcher Registering Log Listener [Log4j (org.slf4j.impl.Log4jLoggerFactory)]
   [junit4]   2> 335601 INFO  (TEST-TestArbitraryIndexDir.testLoadNewIndexDir-seed#[D6A108E82EA8EABA]) [    ] o.a.s.c.CoreContainer Security conf doesn't exist. Skipping setup for authorization module.
   [junit4]   2> 335601 INFO  (TEST-TestArbitraryIndexDir.testLoadNewIndexDir-seed#[D6A108E82EA8EABA]) [    ] o.a.s.c.CoreContainer No authentication plugin used.
   [junit4]   2> 335602 INFO  (TEST-TestArbitraryIndexDir.testLoadNewIndexDir-seed#[D6A108E82EA8EABA]) [    ] o.a.s.c.CoreDescriptor Created CoreDescriptor: {name=collection1, config=solrconfig.xml, transient=false, schema=schema12.xml, loadOnStartup=true, configSetProperties=configsetprops.json, collection=collection1, dataDir=/export/home/jenkins/workspace/Lucene-Solr-6.x-Solaris/solr/build/solr-core/test/J0/temp/solr.core.TestArbitraryIndexDir_D6A108E82EA8EABA-001/init-core-data-001, shard=shard1}
   [junit4]   2> 335619 INFO  (coreLoadExecutor-1635-thread-1) [    ] o.a.s.c.SolrResourceLoader new SolrResourceLoader for directory: '/export/home/jenkins/workspace/Lucene-Solr-6.x-Solaris/solr/core/src/test-files/solr/collection1'
   [junit4]   2> 335621 INFO  (coreLoadExecutor-1635-thread-1) [    ] o.a.s.c.SolrResourceLoader JNDI not configured for solr (NoInitialContextEx)
   [junit4]   2> 335621 INFO  (coreLoadExecutor-1635-thread-1) [    ] o.a.s.c.SolrResourceLoader using system property solr.solr.home: /export/home/jenkins/workspace/Lucene-Solr-6.x-Solaris/solr/core/src/test-files/solr
   [junit4]   2> 335621 INFO  (coreLoadExecutor-1635-thread-1) [    ] o.a.s.c.SolrResourceLoader Adding 'file:/export/home/jenkins/workspace/Lucene-Solr-6.x-Solaris/solr/core/src/test-files/solr/collection1/lib/classes/' to classloader
   [junit4]   2> 335621 INFO  (coreLoadExecutor-1635-thread-1) [    ] o.a.s.c.SolrResourceLoader Adding 'file:/export/home/jenkins/workspace/Lucene-Solr-6.x-Solaris/solr/core/src/test-files/solr/collection1/lib/README' to classloader
   [junit4]   2> 335654 INFO  (coreLoadExecutor-1635-thread-1) [    ] o.a.s.c.SolrConfig current version of requestparams : -1
   [junit4]   2> 335666 INFO  (coreLoadExecutor-1635-thread-1) [    ] o.a.s.c.SolrConfig Using Lucene MatchVersion: 6.1.0
   [junit4]   2> 335727 INFO  (coreLoadExecutor-1635-thread-1) [    ] o.a.s.c.SolrConfig Loaded SolrConfig: solrconfig.xml
   [junit4]   2> 335732 INFO  (coreLoadExecutor-1635-thread-1) [    ] o.a.s.s.IndexSchema [collection1] Schema name=test
   [junit4]   2> 335821 INFO  (coreLoadExecutor-1635-thread-1) [    ] o.a.s.s.IndexSchema default search field in schema is text
   [junit4]   2> 335822 INFO  (coreLoadExecutor-1635-thread-1) [    ] o.a.s.s.IndexSchema unique key field: id
   [junit4]   2> 335823 WARN  (coreLoadExecutor-1635-thread-1) [    ] o.a.s.s.IndexSchema Field text is not multivalued and destination for multiple copyFields (2)
   [junit4]   2> 335829 INFO  (coreLoadExecutor-1635-thread-1) [    ] o.a.s.s.FileExchangeRateProvider Reloading exchange rates from file currency.xml
   [junit4]   2> 335832 INFO  (coreLoadExecutor-1635-thread-1) [    ] o.a.s.s.FileExchangeRateProvider Reloading exchange rates from file currency.xml
   [junit4]   2> 335837 INFO  (coreLoadExecutor-1635-thread-1) [    ] o.a.s.c.ConfigSetProperties Did not find ConfigSet properties, assuming default properties: Can't find resource 'configsetprops.json' in classpath or '/export/home/jenkins/workspace/Lucene-Solr-6.x-Solaris/solr/core/src/test-files/solr/collection1'
   [junit4]   2> 335837 INFO  (coreLoadExecutor-1635-thread-1) [    ] o.a.s.c.CoreContainer Creating SolrCore 'collection1' using configuration from instancedir /export/home/jenkins/workspace/Lucene-Solr-6.x-Solaris/solr/core/src/test-files/solr/collection1
   [junit4]   2> 335839 INFO  (coreLoadExecutor-1635-thread-1) [    x:collection1] o.a.s.c.SolrCore org.apache.solr.core.MockFSDirectoryFactory
   [junit4]   2> 335843 INFO  (coreLoadExecutor-1635-thread-1) [    x:collection1] o.a.s.c.SolrCore [[collection1] ] Opening new SolrCore at [/export/home/jenkins/workspace/Lucene-Solr-6.x-Solaris/solr/core/src/test-files/solr/collection1], dataDir=[/export/home/jenkins/workspace/Lucene-Solr-6.x-Solaris/solr/build/solr-core/test/J0/temp/solr.core.TestArbitraryIndexDir_D6A108E82EA8EABA-001/init-core-data-001/]
   [junit4]   2> 335843 INFO  (coreLoadExecutor-1635-thread-1) [    x:collection1] o.a.s.c.JmxMonitoredMap JMX monitoring is enabled. Adding Solr mbeans to JMX Server: com.sun.jmx.mbeanserver.JmxMBeanServer@39306e2d
   [junit4]   2> 335846 INFO  (coreLoadExecutor-1635-thread-1) [    x:collection1] o.a.s.c.CachingDirectoryFactory return new directory for /export/home/jenkins/workspace/Lucene-Solr-6.x-Solaris/solr/build/solr-core/test/J0/temp/solr.core.TestArbitraryIndexDir_D6A108E82EA8EABA-001/init-core-data-001
   [junit4]   2> 335846 INFO  (coreLoadExecutor-1635-thread-1) [    x:collection1] o.a.s.c.SolrCore New index directory detected: old=null new=/export/home/jenkins/workspace/Lucene-Solr-6.x-Solaris/solr/build/solr-core/test/J0/temp/solr.core.TestArbitraryIndexDir_D6A108E82EA8EABA-001/init-core-data-001/index/
   [junit4]   2> 335847 WARN  (coreLoadExecutor-1635-thread-1) [    x:collection1] o.a.s.c.SolrCore [collection1] Solr index directory '/export/home/jenkins/workspace/Lucene-Solr-6.x-Solaris/solr/build/solr-core/test/J0/temp/solr.core.TestArbitraryIndexDir_D6A108E82EA8EABA-001/init-core-data-001/index' doesn't exist. Creating new index...
   [junit4]   2> 335847 INFO  (coreLoadExecutor-1635-thread-1) [    x:collection1] o.a.s.c.CachingDirectoryFactory return new directory for /export/home/jenkins/workspace/Lucene-Solr-6.x-Solaris/solr/build/solr-core/test/J0/temp/solr.core.TestArbitraryIndexDir_D6A108E82EA8EABA-001/init-core-data-001/index
   [junit4]   2> 335847 INFO  (coreLoadExecutor-1635-thread-1) [    x:collection1] o.a.s.u.RandomMergePolicy RandomMergePolicy wrapping class org.apache.lucene.index.LogByteSizeMergePolicy: [LogByteSizeMergePolicy: minMergeSize=1677721, mergeFactor=48, maxMergeSize=2147483648, maxMergeSizeForForcedMerge=9223372036854775807, calibrateSizeByDeletes=true, maxMergeDocs=2147483647, maxCFSSegmentSizeMB=8.796093022207999E12, noCFSRatio=0.6322223606861992]
   [junit4]   2> 335948 INFO  (coreLoadExecutor-1635-thread-1) [    x:collection1] o.a.s.c.SolrDeletionPolicy SolrDeletionPolicy.onCommit: commits: num=1
   [junit4]   2> 	commit{dir=MockDirectoryWrapper(MMapDirectory@/export/home/jenkins/workspace/Lucene-Solr-6.x-Solaris/solr/build/solr-core/test/J0/temp/solr.core.TestArbitraryIndexDir_D6A108E82EA8EABA-001/init-core-data-001/index lockFactory=org.apache.lucene.store.SingleInstanceLockFactory@296afebb),segFN=segments_1,generation=1}
   [junit4]   2> 335948 INFO  (coreLoadExecutor-1635-thread-1) [    x:collection1] o.a.s.c.SolrDeletionPolicy newest commit generation = 1
   [junit4]   2> 335949 INFO  (OldIndexDirectoryCleanupThreadForCore-collection1) [    x:collection1] o.a.s.c.SolrCore Looking for old index directories to cleanup for core collection1 in /export/home/jenkins/workspace/Lucene-Solr-6.x-Solaris/solr/build/solr-core/test/J0/temp/solr.core.TestArbitraryIndexDir_D6A108E82EA8EABA-001/init-core-data-001/
   [junit4]   2> 335951 INFO  (coreLoadExecutor-1635-thread-1) [    x:collection1] o.a.s.u.p.UpdateRequestProcessorChain creating updateRequestProcessorChain "dedupe"
   [junit4]   2> 335952 INFO  (coreLoadExecutor-1635-thread-1) [    x:collection1] o.a.s.u.p.UpdateRequestProcessorChain inserting DistributedUpdateProcessorFactory into updateRequestProcessorChain "dedupe"
   [junit4]   2> 335952 INFO  (coreLoadExecutor-1635-thread-1) [    x:collection1] o.a.s.u.p.UpdateRequestProcessorChain creating updateRequestProcessorChain "dedupe-allfields"
   [junit4]   2> 335952 INFO  (coreLoadExecutor-1635-thread-1) [    x:collection1] o.a.s.u.p.UpdateRequestProcessorChain inserting DistributedUpdateProcessorFactory into updateRequestProcessorChain "dedupe-allfields"
   [junit4]   2> 335952 INFO  (coreLoadExecutor-1635-thread-1) [    x:collection1] o.a.s.u.p.UpdateRequestProcessorChain creating updateRequestProcessorChain "stored_sig"
   [junit4]   2> 335952 INFO  (coreLoadExecutor-1635-thread-1) [    x:collection1] o.a.s.u.p.UpdateRequestProcessorChain inserting DistributedUpdateProcessorFactory into updateRequestProcessorChain "stored_sig"
   [junit4]   2> 335952 INFO  (coreLoadExecutor-1635-thread-1) [    x:collection1] o.a.s.u.p.UpdateRequestProcessorChain creating updateRequestProcessorChain "uniq-fields"
   [junit4]   2> 335952 INFO  (coreLoadExecutor-1635-thread-1) [    x:collection1] o.a.s.u.p.UpdateRequestProcessorChain inserting DistributedUpdateProcessorFactory into updateRequestProcessorChain "uniq-fields"
   [junit4]   2> 335952 INFO  (coreLoadExecutor-1635-thread-1) [    x:collection1] o.a.s.u.p.UpdateRequestProcessorChain creating updateRequestProcessorChain "distrib-dup-test-chain-explicit"
   [junit4]   2> 335952 INFO  (coreLoadExecutor-1635-thread-1) [    x:collection1] o.a.s.u.p.UpdateRequestProcessorChain creating updateRequestProcessorChain "distrib-dup-test-chain-implicit"
   [junit4]   2> 335952 INFO  (coreLoadExecutor-1635-thread-1) [    x:collection1] o.a.s.u.p.UpdateRequestProcessorChain inserting DistributedUpdateProcessorFactory into updateRequestProcessorChain "distrib-dup-test-chain-implicit"
   [junit4]   2> 335952 INFO  (coreLoadExecutor-1635-thread-1) [    x:collection1] o.a.s.c.SolrCore no updateRequestProcessorChain defined as default, creating implicit default
   [junit4]   2> 335954 INFO  (coreLoadExecutor-1635-thread-1) [    x:collection1] o.a.s.h.l.XMLLoader xsltCacheLifetimeSeconds=60
   [junit4]   2> 335955 INFO  (coreLoadExecutor-1635-thread-1) [    x:collection1] o.a.s.h.l.XMLLoader xsltCacheLifetimeSeconds=60
   [junit4]   2> 335956 INFO  (coreLoadExecutor-1635-thread-1) [    x:collection1] o.a.s.h.l.XMLLoader xsltCacheLifetimeSeconds=60
   [junit4]   2> 335957 INFO  (coreLoadExecutor-1635-thread-1) [    x:collection1] o.a.s.h.l.XMLLoader xsltCacheLifetimeSeconds=60
   [junit4]   2> 335960 INFO  (coreLoadExecutor-1635-thread-1) [    x:collection1] o.a.s.c.PluginBag requestHandler : 'lazy' created with startup=lazy 
   [junit4]   2> 335962 INFO  (coreLoadExecutor-1635-thread-1) [    x:collection1] o.a.s.c.RequestHandlers Registered paths: /admin/mbeans,standard,spellCheckCompRH,lazy,/update/json/docs,/admin/luke,/export,spellCheckWithWordbreak_Direct,tvrh,/get,/admin/properties,/update/json,mltrh,/admin/threads,/search-facet-def,/update/csv,/sql,/search-facet-invariants,/admin/segments,spellCheckCompRH1,/mlt,/admin/system,/replication,dismax,defaults,/config,/stream,/schema,/admin/plugins,/admin/logging,spellCheckWithWordbreak,mock,/admin/ping,/update,/admin/file,/terms,spellCheckCompRH_Direct,/debug/dump
   [junit4]   2> 335962 INFO  (coreLoadExecutor-1635-thread-1) [    x:collection1] o.a.s.c.SolrCore Using default statsCache cache: org.apache.solr.search.stats.LocalStatsCache
   [junit4]   2> 335962 INFO  (coreLoadExecutor-1635-thread-1) [    x:collection1] o.a.s.u.CommitTracker Hard AutoCommit: disabled
   [junit4]   2> 335962 INFO  (coreLoadExecutor-1635-thread-1) [    x:collection1] o.a.s.u.CommitTracker Soft AutoCommit: disabled
   [junit4]   2> 335963 INFO  (coreLoadExecutor-1635-thread-1) [    x:collection1] o.a.s.u.RandomMergePolicy RandomMergePolicy wrapping class org.apache.lucene.index.LogDocMergePolicy: [LogDocMergePolicy: minMergeSize=1000, mergeFactor=30, maxMergeSize=9223372036854775807, maxMergeSizeForForcedMerge=9223372036854775807, calibrateSizeByDeletes=true, maxMergeDocs=2147483647, maxCFSSegmentSizeMB=8.796093022207999E12, noCFSRatio=1.0]
   [junit4]   2> 335966 INFO  (coreLoadExecutor-1635-thread-1) [    x:collection1] o.a.s.c.SolrDeletionPolicy SolrDeletionPolicy.onInit: commits: num=1
   [junit4]   2> 	commit{dir=MockDirectoryWrapper(MMapDirectory@/export/home/jenkins/workspace/Lucene-Solr-6.x-Solaris/solr/build/solr-core/test/J0/temp/solr.core.TestArbitraryIndexDir_D6A108E82EA8EABA-001/init-core-data-001/index lockFactory=org.apache.lucene.store.SingleInstanceLockFactory@296afebb),segFN=segments_1,generation=1}
   [junit4]   2> 335966 INFO  (coreLoadExecutor-1635-thread-1) [    x:collection1] o.a.s.c.SolrDeletionPolicy newest commit generation = 1
   [junit4]   2> 335966 INFO  (coreLoadExecutor-1635-thread-1) [    x:collection1] o.a.s.s.SolrIndexSearcher Opening [Searcher@756b80f6[collection1] main]
   [junit4]   2> 335966 INFO  (coreLoadExecutor-1635-thread-1) [    x:collection1] o.a.s.r.RestManager Initializing RestManager with initArgs: {storageIO=org.apache.solr.rest.ManagedResourceStorage$InMemoryStorageIO}
   [junit4]   2> 335966 INFO  (coreLoadExecutor-1635-thread-1) [    x:collection1] o.a.s.r.ManagedResourceStorage Reading _rest_managed.json using InMemoryStorage
   [junit4]   2> 335966 INFO  (coreLoadExecutor-1635-thread-1) [    x:collection1] o.a.s.r.RestManager Initializing 0 registered ManagedResources
   [junit4]   2> 335966 INFO  (coreLoadExecutor-1635-thread-1) [    x:collection1] o.a.s.h.c.SpellCheckComponent Initializing spell checkers
   [junit4]   2> 335995 INFO  (coreLoadExecutor-1635-thread-1) [    x:collection1] o.a.s.s.DirectSolrSpellChecker init: {name=direct,classname=DirectSolrSpellChecker,field=lowerfilt,minQueryLength=3}
   [junit4]   2> 336057 INFO  (coreLoadExecutor-1635-thread-1) [    x:collection1] o.a.s.h.ReplicationHandler Commits will be reserved for  10000
   [junit4]   2> 336057 INFO  (searcherExecutor-1636-thread-1-processing-x:collection1) [    x:collection1] o.a.s.h.c.SpellCheckComponent Loading spell index for spellchecker: default
   [junit4]   2> 336058 INFO  (searcherExecutor-1636-thread-1-processing-x:collection1) [    x:collection1] o.a.s.h.c.SpellCheckComponent Loading spell index for spellchecker: direct
   [junit4]   2> 336058 INFO  (searcherExecutor-1636-thread-1-processing-x:collection1) [    x:collection1] o.a.s.h.c.SpellCheckComponent Loading spell index for spellchecker: wordbreak
   [junit4]   2> 336058 INFO  (searcherExecutor-1636-thread-1-processing-x:collection1) [    x:collection1] o.a.s.h.c.SpellCheckComponent Loading spell index for spellchecker: multipleFields
   [junit4]   2> 336058 INFO  (coreLoadExecutor-1635-thread-1) [    x:collection1] o.a.s.c.CoreContainer registering core: collection1
   [junit4]   2> 336059 INFO  (searcherExecutor-1636-thread-1-processing-x:collection1) [    x:collection1] o.a.s.h.c.SpellCheckComponent Loading spell index for spellchecker: jarowinkler
   [junit4]   2> 336059 INFO  (searcherExecutor-1636-thread-1-processing-x:collection1) [    x:collection1] o.a.s.h.c.SpellCheckComponent Loading spell index for spellchecker: external
   [junit4]   2> 336059 INFO  (searcherExecutor-1636-thread-1-processing-x:collection1) [    x:collection1] o.a.s.h.c.SpellCheckComponent Loading spell index for spellchecker: freq
   [junit4]   2> 336060 INFO  (searcherExecutor-1636-thread-1-processing-x:collection1) [    x:collection1] o.a.s.h.c.SpellCheckComponent Loading spell index for spellchecker: fqcn
   [junit4]   2> 336060 INFO  (searcherExecutor-1636-thread-1-processing-x:collection1) [    x:collection1] o.a.s.h.c.SpellCheckComponent Loading spell index for spellchecker: perDict
   [junit4]   2> 336060 INFO  (TEST-TestArbitraryIndexDir.testLoadNewIndexDir-seed#[D6A108E82EA8EABA]) [    ] o.a.s.SolrTestCaseJ4 ####initCore end
   [junit4]   2> 336061 INFO  (searcherExecutor-1636-thread-1-processing-x:collection1) [    x:collection1] o.a.s.c.SolrCore [collection1] Registered new searcher Searcher@756b80f6[collection1] main{ExitableDirectoryReader(UninvertingDirectoryReader())}
   [junit4]   2> 336065 INFO  (TEST-TestArbitraryIndexDir.testLoadNewIndexDir-seed#[D6A108E82EA8EABA]) [    ] o.a.s.u.p.LogUpdateProcessorFactory [collection1]  webapp=null path=null params={}{add=[1]} 0 4
   [junit4]   2> 336133 INFO  (TEST-TestArbitraryIndexDir.testLoadNewIndexDir-seed#[D6A108E82EA8EABA]) [    ] o.a.s.u.DirectUpdateHandler2 start commit{,optimize=false,openSearcher=true,waitSearcher=true,expungeDeletes=false,softCommit=false,prepareCommit=false}
   [junit4]   2> 336193 INFO  (TEST-TestArbitraryIndexDir.testLoadNewIndexDir-seed#[D6A108E82EA8EABA]) [    ] o.a.s.c.SolrDeletionPolicy SolrDeletionPolicy.onCommit: commits: num=2
   [junit4]   2> 	commit{dir=MockDirectoryWrapper(MMapDirectory@/export/home/jenkins/workspace/Lucene-Solr-6.x-Solaris/solr/build/solr-core/test/J0/temp/solr.core.TestArbitraryIndexDir_D6A108E82EA8EABA-001/init-core-data-001/index lockFactory=org.apache.lucene.store.SingleInstanceLockFactory@296afebb),segFN=segments_1,generation=1}
   [junit4]   2> 	commit{dir=MockDirectoryWrapper(MMapDirectory@/export/home/jenkins/workspace/Lucene-Solr-6.x-Solaris/solr/build/solr-core/test/J0/temp/solr.core.TestArbitraryIndexDir_D6A108E82EA8EABA-001/init-core-data-001/index lockFactory=org.apache.lucene.store.SingleInstanceLockFactory@296afebb),segFN=segments_2,generation=2}
   [junit4]   2> 336194 INFO  (TEST-TestArbitraryIndexDir.testLoadNewIndexDir-seed#[D6A108E82EA8EABA]) [    ] o.a.s.c.SolrDeletionPolicy newest commit generation = 2
   [junit4]   2> 336196 INFO  (TEST-TestArbitraryIndexDir.testLoadNewIndexDir-seed#[D6A108E82EA8EABA]) [    ] o.a.s.c.SolrCore New index directory detected: old=/export/home/jenkins/workspace/Lucene-Solr-6.x-Solaris/solr/build/solr-core/test/J0/temp/solr.core.TestArbitraryIndexDir_D6A108E82EA8EABA-001/init-core-data-001/index/ new=/export/home/jenkins/workspace/Lucene-Solr-6.x-Solaris/solr/build/solr-core/test/J0/temp/solr.core.TestArbitraryIndexDir_D6A108E82EA8EABA-001/init-core-data-001/index_temp
   [junit4]   2> 336199 INFO  (TEST-TestArbitraryIndexDir.testLoadNewIndexDir-seed#[D6A108E82EA8EABA]) [    ] o.a.s.s.SolrIndexSearcher Opening [Searcher@455f6b83[collection1] main]
   [junit4]   2> 336199 INFO  (TEST-TestArbitraryIndexDir.testLoadNewIndexDir-seed#[D6A108E82EA8EABA]) [    ] o.a.s.u.DirectUpdateHandler2 end_commit_flush
   [junit4]   2> 336200 INFO  (searcherExecutor-1636-thread-1) [    ] o.a.s.c.SolrCore [collection1] Registered new searcher Searcher@455f6b83[collection1] main{ExitableDirectoryReader(UninvertingDirectoryReader(Uninverting(_0(6.1.0):c1)))}
   [junit4]   2> 336200 INFO  (TEST-TestArbitraryIndexDir.testLoadNewIndexDir-seed#[D6A108E82EA8EABA]) [    ] o.a.s.u.p.LogUpdateProcessorFactory [collection1]  webapp=null path=null params={}{commit=} 0 68
   [junit4]   2> 336201 INFO  (TEST-TestArbitraryIndexDir.testLoadNewIndexDir-seed#[D6A108E82EA8EABA]) [    ] o.a.s.c.SolrResourceLoader new SolrResourceLoader for directory: '/export/home/jenkins/workspace/Lucene-Solr-6.x-Solaris/solr/core/src/test-files/solr/collection1'
   [junit4]   2> 336201 INFO  (TEST-TestArbitraryIndexDir.testLoadNewIndexDir-seed#[D6A108E82EA8EABA]) [    ] o.a.s.c.SolrResourceLoader JNDI not configured for solr (NoInitialContextEx)
   [junit4]   2> 336201 INFO  (TEST-TestArbitraryIndexDir.testLoadNewIndexDir-seed#[D6A108E82EA8EABA]) [    ] o.a.s.c.SolrResourceLoader using system property solr.solr.home: /export/home/jenkins/workspace/Lucene-Solr-6.x-Solaris/solr/core/src/test-files/solr
   [junit4]   2> 336201 INFO  (TEST-TestArbitraryIndexDir.testLoadNewIndexDir-seed#[D6A108E82EA8EABA]) [    ] o.a.s.c.SolrResourceLoader Adding 'file:/export/home/jenkins/workspace/Lucene-Solr-6.x-Solaris/solr/core/src/test-files/solr/collection1/lib/classes/' to classloader
   [junit4]   2> 336201 INFO  (TEST-TestArbitraryIndexDir.testLoadNewIndexDir-seed#[D6A108E82EA8EABA]) [    ] o.a.s.c.SolrResourceLoader Adding 'file:/export/home/jenkins/workspace/Lucene-Solr-6.x-Solaris/solr/core/src/test-files/solr/collection1/lib/README' to classloader
   [junit4]   2> 336225 INFO  (TEST-TestArbitraryIndexDir.testLoadNewIndexDir-seed#[D6A108E82EA8EABA]) [    ] o.a.s.c.SolrConfig current version of requestparams : -1
   [junit4]   2> 336231 INFO  (TEST-TestArbitraryIndexDir.testLoadNewIndexDir-seed#[D6A108E82EA8EABA]) [    ] o.a.s.c.SolrConfig Using Lucene MatchVersion: 6.1.0
   [junit4]   2> 336245 INFO  (TEST-TestArbitraryIndexDir.testLoadNewIndexDir-seed#[D6A108E82EA8EABA]) [    ] o.a.s.c.SolrConfig Loaded SolrConfig: solrconfig.xml
   [junit4]   2> 336250 INFO  (TEST-TestArbitraryIndexDir.testLoadNewIndexDir-seed#[D6A108E82EA8EABA]) [    ] o.a.s.s.IndexSchema [collection1] Schema name=test
   [junit4]   2> 336328 INFO  (TEST-TestArbitraryIndexDir.testLoadNewIndexDir-seed#[D6A108E82EA8EABA]) [    ] o.a.s.s.IndexSchema default search field in schema is text
   [junit4]   2> 336329 INFO  (TEST-TestArbitraryIndexDir.testLoadNewIndexDir-seed#[D6A108E82EA8EABA]) [    ] o.a.s.s.IndexSchema unique key field: id
   [junit4]   2> 336329 WARN  (TEST-TestArbitraryIndexDir.testLoadNewIndexDir-seed#[D6A108E82EA8EABA]) [    ] o.a.s.s.IndexSchema Field text is not multivalued and destination for multiple copyFields (2)
   [junit4]   2> 336334 INFO  (TEST-TestArbitraryIndexDir.testLoadNewIndexDir-seed#[D6A108E82EA8EABA]) [    ] o.a.s.s.FileExchangeRateProvider Reloading exchange rates from file currency.xml
   [junit4]   2> 336336 INFO  (TEST-TestArbitraryIndexDir.testLoadNewIndexDir-seed#[D6A108E82EA8EABA]) [    ] o.a.s.s.FileExchangeRateProvider Reloading exchange rates from file currency.xml
   [junit4]   2> 336339 INFO  (TEST-TestArbitraryIndexDir.testLoadNewIndexDir-seed#[D6A108E82EA8EABA]) [    ] o.a.s.c.ConfigSetProperties Did not find ConfigSet properties, assuming default properties: Can't find resource 'configsetprops.json' in classpath or '/export/home/jenkins/workspace/Lucene-Solr-6.x-Solaris/solr/core/src/test-files/solr/collection1'
   [junit4]   2> 336339 INFO  (TEST-TestArbitraryIndexDir.testLoadNewIndexDir-seed#[D6A108E82EA8EABA]) [    ] o.a.s.c.CoreContainer Reloading SolrCore 'collection1' using configuration from instancedir /export/home/jenkins/workspace/Lucene-Solr-6.x-Solaris/solr/core/src/test-files/solr/collection1
   [junit4]   2> 336340 INFO  (TEST-TestArbitraryIndexDir.testLoadNewIndexDir-seed#[D6A108E82EA8EABA]) [    x:collection1] o.a.s.c.SolrCore [[collection1] ] Opening new SolrCore at [/export/home/jenkins/workspace/Lucene-Solr-6.x-Solaris/solr/core/src/test-files/solr/collection1], dataDir=[/export/home/jenkins/workspace/Lucene-Solr-6.x-Solaris/solr/build/solr-core/test/J0/temp/solr.core.TestArbitraryIndexDir_D6A108E82EA8EABA-001/init-core-data-001/]
   [junit4]   2> 336340 INFO  (TEST-TestArbitraryIndexDir.testLoadNewIndexDir-seed#[D6A108E82EA8EABA]) [    x:collection1] o.a.s.c.JmxMonitoredMap JMX monitoring is enabled. Adding Solr mbeans to JMX Server: com.sun.jmx.mbeanserver.JmxMBeanServer@39306e2d
   [junit4]   2> 336341 INFO  (TEST-TestArbitraryIndexDir.testLoadNewIndexDir-seed#[D6A108E82EA8EABA]) [    x:collection1] o.a.s.c.SolrCore New index directory detected: old=null new=/export/home/jenkins/workspace/Lucene-Solr-6.x-Solaris/solr/build/solr-core/test/J0/temp/solr.core.TestArbitraryIndexDir_D6A108E82EA8EABA-001/init-core-data-001/index_temp
   [junit4]   2> 336343 INFO  (OldIndexDirectoryCleanupThreadForCore-collection1) [    x:collection1] o.a.s.c.SolrCore Looking for old index directories to cleanup for core collection1 in /export/home/jenkins/workspace/Lucene-Solr-6.x-Solaris/solr/build/solr-core/test/J0/temp/solr.core.TestArbitraryIndexDir_D6A108E82EA8EABA-001/init-core-data-001/
   [junit4]   2> 336343 INFO  (OldIndexDirectoryCleanupThreadForCore-collection1) [    x:collection1] o.a.s.c.DirectoryFactory Found 1 old index directories to clean-up under /export/home/jenkins/workspace/Lucene-Solr-6.x-Solaris/solr/build/solr-core/test/J0/temp/solr.core.TestArbitraryIndexDir_D6A108E82EA8EABA-001/init-core-data-001/
   [junit4]   2> 336346 WARN  (OldIndexDirectoryCleanupThreadForCore-collection1) [    x:collection1] o.a.s.c.CachingDirectoryFactory Cannot delete directory /export/home/jenkins/workspace/Lucene-Solr-6.x-Solaris/solr/build/solr-core/test/J0/temp/solr.core.TestArbitraryIndexDir_D6A108E82EA8EABA-001/init-core-data-001/index as it is still being referenced in the cache!
   [junit4]   2> 336346 WARN  (OldIndexDirectoryCleanupThreadForCore-collection1) [    x:collection1] o.a.s.c.DirectoryFactory Delete old index directory /export/home/jenkins/workspace/Lucene-Solr-6.x-Solaris/solr/build/solr-core/test/J0/temp/solr.core.TestArbitraryIndexDir_D6A108E82EA8EABA-001/init-core-data-001/index failed.
   [junit4]   2> 336347 INFO  (TEST-TestArbitraryIndexDir.testLoadNewIndexDir-seed#[D6A108E82EA8EABA]) [    x:collection1] o.a.s.u.p.UpdateRequestProcessorChain creating updateRequestProcessorChain "dedupe"
   [junit4]   2> 336347 INFO  (TEST-TestArbitraryIndexDir.testLoadNewIndexDir-seed#[D6A108E82EA8EABA]) [    x:collection1] o.a.s.u.p.UpdateRequestProcessorChain inserting DistributedUpdateProcessorFactory into updateRequestProcessorChain "dedupe"
   [junit4]   2> 336347 INFO  (TEST-TestArbitraryIndexDir.testLoadNewIndexDir-seed#[D6A108E82EA8EABA]) [    x:collection1] o.a.s.u.p.UpdateRequestProcessorChain creating updateRequestProcessorChain "dedupe-allfields"
   [junit4]   2> 336347 INFO  (TEST-TestArbitraryIndexDir.testLoadNewIndexDir-seed#[D6A108E82EA8EABA]) [    x:collection1] o.a.s.u.p.UpdateRequestProcessorChain inserting DistributedUpdateProcessorFactory into updateRequestProcessorChain "dedupe-allfields"
   [junit4]   2> 336347 INFO  (TEST-TestArbitraryIndexDir.testLoadNewIndexDir-seed#[D6A108E82EA8EABA]) [    x:collection1] o.a.s.u.p.UpdateRequestProcessorChain creating updateRequestProcessorChain "stored_sig"
   [junit4]   2> 336347 INFO  (TEST-TestArbitraryIndexDir.testLoadNewIndexDir-seed#[D6A108E82EA8EABA]) [    x:collection1] o.a.s.u.p.UpdateRequestProcessorChain inserting DistributedUpdateProcessorFactory into updateRequestProcessorChain "stored_sig"
   [junit4]   2> 336347 INFO  (TEST-TestArbitraryIndexDir.testLoadNewIndexDir-seed#[D6A108E82EA8EABA]) [    x:collection1] o.a.s.u.p.UpdateRequestProcessorChain creating updateRequestProcessorChain "uniq-fields"
   [junit4]   2> 336347 INFO  (TEST-TestArbitraryIndexDir.testLoadNewIndexDir-seed#[D6A108E82EA8EABA]) [    x:collection1] o.a.s.u.p.UpdateRequestProcessorChain inserting DistributedUpdateProcessorFactory into updateRequestProcessorChain "uniq-fields"
   [junit4]   2> 336347 INFO  (TEST-TestArbitraryIndexDir.testLoadNewIndexDir-seed#[D6A108E82EA8EABA]) [    x:collection1] o.a.s.u.p.UpdateRequestProcessorChain creating updateRequestProcessorChain "distrib-dup-test-chain-explicit"
   [junit4]   2> 336347 INFO  (TEST-TestArbitraryIndexDir.testLoadNewIndexDir-seed#[D6A108E82EA8EABA]) [    x:collection1] o.a.s.u.p.UpdateRequestProcessorChain creating updateRequestProcessorChain "distrib-dup-test-chain-implicit"
   [junit4]   2> 336347 INFO  (TEST-TestArbitraryIndexDir.testLoadNewIndexDir-seed#[D6A108E82EA8EABA]) [    x:collection1] o.a.s.u.p.UpdateRequestProcessorChain inserting DistributedUpdateProcessorFactory into updateRequestProcessorChain "distrib-dup-test-chain-implicit"
   [junit4]   2> 336348 INFO  (TEST-TestArbitraryIndexDir.testLoadNewIndexDir-seed#[D6A108E82EA8EABA]) [    x:collection1] o.a.s.c.SolrCore no updateRequestProcessorChain defined as default, creating implicit default
   [junit4]   2> 336349 INFO  (TEST-TestArbitraryIndexDir.testLoadNewIndexDir-seed#[D6A108E82EA8EABA]) [    x:collection1] o.a.s.h.l.XMLLoader xsltCacheLifetimeSeconds=60
   [junit4]   2> 336350 INFO  (TEST-TestArbitraryIndexDir.testLoadNewIndexDir-seed#[D6A108E82EA8EABA]) [    x:collection1] o.a.s.h.l.XMLLoader xsltCacheLifetimeSeconds=60
   [junit4]   2> 336351 INFO  (TEST-TestArbitraryIndexDir.testLoadNewIndexDir-seed#[D6A108E82EA8EABA]) [    x:collection1] o.a.s.h.l.XMLLoader xsltCacheLifetimeSeconds=60
   [junit4]   2> 336352 INFO  (TEST-TestArbitraryIndexDir.testLoadNewIndexDir-seed#[D6A108E82EA8EABA]) [    x:collection1] o.a.s.h.l.XMLLoader xsltCacheLifetimeSeconds=60
   [junit4]   2> 336353 INFO  (TEST-TestArbitraryIndexDir.testLoadNewIndexDir-seed#[D6A108E82EA8EABA]) [    x:collection1] o.a.s.c.CachingDirectoryFactory return new directory for /export/home/jenkins/workspace/Lucene-Solr-6.x-Solaris/solr/build/solr-core/test/J0/temp/solr.core.TestArbitraryIndexDir_D6A108E82EA8EABA-001/init-core-data-001/index_temp
   [junit4]   2> 336365 INFO  (TEST-TestArbitraryIndexDir.testLoadNewIndexDir-seed#[D6A108E82EA8EABA]) [    x:collection1] o.a.s.c.PluginBag requestHandler : 'lazy' created with startup=lazy 
   [junit4]   2> 336367 INFO  (TEST-TestArbitraryIndexDir.testLoadNewIndexDir-seed#[D6A108E82EA8EABA]) [    x:collection1] o.a.s.c.RequestHandlers Registered paths: /admin/mbeans,standard,spellCheckCompRH,lazy,/update/json/docs,/admin/luke,/export,spellCheckWithWordbreak_Direct,tvrh,/get,/admin/properties,/update/json,mltrh,/admin/threads,/search-facet-def,/update/csv,/sql,/search-facet-invariants,/admin/segments,spellCheckCompRH1,/mlt,/admin/system,/replication,dismax,defaults,/config,/stream,/schema,/admin/plugins,/admin/logging,spellCheckWithWordbreak,mock,/admin/ping,/update,/admin/file,/terms,spellCheckCompRH_Direct,/debug/dump
   [junit4]   2> 336367 INFO  (TEST-TestArbitraryIndexDir.testLoadNewIndexDir-seed#[D6A108E82EA8EABA]) [    x:collection1] o.a.s.c.SolrCore Using default statsCache cache: org.apache.solr.search.stats.LocalStatsCache
   [junit4]   2> 336368 INFO  (TEST-TestArbitraryIndexDir.testLoadNewIndexDir-seed#[D6A108E82EA8EABA]) [    x:collection1] o.a.s.u.CommitTracker Hard AutoCommit: disabled
   [junit4]   2> 336368 INFO  (TEST-TestArbitraryIndexDir.testLoadNewIndexDir-seed#[D6A108E82EA8EABA]) [    x:collection1] o.a.s.u.CommitTracker Soft AutoCommit: disabled
   [junit4]   2> 336368 INFO  (TEST-TestArbitraryIndexDir.testLoadNewIndexDir-seed#[D6A108E82EA8EABA]) [    x:collection1] o.a.s.s.SolrIndexSearcher Opening [Searcher@76efa2ea[collection1] main]
   [junit4]   2> 336368 INFO  (TEST-TestArbitraryIndexDir.testLoadNewIndexDir-seed#[D6A108E82EA8EABA]) [    x:collection1] o.a.s.r.RestManager Initializing RestManager with initArgs: {storageIO=org.apache.solr.rest.ManagedResourceStorage$InMemoryStorageIO}
   [junit4]   2> 336368 INFO  (TEST-TestArbitraryIndexDir.testLoadNewIndexDir-seed#[D6A108E82EA8EABA]) [    x:collection1] o.a.s.r.ManagedResourceStorage Reading _rest_managed.json using InMemoryStorage
   [junit4]   2> 336369 INFO  (TEST-TestArbitraryIndexDir.testLoadNewIndexDir-seed#[D6A108E82EA8EABA]) [    x:collection1] o.a.s.r.RestManager Initializing 0 registered ManagedResources
   [junit4]   2> 336369 INFO  (TEST-TestArbitraryIndexDir.testLoadNewIndexDir-seed#[D6A108E82EA8EABA]) [    x:collection1] o.a.s.h.c.SpellCheckComponent Initializing spell checkers
   [junit4]   2> 336369 INFO  (TEST-TestArbitraryIndexDir.testLoadNewIndexDir-seed#[D6A108E82EA8EABA]) [    x:collection1] o.a.s.s.DirectSolrSpellChecker init: {name=direct,classname=DirectSolrSpellChecker,field=lowerfilt,minQueryLength=3}
   [junit4]   2> 336374 INFO  (TEST-TestArbitraryIndexDir.testLoadNewIndexDir-seed#[D6A108E82EA8EABA]) [    x:collection1] o.a.s.h.ReplicationHandler Commits will be reserved for  10000
   [junit4]   2> 336374 INFO  (searcherExecutor-1640-thread-1-processing-x:collection1) [    x:collection1] o.a.s.h.c.SpellCheckComponent Loading spell index for spellchecker: default
   [junit4]   2> 336375 INFO  (searcherExecutor-1640-thread-1-processing-x:collection1) [    x:collection1] o.a.s.h.c.SpellCheckComponent Loading spell index for spellchecker: direct
   [junit4]   2> 336375 INFO  (searcherExecutor-1640-thread-1-processing-x:collection1) [    x:collection1] o.a.s.h.c.SpellCheckComponent Loading spell index for spellchecker: wordbreak
   [junit4]   2> 336375 INFO  (searcherExecutor-1640-thread-1-processing-x:collection1) [    x:collection1] o.a.s.h.c.SpellCheckComponent Loading spell index for spellchecker: multipleFields
   [junit4]   2> 336375 INFO  (TEST-TestArbitraryIndexDir.testLoadNewIndexDir-seed#[D6A108E82EA8EABA]) [    x:collection1] o.a.s.u.DefaultSolrCoreState Closing old IndexWriter... core=collection1
   [junit4]   2> 336376 INFO  (TEST-TestArbitraryIndexDir.testLoadNewIndexDir-seed#[D6A108E82EA8EABA]) [    x:collection1] o.a.s.u.RandomMergePolicy RandomMergePolicy wrapping class org.apache.lucene.index.TieredMergePolicy: [TieredMergePolicy: maxMergeAtOnce=47, maxMergeAtOnceExplicit=37, maxMergedSegmentMB=50.0576171875, floorSegmentMB=0.638671875, forceMergeDeletesPctAllowed=19.21443012602365, segmentsPerTier=29.0, maxCFSSegmentSizeMB=8.796093022207999E12, noCFSRatio=1.0
   [junit4]   2> 336376 INFO  (searcherExecutor-1640-thread-1-processing-x:collection1) [    x:collection1] o.a.s.h.c.SpellCheckComponent Loading spell index for spellchecker: jarowinkler
   [junit4]   2> 336376 INFO  (searcherExecutor-1640-thread-1-processing-x:collection1) [    x:collection1] o.a.s.h.c.SpellCheckComponent Loading spell index for spellchecker: external
   [junit4]   2> 336377 INFO  (searcherExecutor-1640-thread-1-processing-x:collection1) [    x:collection1] o.a.s.h.c.SpellCheckComponent Loading spell index for spellchecker: freq
   [junit4]   2> 336378 INFO  (searcherExecutor-1640-thread-1-processing-x:collection1) [    x:collection1] o.a.s.h.c.SpellCheckComponent Loading spell index for spellchecker: fqcn
   [junit4]   2> 336378 INFO  (TEST-TestArbitraryIndexDir.testLoadNewIndexDir-seed#[D6A108E82EA8EABA]) [    x:collection1] o.a.s.c.SolrDeletionPolicy SolrDeletionPolicy.onInit: commits: num=1
   [junit4]   2> 	commit{dir=MockDirectoryWrapper(SimpleFSDirectory@/export/home/jenkins/workspace/Lucene-Solr-6.x-Solaris/solr/build/solr-core/test/J0/temp/solr.core.TestArbitraryIndexDir_D6A108E82EA8EABA-001/init-core-data-001/index_temp lockFactory=org.apache.lucene.store.SingleInstanceLockFactory@e550d6c),segFN=segments_1,generation=1}
   [junit4]   2> 336378 INFO  (TEST-TestArbitraryIndexDir.testLoadNewIndexDir-seed#[D6A108E82EA8EABA]) [    x:collection1] o.a.s.c.SolrDeletionPolicy newest commit generation = 1
   [junit4]   2> 336379 INFO  (TEST-TestArbitraryIndexDir.testLoadNewIndexDir-seed#[D6A108E82EA8EABA]) [    x:collection1] o.a.s.u.DefaultSolrCoreState New IndexWriter is ready to be used.
   [junit4]   2> 336379 WARN  (TEST-TestArbitraryIndexDir.testLoadNewIndexDir-seed#[D6A108E82EA8EABA]) [    x:collection1] o.a.s.c.SolrCore [collection1] PERFORMANCE WARNING: Overlapping onDeckSearchers=2
   [junit4]   2> 336380 INFO  (TEST-TestArbitraryIndexDir.testLoadNewIndexDir-seed#[D6A108E82EA8EABA]) [    x:collection1] o.a.s.s.SolrIndexSearcher Opening [Searcher@a452e28[collection1] main]
   [junit4]   2> 336380 INFO  (TEST-TestArbitraryIndexDir.testLoadNewIndexDir-seed#[D6A108E82EA8EABA]) [    x:collection1] o.a.s.c.CoreContainer replacing core: collection1
   [junit4]   2> 336380 INFO  (TEST-TestArbitraryIndexDir.testLoadNewIndexDir-seed#[D6A108E82EA8EABA]) [    x:collection1] o.a.s.c.SolrCore [collection1]  CLOSING SolrCore org.apache.solr.core.SolrCore@7bc5e56f
   [junit4]   2> 336380 INFO  (TEST-TestArbitraryIndexDir.testLoadNewIndexDir-seed#[D6A108E82EA8EABA]) [    x:collection1] o.a.s.u.DirectUpdateHandler2 closing DirectUpdateHandler2{commits=1,autocommits=0,soft autocommits=0,optimizes=0,rollbacks=0,expungeDeletes=0,docsPending=0,adds=0,deletesById=0,deletesByQuery=0,errors=0,cumulative_adds=1,cumulative_deletesById=0,cumulative_deletesByQuery=0,cumulative_errors=0}
   [junit4]   2> 336380 INFO  (searcherExecutor-1640-thread-1-processing-x:collection1) [    x:collection1] o.a.s.h.c.SpellCheckComponent Loading spell index for spellchecker: perDict
   [junit4]   2> 336381 INFO  (searcherExecutor-1640-thread-1-processing-x:collection1) [    x:collection1] o.a.s.c.SolrCore [collection1] Registered new searcher Searcher@76efa2ea[collection1] main{ExitableDirectoryReader(UninvertingDirectoryReader(Uninverting(_0(6.1.0):c1)))}
   [junit4]   2> 336381 INFO  (searcherExecutor-1640-thread-1-processing-x:collection1) [    x:collection1] o.a.s.h.c.SpellCheckComponent Loading spell index for spellchecker: default
   [junit4]   2> 336382 INFO  (searcherExecutor-1640-thread-1-processing-x:collection1) [    x:collection1] o.a.s.h.c.SpellCheckComponent Loading spell index for spellchecker: direct
   [junit4]   2> 336382 INFO  (searcherExecutor-1640-thread-1-processing-x:collection1) [    x:collection1] o.a.s.h.c.SpellCheckComponent Loading spell index for spellchecker: wordbreak
   [junit4]   2> 336382 INFO  (searcherExecutor-1640-thread-1-processing-x:collection1) [    x:collection1] o.a.s.h.c.SpellCheckComponent Loading spell index for spellchecker: multipleFields
   [junit4]   2> 336383 INFO  (TEST-TestArbitraryIndexDir.testLoadNewIndexDir-seed#[D6A108E82EA8EABA]) [    x:collection1] o.a.s.c.SolrCore [collection1] Closing main searcher on request.
   [junit4]   2> 336386 INFO  (searcherExecutor-1640-thread-1-processing-x:collection1) [    x:collection1] o.a.s.h.c.SpellCheckComponent Loading spell index for spellchecker: jarowinkler
   [junit4]   2> 336387 INFO  (searcherExecutor-1640-thread-1-processing-x:collection1) [    x:collection1] o.a.s.h.c.SpellCheckComponent Loading spell index for spellchecker: external
   [junit4]   2> 336389 INFO  (searcherExecutor-1640-thread-1-processing-x:collection1) [    x:collection1] o.a.s.h.c.SpellCheckComponent Loading spell index for spellchecker: freq
   [junit4]   2> 336389 INFO  (TEST-TestArbitraryIndexDir.testLoadNewIndexDir-seed#[D6A108E82EA8EABA]) [    x:collection1] o.a.s.c.S.Request [collection1]  webapp=null path=null params={q=id:2&qt=standard&start=0&rows=20&version=2.2} hits=0 status=0 QTime=0
   [junit4]   2> 336390 INFO  (searcherExecutor-1640-thread-1-processing-x:collection1) [    x:collection1] o.a.s.h.c.SpellCheckComponent Loading spell index for spellchecker: fqcn
   [junit4]   2> 336390 ERROR (TEST-TestArbitraryIndexDir.testLoadNewIndexDir-seed#[D6A108E82EA8EABA]) [    x:collection1] o.a.s.SolrTestCaseJ4 REQUEST FAILED: xpath=*[count(//doc)=1]
   [junit4]   2> 	xml response was: <?xml version="1.0" encoding="UTF-8"?>
   [junit4]   2> <response>
   [junit4]   2> <lst name="responseHeader"><int name="status">0</int><int name="QTime">0</int></lst><result name="response" numFound="0" start="0"></result>
   [junit4]   2> </response>
   [junit4]   2> 
   [junit4]   2> 	request was:q=id:2&qt=standard&start=0&rows=20&version=2.2
   [junit4]   2> 336390 INFO  (searcherExecutor-1640-thread-1-processing-x:collection1) [    x:collection1] o.a.s.h.c.SpellCheckComponent Loading spell index for spellchecker: perDict
   [junit4]   2> 336390 ERROR (TEST-TestArbitraryIndexDir.testLoadNewIndexDir-seed#[D6A108E82EA8EABA]) [    x:collection1] o.a.s.SolrTestCaseJ4 REQUEST FAILED: q=id:2&qt=standard&start=0&rows=20&version=2.2:java.lang.RuntimeException: REQUEST FAILED: xpath=*[count(//doc)=1]
   [junit4]   2> 	xml response was: <?xml version="1.0" encoding="UTF-8"?>
   [junit4]   2> <response>
   [junit4]   2> <lst name="responseHeader"><int name="status">0</int><int name="QTime">0</int></lst><result name="response" numFound="0" start="0"></result>
   [junit4]   2> </response>
   [junit4]   2> 
   [junit4]   2> 	request was:q=id:2&qt=standard&start=0&rows=20&version=2.2
   [junit4]   2> 	at org.apache.solr.SolrTestCaseJ4.assertQ(SolrTestCaseJ4.java:776)
   [junit4]   2> 	at org.apache.solr.core.TestArbitraryIndexDir.testLoadNewIndexDir(TestArbitraryIndexDir.java:107)
   [junit4]   2> 	at sun.reflect.NativeMethodAccessorImpl.invoke0(Native Method)
   [junit4]   2> 	at sun.reflect.NativeMethodAccessorImpl.invoke(NativeMethodAccessorImpl.java:62)
   [junit4]   2> 	at sun.reflect.DelegatingMethodAccessorImpl.invoke(DelegatingMethodAccessorImpl.java:43)
   [junit4]   2> 	at java.lang.reflect.Method.invoke(Method.java:498)
   [junit4]   2> 	at com.carrotsearch.randomizedtesting.RandomizedRunner.invoke(RandomizedRunner.java:1764)
   [junit4]   2> 	at com.carrotsearch.randomizedtesting.RandomizedRunner$8.evaluate(RandomizedRunner.java:871)
   [junit4]   2> 	at com.carrotsearch.randomizedtesting.RandomizedRunner$9.evaluate(RandomizedRunner.java:907)
   [junit4]   2> 	at com.carrotsearch.randomizedtesting.RandomizedRunner$10.evaluate(RandomizedRunner.java:921)
   [junit4]   2> 	at com.carrotsearch.randomizedtesting.rules.SystemPropertiesRestoreRule$1.evaluate(SystemPropertiesRestoreRule.java:57)
   [junit4]   2> 	at com.carrotsearch.randomizedtesting.rules.SystemPropertiesRestoreRule$1.evaluate(SystemPropertiesRestoreRule.java:57)
   [junit4]   2> 	at org.apache.lucene.util.TestRuleSetupTeardownChained$1.evaluate(TestRuleSetupTeardownChained.java:49)
   [junit4]   2> 	at org.apache.lucene.util.AbstractBeforeAfterRule$1.evaluate(AbstractBeforeAfterRule.java:45)
   [junit4]   2> 	at org.apache.lucene.util.TestRuleThreadAndTestName$1.evaluate(TestRuleThreadAndTestName.java:48)
   [junit4]   2> 	at org.apache.lucene.util.TestRuleIgnoreAfterMaxFailures$1.evaluate(TestRuleIgnoreAfterMaxFailures.java:64)
   [junit4]   2> 	at org.apache.lucene.util.TestRuleMarkFailure$1.evaluate(TestRuleMarkFailure.java:47)
   [junit4]   2> 	at com.carrotsearch.randomizedtesting.rules.StatementAdapter.evaluate(StatementAdapter.java:36)
   [junit4]   2> 	at com.carrotsearch.randomizedtesting.ThreadLeakControl$StatementRunner.run(ThreadLeakControl.java:367)
   [junit4]   2> 	at com.carrotsearch.randomizedtesting.ThreadLeakControl.forkTimeoutingTask(ThreadLeakControl.java:809)
   [junit4]   2> 	at com.carrotsearch.randomizedtesting.ThreadLeakControl$3.evaluate(ThreadLeakControl.java:460)
   [junit4]   2> 	at com.carrotsearch.randomizedtesting.RandomizedRunner.runSingleTest(RandomizedRunner.java:880)
   [junit4]   2> 	at com.carrotsearch.randomizedtesting.RandomizedRunner$5.evaluate(RandomizedRunner.java:781)
   [junit4]   2> 	at com.carrotsearch.randomizedtesting.RandomizedRunner$6.evaluate(RandomizedRunner.java:816)
   [junit4]   2> 	at com.carrotsearch.randomizedtesting.RandomizedRunner$7.evaluate(RandomizedRunner.java:827)
   [junit4]   2> 	at com.carrotsearch.randomizedtesting.rules.StatementAdapter.evaluate(StatementAdapter.java:36)
   [junit4]   2> 	at com.carrotsearch.randomizedtesting.rules.SystemPropertiesRestoreRule$1.evaluate(SystemPropertiesRestoreRule.java:57)
   [junit4]   2> 	at org.apache.lucene.util.AbstractBeforeAfterRule$1.evaluate(AbstractBeforeAfterRule.java:45)
   [junit4]   2> 	at com.carrotsearch.randomizedtesting.rules.StatementAdapter.evaluate(StatementAdapter.java:36)
   [junit4]   2> 	at org.apache.lucene.util.TestRuleStoreClassName$1.evaluate(TestRuleStoreClassName.java:41)
   [junit4]   2> 	at com.carrotsearch.randomizedtesting.rules.NoShadowingOrOverridesOnMethodsRule$1.evaluate(NoShadowingOrOverridesOnMethodsRule.java:40)
   [junit4]   2> 	at com.carrotsearch.randomizedtesting.rules.NoShadowingOrOverridesOnMethodsRule$1.evaluate(NoShadowingOrOverridesOnMethodsRule.java:40)
   [junit4]   2> 	at com.carrotsearch.randomizedtesting.rules.StatementAdapter.evaluate(StatementAdapter.java:36)
   [junit4]   2> 	at com.carrotsearch.randomizedtesting.rules.StatementAdapter.evaluate(StatementAdapter.java:36)
   [junit4]   2> 	at com.carrotsearch.randomizedtesting.rules.StatementAdapter.evaluate(StatementAdapter.java:36)
   [junit4]   2> 	at org.apache.lucene.util.TestRuleAssertionsRequired$1.evaluate(TestRuleAssertionsRequired.java:53)
   [junit4]   2> 	at org.apache.lucene.util.TestRuleMarkFailure$1.evaluate(TestRuleMarkFailure.java:47)
   [junit4]   2> 	at org.apache.lucene.util.TestRuleIgnoreAfterMaxFailures$1.evaluate(TestRuleIgnoreAfterMaxFailures.java:64)
   [junit4]   2> 	at org.apache.lucene.util.TestRuleIgnoreTestSuites$1.evaluate(TestRuleIgnoreTestSuites.java:54)
   [junit4]   2> 	at com.carrotsearch.randomizedtesting.rules.StatementAdapter.evaluate(StatementAdapter.java:36)
   [junit4]   2> 	at com.carrotsearch.randomizedtesting.ThreadLeakControl$StatementRunner.run(ThreadLeakControl.java:367)
   [junit4]   2> 	at java.lang.Thread.run(Thread.java:745)
   [junit4]   2> 
   [junit4]   2> 336391 INFO  (TEST-TestArbitraryIndexDir.testLoadNewIndexDir-seed#[D6A108E82EA8EABA]) [    x:collection1] o.a.s.SolrTestCaseJ4 ###Ending testLoadNewIndexDir
   [junit4]   2> 336391 INFO  (searcherExecutor-1640-thread-1-processing-x:collection1) [    x:collection1] o.a.s.c.SolrCore [collection1] Registered new searcher Searcher@a452e28[collection1] main{ExitableDirectoryReader(UninvertingDirectoryReader(Uninverting(_0(6.1.0):c1)))}
   [junit4]   2> NOTE: reproduce with: ant test  -Dtestcase=TestArbitraryIndexDir -Dtests.method=testLoadNewIndexDir -Dtests.seed=D6A108E82EA8EABA -Dtests.slow=true -Dtests.locale=ar-OM -Dtests.timezone=Pacific/Ponape -Dtests.asserts=true -Dtests.file.encoding=UTF-8
   [junit4] ERROR   0.96s J0 | TestArbitraryIndexDir.testLoadNewIndexDir <<<
   [junit4]    > Throwable #1: java.lang.RuntimeException: Exception during query
   [junit4]    > 	at __randomizedtesting.SeedInfo.seed([D6A108E82EA8EABA:3FFBB3D0B0317A12]:0)
   [junit4]    > 	at org.apache.solr.SolrTestCaseJ4.assertQ(SolrTestCaseJ4.java:783)
   [junit4]    > 	at org.apache.solr.core.TestArbitraryIndexDir.testLoadNewIndexDir(TestArbitraryIndexDir.java:107)
   [junit4]    > 	at java.lang.Thread.run(Thread.java:745)
   [junit4]    > Caused by: java.lang.RuntimeException: REQUEST FAILED: xpath=*[count(//doc)=1]
   [junit4]    > 	xml response was: <?xml version="1.0" encoding="UTF-8"?>
   [junit4]    > <response>
   [junit4]    > <lst name="responseHeader"><int name="status">0</int><int name="QTime">0</int></lst><result name="response" numFound="0" start="0"></result>
   [junit4]    > </response>
   [junit4]    > 	request was:q=id:2&qt=standard&start=0&rows=20&version=2.2
   [junit4]    > 	at org.apache.solr.SolrTestCaseJ4.assertQ(SolrTestCaseJ4.java:776)
   [junit4]    > 	... 41 more
   [junit4]   2> 336394 INFO  (SUITE-TestArbitraryIndexDir-seed#[D6A108E82EA8EABA]-worker) [    x:collection1] o.a.s.SolrTestCaseJ4 ###deleteCore
   [junit4]   2> 336394 INFO  (SUITE-TestArbitraryIndexDir-seed#[D6A108E82EA8EABA]-worker) [    x:collection1] o.a.s.c.CoreContainer Shutting down CoreContainer instance=1552350427
   [junit4]   2> 336394 INFO  (coreCloseExecutor-1644-thread-1-processing-x:collection1) [    x:collection1] o.a.s.c.SolrCore [collection1]  CLOSING SolrCore org.apache.solr.core.SolrCore@2469b2ff
   [junit4]   2> 336394 INFO  (coreCloseExecutor-1644-thread-1-processing-x:collection1) [    x:collection1] o.a.s.u.DirectUpdateHandler2 closing DirectUpdateHandler2{commits=0,autocommits=0,soft autocommits=0,optimizes=0,rollbacks=0,expungeDeletes=0,docsPending=0,adds=0,deletesById=0,deletesByQuery=0,errors=0,cumulative_adds=0,cumulative_deletesById=0,cumulative_deletesByQuery=0,cumulative_errors=0}
   [junit4]   2> 336394 INFO  (coreCloseExecutor-1644-thread-1-processing-x:collection1) [    x:collection1] o.a.s.u.SolrCoreState Closing SolrCoreState
   [junit4]   2> 336394 INFO  (coreCloseExecutor-1644-thread-1-processing-x:collection1) [    x:collection1] o.a.s.u.DefaultSolrCoreState SolrCoreState ref count has reached 0 - closing IndexWriter
   [junit4]   2> 336394 INFO  (coreCloseExecutor-1644-thread-1-processing-x:collection1) [    x:collection1] o.a.s.u.DefaultSolrCoreState closing IndexWriter with IndexWriterCloser
   [junit4]   2> 336398 INFO  (coreCloseExecutor-1644-thread-1-processing-x:collection1) [    x:collection1] o.a.s.c.SolrCore [collection1] Closing main searcher on request.
   [junit4]   2> 336411 INFO  (coreCloseExecutor-1644-thread-1-processing-x:collection1) [    x:collection1] o.a.s.c.CachingDirectoryFactory Closing MockFSDirectoryFactory - 3 directories currently being tracked
   [junit4]   2> 336411 INFO  (coreCloseExecutor-1644-thread-1-processing-x:collection1) [    x:collection1] o.a.s.c.CachingDirectoryFactory looking to close /export/home/jenkins/workspace/Lucene-Solr-6.x-Solaris/solr/build/solr-core/test/J0/temp/solr.core.TestArbitraryIndexDir_D6A108E82EA8EABA-001/init-core-data-001 [CachedDir<<refCount=0;path=/export/home/jenkins/workspace/Lucene-Solr-6.x-Solaris/solr/build/solr-core/test/J0/temp/solr.core.TestArbitraryIndexDir_D6A108E82EA8EABA-001/init-core-data-001;done=false>>]
   [junit4]   2> 336411 INFO  (coreCloseExecutor-1644-thread-1-processing-x:collection1) [    x:collection1] o.a.s.c.CachingDirectoryFactory Closing directory, CoreContainer#isShutdown=true
   [junit4]   2> 336411 INFO  (coreCloseExecutor-1644-thread-1-processing-x:collection1) [    x:collection1] o.a.s.c.CachingDirectoryFactory Closing directory: /export/home/jenkins/workspace/Lucene-Solr-6.x-Solaris/solr/build/solr-core/test/J0/temp/solr.core.TestArbitraryIndexDir_D6A108E82EA8EABA-001/init-core-data-001
   [junit4]   2> 336412 INFO  (coreCloseExecutor-1644-thread-1-processing-x:collection1) [    x:collection1] o.a.s.c.CachingDirectoryFactory looking to close /export/home/jenkins/workspace/Lucene-Solr-6.x-Solaris/solr/build/solr-core/test/J0/temp/solr.core.TestArbitraryIndexDir_D6A108E82EA8EABA-001/init-core-data-001/index [CachedDir<<refCount=0;path=/export/home/jenkins/workspace/Lucene-Solr-6.x-Solaris/solr/build/solr-core/test/J0/temp/solr.core.TestArbitraryIndexDir_D6A108E82EA8EABA-001/init-core-data-001/index;done=false>>]
   [junit4]   2> 336412 INFO  (coreCloseExecutor-1644-thread-1-processing-x:collection1) [    x:collection1] o.a.s.c.CachingDirectoryFactory Closing directory, CoreContainer#isShutdown=true
   [junit4]   2> 336412 INFO  (coreCloseExecutor-1644-thread-1-processing-x:collection1) [    x:collection1] o.a.s.c.CachingDirectoryFactory Closing directory: /export/home/jenkins/workspace/Lucene-Solr-6.x-Solaris/solr/build/solr-core/test/J0/temp/solr.core.TestArbitraryIndexDir_D6A108E82EA8EABA-001/init-core-data-001/index
   [junit4]   2> 336442 INFO  (coreCloseExecutor-1644-thread-1-processing-x:collection1) [    x:collection1] o.a.s.c.CachingDirectoryFactory looking to close /export/home/jenkins/workspace/Lucene-Solr-6.x-Solaris/solr/build/solr-core/test/J0/temp/solr.core.TestArbitraryIndexDir_D6A108E82EA8EABA-001/init-core-data-001/index_temp [CachedDir<<refCount=0;path=/export/home/jenkins/workspace/Lucene-Solr-6.x-Solaris/solr/build/solr-core/test/J0/temp/solr.core.TestArbitraryIndexDir_D6A108E82EA8EABA-001/init-core-data-001/index_temp;done=false>>]
   [junit4]   2> 336442 INFO  (coreCloseExecutor-1644-thread-1-processing-x:collection1) [    x:collection1] o.a.s.c.CachingDirectoryFactory Closing directory, CoreContainer#isShutdown=true
   [junit4]   2> 336442 INFO  (coreCloseExecutor-1644-thread-1-processing-x:collection1) [    x:collection1] o.a.s.c.CachingDirectoryFactory Closing directory: /export/home/jenkins/workspace/Lucene-Solr-6.x-Solaris/solr/build/solr-core/test/J0/temp/solr.core.TestArbitraryIndexDir_D6A108E82EA8EABA-001/init-core-data-001/index_temp
   [junit4]   2> NOTE: leaving temporary files on disk at: /export/home/jenkins/workspace/Lucene-Solr-6.x-Solaris/solr/build/solr-core/test/J0/temp/solr.core.TestArbitraryIndexDir_D6A108E82EA8EABA-001
   [junit4]   2> NOTE: test params are: codec=Asserting(Lucene60), sim=RandomSimilarity(queryNorm=true,coord=crazy): {}, locale=ar-OM, timezone=Pacific/Ponape
   [junit4]   2> NOTE: SunOS 5.11 amd64/Oracle Corporation 1.8.0_72 (64-bit)/cpus=3,threads=1,free=202839584,total=364904448
   [junit4]   2> NOTE: All tests run in this JVM: [TestGroupingSearch, HdfsChaosMonkeySafeLeaderTest, JavabinLoaderTest, SolrIndexConfigTest, HdfsDirectoryTest, TestLazyCores, TestSchemaManager, BigEndianAscendingWordDeserializerTest, MultiThreadedOCPTest, TlogReplayBufferedWhileIndexingTest, LeaderElectionTest, TestSolrConfigHandlerCloud, SpatialFilterTest, TestRemoteStreaming, DirectSolrSpellCheckerTest, LeaderInitiatedRecoveryOnShardRestartTest, SampleTest, RestartWhileUpdatingTest, DocValuesMultiTest, SolrCloudExampleTest, TestHighlightDedupGrouping, TestFileDictionaryLookup, TestScoreJoinQPNoScore, ShardRoutingTest, TestArbitraryIndexDir]
   [junit4] Completed [42/585 (1!)] on J0 in 1.03s, 1 test, 1 error <<< FAILURES!

[...truncated 1756 lines...]
BUILD FAILED
/export/home/jenkins/workspace/Lucene-Solr-6.x-Solaris/build.xml:740: The following error occurred while executing this line:
/export/home/jenkins/workspace/Lucene-Solr-6.x-Solaris/build.xml:684: The following error occurred while executing this line:
/export/home/jenkins/workspace/Lucene-Solr-6.x-Solaris/build.xml:59: The following error occurred while executing this line:
/export/home/jenkins/workspace/Lucene-Solr-6.x-Solaris/solr/build.xml:233: The following error occurred while executing this line:
/export/home/jenkins/workspace/Lucene-Solr-6.x-Solaris/solr/common-build.xml:529: The following error occurred while executing this line:
/export/home/jenkins/workspace/Lucene-Solr-6.x-Solaris/lucene/common-build.xml:1457: The following error occurred while executing this line:
/export/home/jenkins/workspace/Lucene-Solr-6.x-Solaris/lucene/common-build.xml:1014: There were test failures: 585 suites (10 ignored), 2363 tests, 1 error, 85 ignored (70 assumptions) [seed: D6A108E82EA8EABA]

Total time: 77 minutes 12 seconds
Build step 'Invoke Ant' marked build as failure
Archiving artifacts
[WARNINGS] Skipping publisher since build result is FAILURE
Recording test results
Email was triggered for: Failure - Any
Sending email for trigger: Failure - Any