You are viewing a plain text version of this content. The canonical link for it is here.
Posted to issues@cxf.apache.org by "Freeman Yue Fang (Jira)" <ji...@apache.org> on 2024/11/20 16:02:00 UTC

[jira] [Comment Edited] (CXF-9084) Failure building CXF Packages

    [ https://issues.apache.org/jira/browse/CXF-9084?page=com.atlassian.jira.plugin.system.issuetabpanels:comment-tabpanel&focusedCommentId=17899500#comment-17899500 ] 

Freeman Yue Fang edited comment on CXF-9084 at 11/20/24 4:01 PM:
-----------------------------------------------------------------

Hi [~bitan],

Could you please append the build.log here?
The path is like
cxf_code_path/maven-plugins/codegen-plugin/target/it/jaxb-xjc-runtime-sources/build.log

The build.log should reveal more.

Btw,  I can't reproduce it by myself

Thanks!
Freeman


was (Author: ffang):
Hi [~bitan],

Could you please append the build.log here?
The path is like
cxf_code_path/maven-plugins/codegen-plugin/target/it/jaxb-xjc-runtime-sources/build.log

The build.log should reveal more.

Thanks!
Freeman

> Failure building CXF Packages
> -----------------------------
>
>                 Key: CXF-9084
>                 URL: https://issues.apache.org/jira/browse/CXF-9084
>             Project: CXF
>          Issue Type: Bug
>    Affects Versions: 4.0.5
>            Reporter: Bitan Paul
>            Priority: Major
>
> I’m encountering a consistent build failure with cxf-rt-frontend-jaxws-4.0.5. Specifically, all the CXF packages are failing with the following error log:
> [ERROR] The following builds failed:
> [ERROR] * jaxb-xjc-runtime-sources/pom.xml
> [ERROR] * mark-generated/pom.xml
> [ERROR] * wsdl-artifact-resolution/pom.xml
> [ERROR] * jdk-cxf-with-toolchain/pom.xml
> [ERROR] Failed to execute goal org.apache.maven.plugins:maven-invoker-plugin:3.7.0:verify (test-integration) on project cxf-codegen-plugin: 4 builds failed. See console output above for details. -> [Help 1]
> org.apache.maven.lifecycle.LifecycleExecutionException: Failed to execute goal org.apache.maven.plugins:maven-invoker-plugin:3.7.0:verify (test-integration) on project cxf-codegen-plugin: 4 builds failed. See console output above for details.
> I think this error is related to the maven-invoker-plugin found in the POM file within the codegen-plugin folder. I’ve tried different Java versions and various build commands, but the error persists across all attempts. Additionally, even when fetching the failing dependencies online, the main package still fails for the same reason.



--
This message was sent by Atlassian Jira
(v8.20.10#820010)