You are viewing a plain text version of this content. The canonical link for it is here.
Posted to dev@zookeeper.apache.org by Apache Jenkins Server <je...@builds.apache.org> on 2015/10/22 00:51:15 UTC
ZooKeeper_branch34_solaris - Build # 1060 - Failure
See https://builds.apache.org/job/ZooKeeper_branch34_solaris/1060/
###################################################################################
########################## LAST 60 LINES OF THE CONSOLE ###########################
[...truncated 176279 lines...]
[junit] 2015-10-21 22:52:17,211 [myid:] - INFO [main:JMXEnv@246] - expect:StandaloneServer_port
[junit] 2015-10-21 22:52:17,211 [myid:] - INFO [main:JMXEnv@250] - found:StandaloneServer_port org.apache.ZooKeeperService:name0=StandaloneServer_port11221
[junit] 2015-10-21 22:52:17,211 [myid:] - INFO [main:ClientBase@490] - STOPPING server
[junit] 2015-10-21 22:52:17,211 [myid:] - INFO [main:ZooKeeperServer@467] - shutting down
[junit] 2015-10-21 22:52:17,212 [myid:] - INFO [main:SessionTrackerImpl@225] - Shutting down
[junit] 2015-10-21 22:52:17,212 [myid:] - INFO [main:PrepRequestProcessor@767] - Shutting down
[junit] 2015-10-21 22:52:17,212 [myid:] - INFO [main:SyncRequestProcessor@209] - Shutting down
[junit] 2015-10-21 22:52:17,212 [myid:] - INFO [ProcessThread(sid:0 cport:11221)::PrepRequestProcessor@143] - PrepRequestProcessor exited loop!
[junit] 2015-10-21 22:52:17,212 [myid:] - INFO [SyncThread:0:SyncRequestProcessor@187] - SyncRequestProcessor exited!
[junit] 2015-10-21 22:52:17,212 [myid:] - INFO [main:FinalRequestProcessor@415] - shutdown of request processor complete
[junit] 2015-10-21 22:52:17,213 [myid:] - INFO [main:FourLetterWordMain@62] - connecting to 127.0.0.1 11221
[junit] 2015-10-21 22:52:17,213 [myid:] - INFO [main:JMXEnv@146] - ensureOnly:[]
[junit] 2015-10-21 22:52:17,214 [myid:] - INFO [main:ClientBase@443] - STARTING server
[junit] 2015-10-21 22:52:17,214 [myid:] - INFO [main:ClientBase@364] - CREATING server instance 127.0.0.1:11221
[junit] 2015-10-21 22:52:17,215 [myid:] - INFO [main:NIOServerCnxnFactory@89] - binding to port 0.0.0.0/0.0.0.0:11221
[junit] 2015-10-21 22:52:17,215 [myid:] - INFO [main:ClientBase@339] - STARTING server instance 127.0.0.1:11221
[junit] 2015-10-21 22:52:17,215 [myid:] - INFO [main:ZooKeeperServer@168] - Created server with tickTime 3000 minSessionTimeout 6000 maxSessionTimeout 60000 datadir /zonestorage/hudson_solaris/home/hudson/hudson-slave/workspace/ZooKeeper_branch34_solaris/trunk/build/test/tmp/test4021062009961551008.junit.dir/version-2 snapdir /zonestorage/hudson_solaris/home/hudson/hudson-slave/workspace/ZooKeeper_branch34_solaris/trunk/build/test/tmp/test4021062009961551008.junit.dir/version-2
[junit] 2015-10-21 22:52:17,218 [myid:] - INFO [main:FourLetterWordMain@62] - connecting to 127.0.0.1 11221
[junit] 2015-10-21 22:52:17,218 [myid:] - INFO [NIOServerCxn.Factory:0.0.0.0/0.0.0.0:11221:NIOServerCnxnFactory@192] - Accepted socket connection from /127.0.0.1:34069
[junit] 2015-10-21 22:52:17,218 [myid:] - INFO [NIOServerCxn.Factory:0.0.0.0/0.0.0.0:11221:NIOServerCnxn@827] - Processing stat command from /127.0.0.1:34069
[junit] 2015-10-21 22:52:17,218 [myid:] - INFO [Thread-5:NIOServerCnxn$StatCommand@663] - Stat command output
[junit] 2015-10-21 22:52:17,219 [myid:] - INFO [Thread-5:NIOServerCnxn@1007] - Closed socket connection for client /127.0.0.1:34069 (no session established for client)
[junit] 2015-10-21 22:52:17,219 [myid:] - INFO [main:JMXEnv@229] - ensureParent:[InMemoryDataTree, StandaloneServer_port]
[junit] 2015-10-21 22:52:17,220 [myid:] - INFO [main:JMXEnv@246] - expect:InMemoryDataTree
[junit] 2015-10-21 22:52:17,220 [myid:] - INFO [main:JMXEnv@250] - found:InMemoryDataTree org.apache.ZooKeeperService:name0=StandaloneServer_port11221,name1=InMemoryDataTree
[junit] 2015-10-21 22:52:17,220 [myid:] - INFO [main:JMXEnv@246] - expect:StandaloneServer_port
[junit] 2015-10-21 22:52:17,221 [myid:] - INFO [main:JMXEnv@250] - found:StandaloneServer_port org.apache.ZooKeeperService:name0=StandaloneServer_port11221
[junit] 2015-10-21 22:52:17,221 [myid:] - INFO [main:JUnit4ZKTestRunner$LoggedInvokeMethod@58] - Memory used 9033
[junit] 2015-10-21 22:52:17,221 [myid:] - INFO [main:JUnit4ZKTestRunner$LoggedInvokeMethod@63] - Number of threads 20
[junit] 2015-10-21 22:52:17,221 [myid:] - INFO [main:JUnit4ZKTestRunner$LoggedInvokeMethod@78] - FINISHED TEST METHOD testQuota
[junit] 2015-10-21 22:52:17,221 [myid:] - INFO [main:ClientBase@520] - tearDown starting
[junit] 2015-10-21 22:52:17,301 [myid:] - INFO [main:ZooKeeper@684] - Session: 0x1508c9a59180000 closed
[junit] 2015-10-21 22:52:17,301 [myid:] - INFO [main-EventThread:ClientCnxn$EventThread@519] - EventThread shut down for session: 0x1508c9a59180000
[junit] 2015-10-21 22:52:17,302 [myid:] - INFO [main:ClientBase@490] - STOPPING server
[junit] 2015-10-21 22:52:17,302 [myid:] - INFO [main:ZooKeeperServer@467] - shutting down
[junit] 2015-10-21 22:52:17,303 [myid:] - INFO [main:SessionTrackerImpl@225] - Shutting down
[junit] 2015-10-21 22:52:17,303 [myid:] - INFO [main:PrepRequestProcessor@767] - Shutting down
[junit] 2015-10-21 22:52:17,303 [myid:] - INFO [main:SyncRequestProcessor@209] - Shutting down
[junit] 2015-10-21 22:52:17,303 [myid:] - INFO [ProcessThread(sid:0 cport:11221)::PrepRequestProcessor@143] - PrepRequestProcessor exited loop!
[junit] 2015-10-21 22:52:17,303 [myid:] - INFO [SyncThread:0:SyncRequestProcessor@187] - SyncRequestProcessor exited!
[junit] 2015-10-21 22:52:17,303 [myid:] - INFO [main:FinalRequestProcessor@415] - shutdown of request processor complete
[junit] 2015-10-21 22:52:17,304 [myid:] - INFO [main:FourLetterWordMain@62] - connecting to 127.0.0.1 11221
[junit] 2015-10-21 22:52:17,304 [myid:] - INFO [main:JMXEnv@146] - ensureOnly:[]
[junit] 2015-10-21 22:52:17,307 [myid:] - INFO [main:ClientBase@545] - fdcount after test is: 42 at start it was 28
[junit] 2015-10-21 22:52:17,307 [myid:] - INFO [main:ClientBase@547] - sleeping for 20 secs
[junit] 2015-10-21 22:52:17,308 [myid:] - INFO [main:ZKTestCase$1@60] - SUCCEEDED testQuota
[junit] 2015-10-21 22:52:17,308 [myid:] - INFO [main:ZKTestCase$1@55] - FINISHED testQuota
[junit] Tests run: 1, Failures: 0, Errors: 0, Time elapsed: 0.688 sec
BUILD FAILED
/zonestorage/hudson_solaris/home/hudson/hudson-slave/workspace/ZooKeeper_branch34_solaris/trunk/build.xml:1318: Tests failed!
Total time: 26 minutes 0 seconds
Build step 'Invoke Ant' marked build as failure
[locks-and-latches] Releasing all the locks
[locks-and-latches] All the locks released
Recording test results
Email was triggered for: Failure - Any
Sending email for trigger: Failure - Any
###################################################################################
############################## FAILED TESTS (if any) ##############################
1 tests failed.
FAILED: org.apache.zookeeper.test.FollowerTest.testNoLogBeforeLeaderEstablishment
Error Message:
Forked Java VM exited abnormally. Please note the time in the report does not reflect the time until the VM exit.
Stack Trace:
junit.framework.AssertionFailedError: Forked Java VM exited abnormally. Please note the time in the report does not reflect the time until the VM exit.