You are viewing a plain text version of this content. The canonical link for it is here.
Posted to dev@lucene.apache.org by Policeman Jenkins Server <je...@thetaphi.de> on 2016/04/17 03:50:11 UTC

[JENKINS] Lucene-Solr-6.x-MacOSX (64bit/jdk1.8.0) - Build # 82 - Failure!

Build: http://jenkins.thetaphi.de/job/Lucene-Solr-6.x-MacOSX/82/
Java: 64bit/jdk1.8.0 -XX:-UseCompressedOops -XX:+UseConcMarkSweepGC

1 tests failed.
FAILED:  org.apache.solr.cloud.CustomCollectionTest.test

Error Message:
Error from server at http://127.0.0.1:54847: collection already exists: implicitcollwithShardField

Stack Trace:
org.apache.solr.client.solrj.impl.HttpSolrClient$RemoteSolrException: Error from server at http://127.0.0.1:54847: collection already exists: implicitcollwithShardField
	at __randomizedtesting.SeedInfo.seed([54A1CA51B80AF88A:DCF5F58B16F69572]:0)
	at org.apache.solr.client.solrj.impl.HttpSolrClient.executeMethod(HttpSolrClient.java:590)
	at org.apache.solr.client.solrj.impl.HttpSolrClient.request(HttpSolrClient.java:259)
	at org.apache.solr.client.solrj.impl.HttpSolrClient.request(HttpSolrClient.java:248)
	at org.apache.solr.client.solrj.impl.LBHttpSolrClient.doRequest(LBHttpSolrClient.java:404)
	at org.apache.solr.client.solrj.impl.LBHttpSolrClient.request(LBHttpSolrClient.java:357)
	at org.apache.solr.client.solrj.impl.CloudSolrClient.sendRequest(CloudSolrClient.java:1192)
	at org.apache.solr.client.solrj.impl.CloudSolrClient.requestWithRetryOnStaleState(CloudSolrClient.java:962)
	at org.apache.solr.client.solrj.impl.CloudSolrClient.request(CloudSolrClient.java:898)
	at org.apache.solr.client.solrj.SolrClient.request(SolrClient.java:1219)
	at org.apache.solr.cloud.AbstractFullDistribZkTestBase.createCollection(AbstractFullDistribZkTestBase.java:1595)
	at org.apache.solr.cloud.AbstractFullDistribZkTestBase.createCollection(AbstractFullDistribZkTestBase.java:1549)
	at org.apache.solr.cloud.CustomCollectionTest.testCustomCollectionsAPI(CustomCollectionTest.java:285)
	at org.apache.solr.cloud.CustomCollectionTest.test(CustomCollectionTest.java:99)
	at sun.reflect.NativeMethodAccessorImpl.invoke0(Native Method)
	at sun.reflect.NativeMethodAccessorImpl.invoke(NativeMethodAccessorImpl.java:62)
	at sun.reflect.DelegatingMethodAccessorImpl.invoke(DelegatingMethodAccessorImpl.java:43)
	at java.lang.reflect.Method.invoke(Method.java:498)
	at com.carrotsearch.randomizedtesting.RandomizedRunner.invoke(RandomizedRunner.java:1764)
	at com.carrotsearch.randomizedtesting.RandomizedRunner$8.evaluate(RandomizedRunner.java:871)
	at com.carrotsearch.randomizedtesting.RandomizedRunner$9.evaluate(RandomizedRunner.java:907)
	at com.carrotsearch.randomizedtesting.RandomizedRunner$10.evaluate(RandomizedRunner.java:921)
	at org.apache.solr.BaseDistributedSearchTestCase$ShardsRepeatRule$ShardsFixedStatement.callStatement(BaseDistributedSearchTestCase.java:992)
	at org.apache.solr.BaseDistributedSearchTestCase$ShardsRepeatRule$ShardsStatement.evaluate(BaseDistributedSearchTestCase.java:967)
	at com.carrotsearch.randomizedtesting.rules.SystemPropertiesRestoreRule$1.evaluate(SystemPropertiesRestoreRule.java:57)
	at org.apache.lucene.util.TestRuleSetupTeardownChained$1.evaluate(TestRuleSetupTeardownChained.java:49)
	at org.apache.lucene.util.AbstractBeforeAfterRule$1.evaluate(AbstractBeforeAfterRule.java:45)
	at org.apache.lucene.util.TestRuleThreadAndTestName$1.evaluate(TestRuleThreadAndTestName.java:48)
	at org.apache.lucene.util.TestRuleIgnoreAfterMaxFailures$1.evaluate(TestRuleIgnoreAfterMaxFailures.java:64)
	at org.apache.lucene.util.TestRuleMarkFailure$1.evaluate(TestRuleMarkFailure.java:47)
	at com.carrotsearch.randomizedtesting.rules.StatementAdapter.evaluate(StatementAdapter.java:36)
	at com.carrotsearch.randomizedtesting.ThreadLeakControl$StatementRunner.run(ThreadLeakControl.java:367)
	at com.carrotsearch.randomizedtesting.ThreadLeakControl.forkTimeoutingTask(ThreadLeakControl.java:809)
	at com.carrotsearch.randomizedtesting.ThreadLeakControl$3.evaluate(ThreadLeakControl.java:460)
	at com.carrotsearch.randomizedtesting.RandomizedRunner.runSingleTest(RandomizedRunner.java:880)
	at com.carrotsearch.randomizedtesting.RandomizedRunner$5.evaluate(RandomizedRunner.java:781)
	at com.carrotsearch.randomizedtesting.RandomizedRunner$6.evaluate(RandomizedRunner.java:816)
	at com.carrotsearch.randomizedtesting.RandomizedRunner$7.evaluate(RandomizedRunner.java:827)
	at com.carrotsearch.randomizedtesting.rules.StatementAdapter.evaluate(StatementAdapter.java:36)
	at com.carrotsearch.randomizedtesting.rules.SystemPropertiesRestoreRule$1.evaluate(SystemPropertiesRestoreRule.java:57)
	at org.apache.lucene.util.AbstractBeforeAfterRule$1.evaluate(AbstractBeforeAfterRule.java:45)
	at com.carrotsearch.randomizedtesting.rules.StatementAdapter.evaluate(StatementAdapter.java:36)
	at org.apache.lucene.util.TestRuleStoreClassName$1.evaluate(TestRuleStoreClassName.java:41)
	at com.carrotsearch.randomizedtesting.rules.NoShadowingOrOverridesOnMethodsRule$1.evaluate(NoShadowingOrOverridesOnMethodsRule.java:40)
	at com.carrotsearch.randomizedtesting.rules.NoShadowingOrOverridesOnMethodsRule$1.evaluate(NoShadowingOrOverridesOnMethodsRule.java:40)
	at com.carrotsearch.randomizedtesting.rules.StatementAdapter.evaluate(StatementAdapter.java:36)
	at com.carrotsearch.randomizedtesting.rules.StatementAdapter.evaluate(StatementAdapter.java:36)
	at com.carrotsearch.randomizedtesting.rules.StatementAdapter.evaluate(StatementAdapter.java:36)
	at org.apache.lucene.util.TestRuleAssertionsRequired$1.evaluate(TestRuleAssertionsRequired.java:53)
	at org.apache.lucene.util.TestRuleMarkFailure$1.evaluate(TestRuleMarkFailure.java:47)
	at org.apache.lucene.util.TestRuleIgnoreAfterMaxFailures$1.evaluate(TestRuleIgnoreAfterMaxFailures.java:64)
	at org.apache.lucene.util.TestRuleIgnoreTestSuites$1.evaluate(TestRuleIgnoreTestSuites.java:54)
	at com.carrotsearch.randomizedtesting.rules.StatementAdapter.evaluate(StatementAdapter.java:36)
	at com.carrotsearch.randomizedtesting.ThreadLeakControl$StatementRunner.run(ThreadLeakControl.java:367)
	at java.lang.Thread.run(Thread.java:745)




Build Log:
[...truncated 10976 lines...]
   [junit4] Suite: org.apache.solr.cloud.CustomCollectionTest
   [junit4]   2> Creating dataDir: /Users/jenkins/workspace/Lucene-Solr-6.x-MacOSX/solr/build/solr-core/test/J1/temp/solr.cloud.CustomCollectionTest_54A1CA51B80AF88A-001/init-core-data-001
   [junit4]   2> 603935 INFO  (SUITE-CustomCollectionTest-seed#[54A1CA51B80AF88A]-worker) [    ] o.a.s.BaseDistributedSearchTestCase Setting hostContext system property: /
   [junit4]   2> 603937 INFO  (TEST-CustomCollectionTest.test-seed#[54A1CA51B80AF88A]) [    ] o.a.s.c.ZkTestServer STARTING ZK TEST SERVER
   [junit4]   2> 603937 INFO  (Thread-1271) [    ] o.a.s.c.ZkTestServer client port:0.0.0.0/0.0.0.0:0
   [junit4]   2> 603937 INFO  (Thread-1271) [    ] o.a.s.c.ZkTestServer Starting server
   [junit4]   2> 604043 INFO  (TEST-CustomCollectionTest.test-seed#[54A1CA51B80AF88A]) [    ] o.a.s.c.ZkTestServer start zk server on port:54814
   [junit4]   2> 604043 INFO  (TEST-CustomCollectionTest.test-seed#[54A1CA51B80AF88A]) [    ] o.a.s.c.c.SolrZkClient Using default ZkCredentialsProvider
   [junit4]   2> 604043 INFO  (TEST-CustomCollectionTest.test-seed#[54A1CA51B80AF88A]) [    ] o.a.s.c.c.ConnectionManager Waiting for client to connect to ZooKeeper
   [junit4]   2> 604106 INFO  (zkCallback-733-thread-1) [    ] o.a.s.c.c.ConnectionManager Watcher org.apache.solr.common.cloud.ConnectionManager@3d9419f6 name:ZooKeeperConnection Watcher:127.0.0.1:54814 got event WatchedEvent state:SyncConnected type:None path:null path:null type:None
   [junit4]   2> 604106 INFO  (TEST-CustomCollectionTest.test-seed#[54A1CA51B80AF88A]) [    ] o.a.s.c.c.ConnectionManager Client is connected to ZooKeeper
   [junit4]   2> 604106 INFO  (TEST-CustomCollectionTest.test-seed#[54A1CA51B80AF88A]) [    ] o.a.s.c.c.SolrZkClient Using default ZkACLProvider
   [junit4]   2> 604106 INFO  (TEST-CustomCollectionTest.test-seed#[54A1CA51B80AF88A]) [    ] o.a.s.c.c.SolrZkClient makePath: /solr
   [junit4]   2> 604110 INFO  (TEST-CustomCollectionTest.test-seed#[54A1CA51B80AF88A]) [    ] o.a.s.c.c.SolrZkClient Using default ZkCredentialsProvider
   [junit4]   2> 604111 INFO  (TEST-CustomCollectionTest.test-seed#[54A1CA51B80AF88A]) [    ] o.a.s.c.c.ConnectionManager Waiting for client to connect to ZooKeeper
   [junit4]   2> 604112 INFO  (zkCallback-734-thread-1) [    ] o.a.s.c.c.ConnectionManager Watcher org.apache.solr.common.cloud.ConnectionManager@155a0b7a name:ZooKeeperConnection Watcher:127.0.0.1:54814/solr got event WatchedEvent state:SyncConnected type:None path:null path:null type:None
   [junit4]   2> 604112 INFO  (TEST-CustomCollectionTest.test-seed#[54A1CA51B80AF88A]) [    ] o.a.s.c.c.ConnectionManager Client is connected to ZooKeeper
   [junit4]   2> 604113 INFO  (TEST-CustomCollectionTest.test-seed#[54A1CA51B80AF88A]) [    ] o.a.s.c.c.SolrZkClient Using default ZkACLProvider
   [junit4]   2> 604114 INFO  (TEST-CustomCollectionTest.test-seed#[54A1CA51B80AF88A]) [    ] o.a.s.c.c.SolrZkClient makePath: /collections/collection1
   [junit4]   2> 604116 INFO  (TEST-CustomCollectionTest.test-seed#[54A1CA51B80AF88A]) [    ] o.a.s.c.c.SolrZkClient makePath: /collections/collection1/shards
   [junit4]   2> 604119 INFO  (TEST-CustomCollectionTest.test-seed#[54A1CA51B80AF88A]) [    ] o.a.s.c.c.SolrZkClient makePath: /collections/control_collection
   [junit4]   2> 604121 INFO  (TEST-CustomCollectionTest.test-seed#[54A1CA51B80AF88A]) [    ] o.a.s.c.c.SolrZkClient makePath: /collections/control_collection/shards
   [junit4]   2> 604124 INFO  (TEST-CustomCollectionTest.test-seed#[54A1CA51B80AF88A]) [    ] o.a.s.c.AbstractZkTestCase put /Users/jenkins/workspace/Lucene-Solr-6.x-MacOSX/solr/core/src/test-files/solr/collection1/conf/solrconfig-tlog.xml to /configs/conf1/solrconfig.xml
   [junit4]   2> 604125 INFO  (TEST-CustomCollectionTest.test-seed#[54A1CA51B80AF88A]) [    ] o.a.s.c.c.SolrZkClient makePath: /configs/conf1/solrconfig.xml
   [junit4]   2> 604129 INFO  (TEST-CustomCollectionTest.test-seed#[54A1CA51B80AF88A]) [    ] o.a.s.c.AbstractZkTestCase put /Users/jenkins/workspace/Lucene-Solr-6.x-MacOSX/solr/core/src/test-files/solr/collection1/conf/schema.xml to /configs/conf1/schema.xml
   [junit4]   2> 604130 INFO  (TEST-CustomCollectionTest.test-seed#[54A1CA51B80AF88A]) [    ] o.a.s.c.c.SolrZkClient makePath: /configs/conf1/schema.xml
   [junit4]   2> 604132 INFO  (TEST-CustomCollectionTest.test-seed#[54A1CA51B80AF88A]) [    ] o.a.s.c.AbstractZkTestCase put /Users/jenkins/workspace/Lucene-Solr-6.x-MacOSX/solr/core/src/test-files/solr/collection1/conf/solrconfig.snippet.randomindexconfig.xml to /configs/conf1/solrconfig.snippet.randomindexconfig.xml
   [junit4]   2> 604133 INFO  (TEST-CustomCollectionTest.test-seed#[54A1CA51B80AF88A]) [    ] o.a.s.c.c.SolrZkClient makePath: /configs/conf1/solrconfig.snippet.randomindexconfig.xml
   [junit4]   2> 604135 INFO  (TEST-CustomCollectionTest.test-seed#[54A1CA51B80AF88A]) [    ] o.a.s.c.AbstractZkTestCase put /Users/jenkins/workspace/Lucene-Solr-6.x-MacOSX/solr/core/src/test-files/solr/collection1/conf/stopwords.txt to /configs/conf1/stopwords.txt
   [junit4]   2> 604135 INFO  (TEST-CustomCollectionTest.test-seed#[54A1CA51B80AF88A]) [    ] o.a.s.c.c.SolrZkClient makePath: /configs/conf1/stopwords.txt
   [junit4]   2> 604138 INFO  (TEST-CustomCollectionTest.test-seed#[54A1CA51B80AF88A]) [    ] o.a.s.c.AbstractZkTestCase put /Users/jenkins/workspace/Lucene-Solr-6.x-MacOSX/solr/core/src/test-files/solr/collection1/conf/protwords.txt to /configs/conf1/protwords.txt
   [junit4]   2> 604139 INFO  (TEST-CustomCollectionTest.test-seed#[54A1CA51B80AF88A]) [    ] o.a.s.c.c.SolrZkClient makePath: /configs/conf1/protwords.txt
   [junit4]   2> 604141 INFO  (TEST-CustomCollectionTest.test-seed#[54A1CA51B80AF88A]) [    ] o.a.s.c.AbstractZkTestCase put /Users/jenkins/workspace/Lucene-Solr-6.x-MacOSX/solr/core/src/test-files/solr/collection1/conf/currency.xml to /configs/conf1/currency.xml
   [junit4]   2> 604142 INFO  (TEST-CustomCollectionTest.test-seed#[54A1CA51B80AF88A]) [    ] o.a.s.c.c.SolrZkClient makePath: /configs/conf1/currency.xml
   [junit4]   2> 604145 INFO  (TEST-CustomCollectionTest.test-seed#[54A1CA51B80AF88A]) [    ] o.a.s.c.AbstractZkTestCase put /Users/jenkins/workspace/Lucene-Solr-6.x-MacOSX/solr/core/src/test-files/solr/collection1/conf/enumsConfig.xml to /configs/conf1/enumsConfig.xml
   [junit4]   2> 604146 INFO  (TEST-CustomCollectionTest.test-seed#[54A1CA51B80AF88A]) [    ] o.a.s.c.c.SolrZkClient makePath: /configs/conf1/enumsConfig.xml
   [junit4]   2> 604149 INFO  (TEST-CustomCollectionTest.test-seed#[54A1CA51B80AF88A]) [    ] o.a.s.c.AbstractZkTestCase put /Users/jenkins/workspace/Lucene-Solr-6.x-MacOSX/solr/core/src/test-files/solr/collection1/conf/open-exchange-rates.json to /configs/conf1/open-exchange-rates.json
   [junit4]   2> 604149 INFO  (TEST-CustomCollectionTest.test-seed#[54A1CA51B80AF88A]) [    ] o.a.s.c.c.SolrZkClient makePath: /configs/conf1/open-exchange-rates.json
   [junit4]   2> 604153 INFO  (TEST-CustomCollectionTest.test-seed#[54A1CA51B80AF88A]) [    ] o.a.s.c.AbstractZkTestCase put /Users/jenkins/workspace/Lucene-Solr-6.x-MacOSX/solr/core/src/test-files/solr/collection1/conf/mapping-ISOLatin1Accent.txt to /configs/conf1/mapping-ISOLatin1Accent.txt
   [junit4]   2> 604153 INFO  (TEST-CustomCollectionTest.test-seed#[54A1CA51B80AF88A]) [    ] o.a.s.c.c.SolrZkClient makePath: /configs/conf1/mapping-ISOLatin1Accent.txt
   [junit4]   2> 604156 INFO  (TEST-CustomCollectionTest.test-seed#[54A1CA51B80AF88A]) [    ] o.a.s.c.AbstractZkTestCase put /Users/jenkins/workspace/Lucene-Solr-6.x-MacOSX/solr/core/src/test-files/solr/collection1/conf/old_synonyms.txt to /configs/conf1/old_synonyms.txt
   [junit4]   2> 604156 INFO  (TEST-CustomCollectionTest.test-seed#[54A1CA51B80AF88A]) [    ] o.a.s.c.c.SolrZkClient makePath: /configs/conf1/old_synonyms.txt
   [junit4]   2> 604159 INFO  (TEST-CustomCollectionTest.test-seed#[54A1CA51B80AF88A]) [    ] o.a.s.c.AbstractZkTestCase put /Users/jenkins/workspace/Lucene-Solr-6.x-MacOSX/solr/core/src/test-files/solr/collection1/conf/synonyms.txt to /configs/conf1/synonyms.txt
   [junit4]   2> 604160 INFO  (TEST-CustomCollectionTest.test-seed#[54A1CA51B80AF88A]) [    ] o.a.s.c.c.SolrZkClient makePath: /configs/conf1/synonyms.txt
   [junit4]   2> 604432 INFO  (TEST-CustomCollectionTest.test-seed#[54A1CA51B80AF88A]) [    ] o.a.s.SolrTestCaseJ4 Writing core.properties file to /Users/jenkins/workspace/Lucene-Solr-6.x-MacOSX/solr/build/solr-core/test/J1/temp/solr.cloud.CustomCollectionTest_54A1CA51B80AF88A-001/control-001/cores/collection1
   [junit4]   2> 604435 INFO  (TEST-CustomCollectionTest.test-seed#[54A1CA51B80AF88A]) [    ] o.e.j.s.Server jetty-9.3.8.v20160314
   [junit4]   2> 604438 INFO  (TEST-CustomCollectionTest.test-seed#[54A1CA51B80AF88A]) [    ] o.e.j.s.h.ContextHandler Started o.e.j.s.ServletContextHandler@110f18fe{/,null,AVAILABLE}
   [junit4]   2> 604442 INFO  (TEST-CustomCollectionTest.test-seed#[54A1CA51B80AF88A]) [    ] o.e.j.s.ServerConnector Started ServerConnector@654cb5e9{HTTP/1.1,[http/1.1]}{127.0.0.1:54817}
   [junit4]   2> 604446 INFO  (TEST-CustomCollectionTest.test-seed#[54A1CA51B80AF88A]) [    ] o.e.j.s.Server Started @609889ms
   [junit4]   2> 604446 INFO  (TEST-CustomCollectionTest.test-seed#[54A1CA51B80AF88A]) [    ] o.a.s.c.s.e.JettySolrRunner Jetty properties: {solr.data.dir=/Users/jenkins/workspace/Lucene-Solr-6.x-MacOSX/solr/build/solr-core/test/J1/temp/solr.cloud.CustomCollectionTest_54A1CA51B80AF88A-001/tempDir-001/control/data, hostContext=/, hostPort=54817, coreRootDirectory=/Users/jenkins/workspace/Lucene-Solr-6.x-MacOSX/solr/build/solr-core/test/J1/temp/solr.cloud.CustomCollectionTest_54A1CA51B80AF88A-001/control-001/cores}
   [junit4]   2> 604447 INFO  (TEST-CustomCollectionTest.test-seed#[54A1CA51B80AF88A]) [    ] o.a.s.s.SolrDispatchFilter SolrDispatchFilter.init(): sun.misc.Launcher$AppClassLoader@4554617c
   [junit4]   2> 604447 INFO  (TEST-CustomCollectionTest.test-seed#[54A1CA51B80AF88A]) [    ] o.a.s.c.SolrResourceLoader new SolrResourceLoader for directory: '/Users/jenkins/workspace/Lucene-Solr-6.x-MacOSX/solr/build/solr-core/test/J1/temp/solr.cloud.CustomCollectionTest_54A1CA51B80AF88A-001/control-001'
   [junit4]   2> 604447 INFO  (TEST-CustomCollectionTest.test-seed#[54A1CA51B80AF88A]) [    ] o.a.s.c.SolrResourceLoader JNDI not configured for solr (NoInitialContextEx)
   [junit4]   2> 604447 INFO  (TEST-CustomCollectionTest.test-seed#[54A1CA51B80AF88A]) [    ] o.a.s.c.SolrResourceLoader solr home defaulted to 'solr/' (could not find system property or JNDI)
   [junit4]   2> 604447 INFO  (TEST-CustomCollectionTest.test-seed#[54A1CA51B80AF88A]) [    ] o.a.s.c.c.SolrZkClient Using default ZkCredentialsProvider
   [junit4]   2> 604449 INFO  (TEST-CustomCollectionTest.test-seed#[54A1CA51B80AF88A]) [    ] o.a.s.c.c.ConnectionManager Waiting for client to connect to ZooKeeper
   [junit4]   2> 604450 INFO  (zkCallback-735-thread-1) [    ] o.a.s.c.c.ConnectionManager Watcher org.apache.solr.common.cloud.ConnectionManager@1e4f8ebe name:ZooKeeperConnection Watcher:127.0.0.1:54814/solr got event WatchedEvent state:SyncConnected type:None path:null path:null type:None
   [junit4]   2> 604450 INFO  (TEST-CustomCollectionTest.test-seed#[54A1CA51B80AF88A]) [    ] o.a.s.c.c.ConnectionManager Client is connected to ZooKeeper
   [junit4]   2> 604450 INFO  (TEST-CustomCollectionTest.test-seed#[54A1CA51B80AF88A]) [    ] o.a.s.c.c.SolrZkClient Using default ZkACLProvider
   [junit4]   2> 604452 INFO  (TEST-CustomCollectionTest.test-seed#[54A1CA51B80AF88A]) [    ] o.a.s.s.SolrDispatchFilter Loading solr.xml from SolrHome (not found in ZooKeeper)
   [junit4]   2> 604452 INFO  (TEST-CustomCollectionTest.test-seed#[54A1CA51B80AF88A]) [    ] o.a.s.c.SolrXmlConfig Loading container configuration from /Users/jenkins/workspace/Lucene-Solr-6.x-MacOSX/solr/build/solr-core/test/J1/temp/solr.cloud.CustomCollectionTest_54A1CA51B80AF88A-001/control-001/solr.xml
   [junit4]   2> 604464 INFO  (TEST-CustomCollectionTest.test-seed#[54A1CA51B80AF88A]) [    ] o.a.s.c.CorePropertiesLocator Config-defined core root directory: /Users/jenkins/workspace/Lucene-Solr-6.x-MacOSX/solr/build/solr-core/test/J1/temp/solr.cloud.CustomCollectionTest_54A1CA51B80AF88A-001/control-001/cores
   [junit4]   2> 604464 INFO  (TEST-CustomCollectionTest.test-seed#[54A1CA51B80AF88A]) [    ] o.a.s.c.CoreContainer New CoreContainer 541211268
   [junit4]   2> 604464 INFO  (TEST-CustomCollectionTest.test-seed#[54A1CA51B80AF88A]) [    ] o.a.s.c.CoreContainer Loading cores into CoreContainer [instanceDir=/Users/jenkins/workspace/Lucene-Solr-6.x-MacOSX/solr/build/solr-core/test/J1/temp/solr.cloud.CustomCollectionTest_54A1CA51B80AF88A-001/control-001]
   [junit4]   2> 604464 WARN  (TEST-CustomCollectionTest.test-seed#[54A1CA51B80AF88A]) [    ] o.a.s.c.CoreContainer Couldn't add files from /Users/jenkins/workspace/Lucene-Solr-6.x-MacOSX/solr/build/solr-core/test/J1/temp/solr.cloud.CustomCollectionTest_54A1CA51B80AF88A-001/control-001/lib to classpath: /Users/jenkins/workspace/Lucene-Solr-6.x-MacOSX/solr/build/solr-core/test/J1/temp/solr.cloud.CustomCollectionTest_54A1CA51B80AF88A-001/control-001/lib
   [junit4]   2> 604464 INFO  (TEST-CustomCollectionTest.test-seed#[54A1CA51B80AF88A]) [    ] o.a.s.h.c.HttpShardHandlerFactory created with socketTimeout : 90000,urlScheme : ,connTimeout : 15000,maxConnectionsPerHost : 20,maxConnections : 10000,corePoolSize : 0,maximumPoolSize : 2147483647,maxThreadIdleTime : 5,sizeOfQueue : -1,fairnessPolicy : false,useRetries : false,
   [junit4]   2> 604467 INFO  (TEST-CustomCollectionTest.test-seed#[54A1CA51B80AF88A]) [    ] o.a.s.u.UpdateShardHandler Creating UpdateShardHandler HTTP client with params: socketTimeout=340000&connTimeout=45000&retry=true
   [junit4]   2> 604468 INFO  (TEST-CustomCollectionTest.test-seed#[54A1CA51B80AF88A]) [    ] o.a.s.l.LogWatcher SLF4J impl is org.slf4j.impl.Log4jLoggerFactory
   [junit4]   2> 604468 INFO  (TEST-CustomCollectionTest.test-seed#[54A1CA51B80AF88A]) [    ] o.a.s.l.LogWatcher Registering Log Listener [Log4j (org.slf4j.impl.Log4jLoggerFactory)]
   [junit4]   2> 604468 INFO  (TEST-CustomCollectionTest.test-seed#[54A1CA51B80AF88A]) [    ] o.a.s.c.ZkContainer Zookeeper client=127.0.0.1:54814/solr
   [junit4]   2> 604468 INFO  (TEST-CustomCollectionTest.test-seed#[54A1CA51B80AF88A]) [    ] o.a.s.c.ZkController zkHost includes chroot
   [junit4]   2> 604468 INFO  (TEST-CustomCollectionTest.test-seed#[54A1CA51B80AF88A]) [    ] o.a.s.c.c.SolrZkClient Using default ZkCredentialsProvider
   [junit4]   2> 604468 INFO  (TEST-CustomCollectionTest.test-seed#[54A1CA51B80AF88A]) [    ] o.a.s.c.c.ConnectionManager Waiting for client to connect to ZooKeeper
   [junit4]   2> 604471 INFO  (zkCallback-738-thread-1) [    ] o.a.s.c.c.ConnectionManager Watcher org.apache.solr.common.cloud.ConnectionManager@3c44cb88 name:ZooKeeperConnection Watcher:127.0.0.1:54814 got event WatchedEvent state:SyncConnected type:None path:null path:null type:None
   [junit4]   2> 604472 INFO  (TEST-CustomCollectionTest.test-seed#[54A1CA51B80AF88A]) [    ] o.a.s.c.c.ConnectionManager Client is connected to ZooKeeper
   [junit4]   2> 604472 INFO  (TEST-CustomCollectionTest.test-seed#[54A1CA51B80AF88A]) [    ] o.a.s.c.c.SolrZkClient Using default ZkACLProvider
   [junit4]   2> 604474 INFO  (TEST-CustomCollectionTest.test-seed#[54A1CA51B80AF88A]) [n:127.0.0.1:54817_    ] o.a.s.c.ZkController Added new OnReconnect listener org.apache.solr.cloud.ZkController$$Lambda$11/2082288878@4f702c04
   [junit4]   2> 604475 INFO  (TEST-CustomCollectionTest.test-seed#[54A1CA51B80AF88A]) [n:127.0.0.1:54817_    ] o.a.s.c.c.ConnectionManager Waiting for client to connect to ZooKeeper
   [junit4]   2> 604477 INFO  (zkCallback-739-thread-1-processing-n:127.0.0.1:54817_) [n:127.0.0.1:54817_    ] o.a.s.c.c.ConnectionManager Watcher org.apache.solr.common.cloud.ConnectionManager@19f571d5 name:ZooKeeperConnection Watcher:127.0.0.1:54814/solr got event WatchedEvent state:SyncConnected type:None path:null path:null type:None
   [junit4]   2> 604477 INFO  (TEST-CustomCollectionTest.test-seed#[54A1CA51B80AF88A]) [n:127.0.0.1:54817_    ] o.a.s.c.c.ConnectionManager Client is connected to ZooKeeper
   [junit4]   2> 604478 INFO  (TEST-CustomCollectionTest.test-seed#[54A1CA51B80AF88A]) [n:127.0.0.1:54817_    ] o.a.s.c.c.SolrZkClient makePath: /overseer/queue
   [junit4]   2> 604484 INFO  (TEST-CustomCollectionTest.test-seed#[54A1CA51B80AF88A]) [n:127.0.0.1:54817_    ] o.a.s.c.c.SolrZkClient makePath: /overseer/collection-queue-work
   [junit4]   2> 604489 INFO  (TEST-CustomCollectionTest.test-seed#[54A1CA51B80AF88A]) [n:127.0.0.1:54817_    ] o.a.s.c.c.SolrZkClient makePath: /overseer/collection-map-running
   [junit4]   2> 604492 INFO  (TEST-CustomCollectionTest.test-seed#[54A1CA51B80AF88A]) [n:127.0.0.1:54817_    ] o.a.s.c.c.SolrZkClient makePath: /overseer/collection-map-completed
   [junit4]   2> 604495 INFO  (TEST-CustomCollectionTest.test-seed#[54A1CA51B80AF88A]) [n:127.0.0.1:54817_    ] o.a.s.c.c.SolrZkClient makePath: /overseer/collection-map-failure
   [junit4]   2> 604499 INFO  (TEST-CustomCollectionTest.test-seed#[54A1CA51B80AF88A]) [n:127.0.0.1:54817_    ] o.a.s.c.c.SolrZkClient makePath: /live_nodes
   [junit4]   2> 604502 INFO  (TEST-CustomCollectionTest.test-seed#[54A1CA51B80AF88A]) [n:127.0.0.1:54817_    ] o.a.s.c.c.SolrZkClient makePath: /aliases.json
   [junit4]   2> 604504 INFO  (TEST-CustomCollectionTest.test-seed#[54A1CA51B80AF88A]) [n:127.0.0.1:54817_    ] o.a.s.c.c.SolrZkClient makePath: /clusterstate.json
   [junit4]   2> 604506 INFO  (TEST-CustomCollectionTest.test-seed#[54A1CA51B80AF88A]) [n:127.0.0.1:54817_    ] o.a.s.c.c.SolrZkClient makePath: /security.json
   [junit4]   2> 604507 INFO  (TEST-CustomCollectionTest.test-seed#[54A1CA51B80AF88A]) [n:127.0.0.1:54817_    ] o.a.s.c.c.ZkStateReader Updating cluster state from ZooKeeper... 
   [junit4]   2> 604511 INFO  (TEST-CustomCollectionTest.test-seed#[54A1CA51B80AF88A]) [n:127.0.0.1:54817_    ] o.a.s.c.c.ZkStateReader Updated live nodes from ZooKeeper... (0) -> (0)
   [junit4]   2> 604514 INFO  (TEST-CustomCollectionTest.test-seed#[54A1CA51B80AF88A]) [n:127.0.0.1:54817_    ] o.a.s.c.c.SolrZkClient makePath: /overseer_elect
   [junit4]   2> 604516 INFO  (TEST-CustomCollectionTest.test-seed#[54A1CA51B80AF88A]) [n:127.0.0.1:54817_    ] o.a.s.c.c.SolrZkClient makePath: /overseer_elect/election
   [junit4]   2> 604518 INFO  (TEST-CustomCollectionTest.test-seed#[54A1CA51B80AF88A]) [n:127.0.0.1:54817_    ] o.a.s.c.Overseer Overseer (id=null) closing
   [junit4]   2> 604519 INFO  (TEST-CustomCollectionTest.test-seed#[54A1CA51B80AF88A]) [n:127.0.0.1:54817_    ] o.a.s.c.LeaderElector Joined leadership election with path: /overseer_elect/election/95738574182547460-127.0.0.1:54817_-n_0000000000
   [junit4]   2> 604520 INFO  (TEST-CustomCollectionTest.test-seed#[54A1CA51B80AF88A]) [n:127.0.0.1:54817_    ] o.a.s.c.OverseerElectionContext I am going to be the leader 127.0.0.1:54817_
   [junit4]   2> 604520 INFO  (TEST-CustomCollectionTest.test-seed#[54A1CA51B80AF88A]) [n:127.0.0.1:54817_    ] o.a.s.c.c.SolrZkClient makePath: /overseer_elect/leader
   [junit4]   2> 604523 INFO  (TEST-CustomCollectionTest.test-seed#[54A1CA51B80AF88A]) [n:127.0.0.1:54817_    ] o.a.s.c.Overseer Overseer (id=95738574182547460-127.0.0.1:54817_-n_0000000000) starting
   [junit4]   2> 604526 INFO  (TEST-CustomCollectionTest.test-seed#[54A1CA51B80AF88A]) [n:127.0.0.1:54817_    ] o.a.s.c.c.SolrZkClient makePath: /overseer/queue-work
   [junit4]   2> 604536 INFO  (TEST-CustomCollectionTest.test-seed#[54A1CA51B80AF88A]) [n:127.0.0.1:54817_    ] o.a.s.c.OverseerAutoReplicaFailoverThread Starting OverseerAutoReplicaFailoverThread autoReplicaFailoverWorkLoopDelay=10000 autoReplicaFailoverWaitAfterExpiration=10000 autoReplicaFailoverBadNodeExpiration=60000
   [junit4]   2> 604537 INFO  (OverseerCollectionConfigSetProcessor-95738574182547460-127.0.0.1:54817_-n_0000000000) [n:127.0.0.1:54817_    ] o.a.s.c.OverseerTaskProcessor Process current queue of overseer operations
   [junit4]   2> 604538 INFO  (OverseerStateUpdate-95738574182547460-127.0.0.1:54817_-n_0000000000) [n:127.0.0.1:54817_    ] o.a.s.c.Overseer Starting to work on the main queue
   [junit4]   2> 604538 INFO  (TEST-CustomCollectionTest.test-seed#[54A1CA51B80AF88A]) [n:127.0.0.1:54817_    ] o.a.s.c.ZkController Register node as live in ZooKeeper:/live_nodes/127.0.0.1:54817_
   [junit4]   2> 604540 INFO  (TEST-CustomCollectionTest.test-seed#[54A1CA51B80AF88A]) [n:127.0.0.1:54817_    ] o.a.s.c.c.SolrZkClient makePath: /live_nodes/127.0.0.1:54817_
   [junit4]   2> 604541 INFO  (OverseerStateUpdate-95738574182547460-127.0.0.1:54817_-n_0000000000) [n:127.0.0.1:54817_    ] o.a.s.c.c.ZkStateReader Updated live nodes from ZooKeeper... (0) -> (0)
   [junit4]   2> 604542 INFO  (zkCallback-739-thread-1-processing-n:127.0.0.1:54817_) [n:127.0.0.1:54817_    ] o.a.s.c.c.ZkStateReader A live node change: [WatchedEvent state:SyncConnected type:NodeChildrenChanged path:/live_nodes], has occurred - updating... (live nodes size: [0])
   [junit4]   2> 604543 INFO  (zkCallback-739-thread-1-processing-n:127.0.0.1:54817_) [n:127.0.0.1:54817_    ] o.a.s.c.c.ZkStateReader Updated live nodes from ZooKeeper... (0) -> (1)
   [junit4]   2> 604556 INFO  (TEST-CustomCollectionTest.test-seed#[54A1CA51B80AF88A]) [n:127.0.0.1:54817_    ] o.a.s.c.CoreContainer Security conf doesn't exist. Skipping setup for authorization module.
   [junit4]   2> 604556 INFO  (TEST-CustomCollectionTest.test-seed#[54A1CA51B80AF88A]) [n:127.0.0.1:54817_    ] o.a.s.c.CoreContainer No authentication plugin used.
   [junit4]   2> 604558 INFO  (TEST-CustomCollectionTest.test-seed#[54A1CA51B80AF88A]) [n:127.0.0.1:54817_    ] o.a.s.c.CorePropertiesLocator Looking for core definitions underneath /Users/jenkins/workspace/Lucene-Solr-6.x-MacOSX/solr/build/solr-core/test/J1/temp/solr.cloud.CustomCollectionTest_54A1CA51B80AF88A-001/control-001/cores
   [junit4]   2> 604560 INFO  (TEST-CustomCollectionTest.test-seed#[54A1CA51B80AF88A]) [n:127.0.0.1:54817_    ] o.a.s.c.CoreDescriptor Created CoreDescriptor: {name=collection1, config=solrconfig.xml, transient=false, schema=schema.xml, loadOnStartup=true, configSetProperties=configsetprops.json, collection=control_collection, coreNodeName=, dataDir=data/, shard=}
   [junit4]   2> 604560 INFO  (TEST-CustomCollectionTest.test-seed#[54A1CA51B80AF88A]) [n:127.0.0.1:54817_    ] o.a.s.c.CorePropertiesLocator Found core collection1 in /Users/jenkins/workspace/Lucene-Solr-6.x-MacOSX/solr/build/solr-core/test/J1/temp/solr.cloud.CustomCollectionTest_54A1CA51B80AF88A-001/control-001/cores/collection1
   [junit4]   2> 604560 INFO  (TEST-CustomCollectionTest.test-seed#[54A1CA51B80AF88A]) [n:127.0.0.1:54817_    ] o.a.s.c.CorePropertiesLocator Found 1 core definitions
   [junit4]   2> 604562 INFO  (TEST-CustomCollectionTest.test-seed#[54A1CA51B80AF88A]) [n:127.0.0.1:54817_    ] o.a.s.s.SolrDispatchFilter user.dir=/Users/jenkins/workspace/Lucene-Solr-6.x-MacOSX/solr/build/solr-core/test/J1
   [junit4]   2> 604562 INFO  (TEST-CustomCollectionTest.test-seed#[54A1CA51B80AF88A]) [n:127.0.0.1:54817_    ] o.a.s.s.SolrDispatchFilter SolrDispatchFilter.init() done
   [junit4]   2> 604562 INFO  (coreLoadExecutor-2061-thread-1-processing-n:127.0.0.1:54817_) [n:127.0.0.1:54817_ c:control_collection   x:collection1] o.a.s.c.ZkController publishing state=down
   [junit4]   2> 604562 INFO  (coreLoadExecutor-2061-thread-1-processing-n:127.0.0.1:54817_) [n:127.0.0.1:54817_ c:control_collection   x:collection1] o.a.s.c.ZkController numShards not found on descriptor - reading it from system property
   [junit4]   2> 604565 INFO  (OverseerStateUpdate-95738574182547460-127.0.0.1:54817_-n_0000000000) [n:127.0.0.1:54817_    ] o.a.s.c.Overseer processMessage: queueSize: 1, message = {
   [junit4]   2>   "core":"collection1",
   [junit4]   2>   "roles":null,
   [junit4]   2>   "base_url":"http://127.0.0.1:54817",
   [junit4]   2>   "node_name":"127.0.0.1:54817_",
   [junit4]   2>   "numShards":"1",
   [junit4]   2>   "state":"down",
   [junit4]   2>   "shard":null,
   [junit4]   2>   "collection":"control_collection",
   [junit4]   2>   "operation":"state"} current state version: 0
   [junit4]   2> 604565 INFO  (coreLoadExecutor-2061-thread-1-processing-n:127.0.0.1:54817_) [n:127.0.0.1:54817_ c:control_collection   x:collection1] o.a.s.c.ZkController look for our core node name
   [junit4]   2> 604565 INFO  (OverseerStateUpdate-95738574182547460-127.0.0.1:54817_-n_0000000000) [n:127.0.0.1:54817_    ] o.a.s.c.o.ReplicaMutator Update state numShards=1 message={
   [junit4]   2>   "core":"collection1",
   [junit4]   2>   "roles":null,
   [junit4]   2>   "base_url":"http://127.0.0.1:54817",
   [junit4]   2>   "node_name":"127.0.0.1:54817_",
   [junit4]   2>   "numShards":"1",
   [junit4]   2>   "state":"down",
   [junit4]   2>   "shard":null,
   [junit4]   2>   "collection":"control_collection",
   [junit4]   2>   "operation":"state"}
   [junit4]   2> 604566 INFO  (OverseerStateUpdate-95738574182547460-127.0.0.1:54817_-n_0000000000) [n:127.0.0.1:54817_    ] o.a.s.c.o.ClusterStateMutator building a new cName: control_collection
   [junit4]   2> 604567 INFO  (OverseerStateUpdate-95738574182547460-127.0.0.1:54817_-n_0000000000) [n:127.0.0.1:54817_    ] o.a.s.c.o.ReplicaMutator Assigning new node to shard shard=shard1
   [junit4]   2> 604569 INFO  (zkCallback-739-thread-1-processing-n:127.0.0.1:54817_) [n:127.0.0.1:54817_    ] o.a.s.c.c.ZkStateReader A cluster state change: [WatchedEvent state:SyncConnected type:NodeDataChanged path:/clusterstate.json], has occurred - updating... (live nodes size: [1])
   [junit4]   2> 605568 INFO  (coreLoadExecutor-2061-thread-1-processing-n:127.0.0.1:54817_) [n:127.0.0.1:54817_ c:control_collection   x:collection1] o.a.s.c.ZkController waiting to find shard id in clusterstate for collection1
   [junit4]   2> 605568 INFO  (coreLoadExecutor-2061-thread-1-processing-n:127.0.0.1:54817_) [n:127.0.0.1:54817_ c:control_collection   x:collection1] o.a.s.c.ZkController Check for collection zkNode:control_collection
   [junit4]   2> 605569 INFO  (coreLoadExecutor-2061-thread-1-processing-n:127.0.0.1:54817_) [n:127.0.0.1:54817_ c:control_collection   x:collection1] o.a.s.c.ZkController Collection zkNode exists
   [junit4]   2> 605569 INFO  (coreLoadExecutor-2061-thread-1-processing-n:127.0.0.1:54817_) [n:127.0.0.1:54817_ c:control_collection   x:collection1] o.a.s.c.c.ZkStateReader Load collection config from: [/collections/control_collection]
   [junit4]   2> 605570 INFO  (coreLoadExecutor-2061-thread-1-processing-n:127.0.0.1:54817_) [n:127.0.0.1:54817_ c:control_collection   x:collection1] o.a.s.c.c.ZkStateReader path=[/collections/control_collection] [configName]=[conf1] specified config exists in ZooKeeper
   [junit4]   2> 605570 INFO  (coreLoadExecutor-2061-thread-1-processing-n:127.0.0.1:54817_) [n:127.0.0.1:54817_ c:control_collection   x:collection1] o.a.s.c.SolrResourceLoader new SolrResourceLoader for directory: '/Users/jenkins/workspace/Lucene-Solr-6.x-MacOSX/solr/build/solr-core/test/J1/temp/solr.cloud.CustomCollectionTest_54A1CA51B80AF88A-001/control-001/cores/collection1'
   [junit4]   2> 605570 INFO  (coreLoadExecutor-2061-thread-1-processing-n:127.0.0.1:54817_) [n:127.0.0.1:54817_ c:control_collection   x:collection1] o.a.s.c.SolrResourceLoader JNDI not configured for solr (NoInitialContextEx)
   [junit4]   2> 605570 INFO  (coreLoadExecutor-2061-thread-1-processing-n:127.0.0.1:54817_) [n:127.0.0.1:54817_ c:control_collection   x:collection1] o.a.s.c.SolrResourceLoader solr home defaulted to 'solr/' (could not find system property or JNDI)
   [junit4]   2> 605573 INFO  (coreLoadExecutor-2061-thread-1-processing-n:127.0.0.1:54817_) [n:127.0.0.1:54817_ c:control_collection   x:collection1] o.a.s.c.Config loaded config solrconfig.xml with version 0 
   [junit4]   2> 605583 INFO  (coreLoadExecutor-2061-thread-1-processing-n:127.0.0.1:54817_) [n:127.0.0.1:54817_ c:control_collection   x:collection1] o.a.s.c.SolrConfig current version of requestparams : -1
   [junit4]   2> 605589 INFO  (coreLoadExecutor-2061-thread-1-processing-n:127.0.0.1:54817_) [n:127.0.0.1:54817_ c:control_collection   x:collection1] o.a.s.c.SolrConfig Using Lucene MatchVersion: 6.1.0
   [junit4]   2> 605599 INFO  (coreLoadExecutor-2061-thread-1-processing-n:127.0.0.1:54817_) [n:127.0.0.1:54817_ c:control_collection   x:collection1] o.a.s.c.SolrConfig Loaded SolrConfig: solrconfig.xml
   [junit4]   2> 605605 INFO  (coreLoadExecutor-2061-thread-1-processing-n:127.0.0.1:54817_) [n:127.0.0.1:54817_ c:control_collection   x:collection1] o.a.s.s.IndexSchema [collection1] Schema name=test
   [junit4]   2> 605706 INFO  (coreLoadExecutor-2061-thread-1-processing-n:127.0.0.1:54817_) [n:127.0.0.1:54817_ c:control_collection   x:collection1] o.a.s.s.OpenExchangeRatesOrgProvider Initialized with rates=open-exchange-rates.json, refreshInterval=1440.
   [junit4]   2> 605712 INFO  (coreLoadExecutor-2061-thread-1-processing-n:127.0.0.1:54817_) [n:127.0.0.1:54817_ c:control_collection   x:collection1] o.a.s.s.IndexSchema default search field in schema is text
   [junit4]   2> 605713 INFO  (coreLoadExecutor-2061-thread-1-processing-n:127.0.0.1:54817_) [n:127.0.0.1:54817_ c:control_collection   x:collection1] o.a.s.s.IndexSchema unique key field: id
   [junit4]   2> 605728 INFO  (coreLoadExecutor-2061-thread-1-processing-n:127.0.0.1:54817_) [n:127.0.0.1:54817_ c:control_collection   x:collection1] o.a.s.s.FileExchangeRateProvider Reloading exchange rates from file currency.xml
   [junit4]   2> 605731 INFO  (coreLoadExecutor-2061-thread-1-processing-n:127.0.0.1:54817_) [n:127.0.0.1:54817_ c:control_collection   x:collection1] o.a.s.s.FileExchangeRateProvider Reloading exchange rates from file currency.xml
   [junit4]   2> 605734 INFO  (coreLoadExecutor-2061-thread-1-processing-n:127.0.0.1:54817_) [n:127.0.0.1:54817_ c:control_collection   x:collection1] o.a.s.s.OpenExchangeRatesOrgProvider Reloading exchange rates from open-exchange-rates.json
   [junit4]   2> 605735 INFO  (coreLoadExecutor-2061-thread-1-processing-n:127.0.0.1:54817_) [n:127.0.0.1:54817_ c:control_collection   x:collection1] o.a.s.s.OpenExchangeRatesOrgProvider Reloading exchange rates from open-exchange-rates.json
   [junit4]   2> 605740 INFO  (coreLoadExecutor-2061-thread-1-processing-n:127.0.0.1:54817_) [n:127.0.0.1:54817_ c:control_collection   x:collection1] o.a.s.c.ConfigSetProperties Did not find ConfigSet properties, assuming default properties: Can't find resource 'configsetprops.json' in classpath or '/configs/conf1', cwd=/Users/jenkins/workspace/Lucene-Solr-6.x-MacOSX/solr/build/solr-core/test/J1
   [junit4]   2> 605740 INFO  (coreLoadExecutor-2061-thread-1-processing-n:127.0.0.1:54817_) [n:127.0.0.1:54817_ c:control_collection   x:collection1] o.a.s.c.CoreContainer Creating SolrCore 'collection1' using configuration from collection control_collection
   [junit4]   2> 605740 INFO  (coreLoadExecutor-2061-thread-1-processing-n:127.0.0.1:54817_) [n:127.0.0.1:54817_ c:control_collection s:shard1 r:core_node1 x:collection1] o.a.s.c.SolrCore org.apache.solr.core.MockDirectoryFactory
   [junit4]   2> 605740 INFO  (coreLoadExecutor-2061-thread-1-processing-n:127.0.0.1:54817_) [n:127.0.0.1:54817_ c:control_collection s:shard1 r:core_node1 x:collection1] o.a.s.c.SolrCore [[collection1] ] Opening new SolrCore at [/Users/jenkins/workspace/Lucene-Solr-6.x-MacOSX/solr/build/solr-core/test/J1/temp/solr.cloud.CustomCollectionTest_54A1CA51B80AF88A-001/control-001/cores/collection1], dataDir=[/Users/jenkins/workspace/Lucene-Solr-6.x-MacOSX/solr/build/solr-core/test/J1/temp/solr.cloud.CustomCollectionTest_54A1CA51B80AF88A-001/control-001/cores/collection1/data/]
   [junit4]   2> 605740 INFO  (coreLoadExecutor-2061-thread-1-processing-n:127.0.0.1:54817_) [n:127.0.0.1:54817_ c:control_collection s:shard1 r:core_node1 x:collection1] o.a.s.c.JmxMonitoredMap JMX monitoring is enabled. Adding Solr mbeans to JMX Server: com.sun.jmx.mbeanserver.JmxMBeanServer@46015a1c
   [junit4]   2> 605741 INFO  (coreLoadExecutor-2061-thread-1-processing-n:127.0.0.1:54817_) [n:127.0.0.1:54817_ c:control_collection s:shard1 r:core_node1 x:collection1] o.a.s.c.CachingDirectoryFactory return new directory for /Users/jenkins/workspace/Lucene-Solr-6.x-MacOSX/solr/build/solr-core/test/J1/temp/solr.cloud.CustomCollectionTest_54A1CA51B80AF88A-001/control-001/cores/collection1/data
   [junit4]   2> 605745 INFO  (coreLoadExecutor-2061-thread-1-processing-n:127.0.0.1:54817_) [n:127.0.0.1:54817_ c:control_collection s:shard1 r:core_node1 x:collection1] o.a.s.c.SolrCore New index directory detected: old=null new=/Users/jenkins/workspace/Lucene-Solr-6.x-MacOSX/solr/build/solr-core/test/J1/temp/solr.cloud.CustomCollectionTest_54A1CA51B80AF88A-001/control-001/cores/collection1/data/index/
   [junit4]   2> 605745 WARN  (coreLoadExecutor-2061-thread-1-processing-n:127.0.0.1:54817_) [n:127.0.0.1:54817_ c:control_collection s:shard1 r:core_node1 x:collection1] o.a.s.c.SolrCore [collection1] Solr index directory '/Users/jenkins/workspace/Lucene-Solr-6.x-MacOSX/solr/build/solr-core/test/J1/temp/solr.cloud.CustomCollectionTest_54A1CA51B80AF88A-001/control-001/cores/collection1/data/index' doesn't exist. Creating new index...
   [junit4]   2> 605746 INFO  (coreLoadExecutor-2061-thread-1-processing-n:127.0.0.1:54817_) [n:127.0.0.1:54817_ c:control_collection s:shard1 r:core_node1 x:collection1] o.a.s.c.CachingDirectoryFactory return new directory for /Users/jenkins/workspace/Lucene-Solr-6.x-MacOSX/solr/build/solr-core/test/J1/temp/solr.cloud.CustomCollectionTest_54A1CA51B80AF88A-001/control-001/cores/collection1/data/index
   [junit4]   2> 605746 INFO  (coreLoadExecutor-2061-thread-1-processing-n:127.0.0.1:54817_) [n:127.0.0.1:54817_ c:control_collection s:shard1 r:core_node1 x:collection1] o.a.s.u.RandomMergePolicy RandomMergePolicy wrapping class org.apache.lucene.index.LogByteSizeMergePolicy: [LogByteSizeMergePolicy: minMergeSize=1677721, mergeFactor=41, maxMergeSize=2147483648, maxMergeSizeForForcedMerge=9223372036854775807, calibrateSizeByDeletes=true, maxMergeDocs=2147483647, maxCFSSegmentSizeMB=8.796093022207999E12, noCFSRatio=0.5267959904182583]
   [junit4]   2> 605748 INFO  (coreLoadExecutor-2061-thread-1-processing-n:127.0.0.1:54817_) [n:127.0.0.1:54817_ c:control_collection s:shard1 r:core_node1 x:collection1] o.a.s.c.SolrDeletionPolicy SolrDeletionPolicy.onCommit: commits: num=1
   [junit4]   2> 	commit{dir=MockDirectoryWrapper(RAMDirectory@376b1725 lockFactory=org.apache.lucene.store.SingleInstanceLockFactory@29cc9a8e),segFN=segments_1,generation=1}
   [junit4]   2> 605748 INFO  (coreLoadExecutor-2061-thread-1-processing-n:127.0.0.1:54817_) [n:127.0.0.1:54817_ c:control_collection s:shard1 r:core_node1 x:collection1] o.a.s.c.SolrDeletionPolicy newest commit generation = 1
   [junit4]   2> 605749 INFO  (OldIndexDirectoryCleanupThreadForCore-collection1) [n:127.0.0.1:54817_ c:control_collection s:shard1 r:core_node1 x:collection1] o.a.s.c.SolrCore Looking for old index directories to cleanup for core collection1 in /Users/jenkins/workspace/Lucene-Solr-6.x-MacOSX/solr/build/solr-core/test/J1/temp/solr.cloud.CustomCollectionTest_54A1CA51B80AF88A-001/control-001/cores/collection1/data/
   [junit4]   2> 605749 WARN  (OldIndexDirectoryCleanupThreadForCore-collection1) [n:127.0.0.1:54817_ c:control_collection s:shard1 r:core_node1 x:collection1] o.a.s.c.DirectoryFactory /Users/jenkins/workspace/Lucene-Solr-6.x-MacOSX/solr/build/solr-core/test/J1/temp/solr.cloud.CustomCollectionTest_54A1CA51B80AF88A-001/control-001/cores/collection1/data/ does not point to a valid data directory; skipping clean-up of old index directories.
   [junit4]   2> 605753 INFO  (coreLoadExecutor-2061-thread-1-processing-n:127.0.0.1:54817_) [n:127.0.0.1:54817_ c:control_collection s:shard1 r:core_node1 x:collection1] o.a.s.u.p.UpdateRequestProcessorChain creating updateRequestProcessorChain "nodistrib"
   [junit4]   2> 605754 INFO  (coreLoadExecutor-2061-thread-1-processing-n:127.0.0.1:54817_) [n:127.0.0.1:54817_ c:control_collection s:shard1 r:core_node1 x:collection1] o.a.s.u.p.UpdateRequestProcessorChain creating updateRequestProcessorChain "dedupe"
   [junit4]   2> 605754 INFO  (coreLoadExecutor-2061-thread-1-processing-n:127.0.0.1:54817_) [n:127.0.0.1:54817_ c:control_collection s:shard1 r:core_node1 x:collection1] o.a.s.u.p.UpdateRequestProcessorChain inserting DistributedUpdateProcessorFactory into updateRequestProcessorChain "dedupe"
   [junit4]   2> 605754 INFO  (coreLoadExecutor-2061-thread-1-processing-n:127.0.0.1:54817_) [n:127.0.0.1:54817_ c:control_collection s:shard1 r:core_node1 x:collection1] o.a.s.u.p.UpdateRequestProcessorChain creating updateRequestProcessorChain "stored_sig"
   [junit4]   2> 605754 INFO  (coreLoadExecutor-2061-thread-1-processing-n:127.0.0.1:54817_) [n:127.0.0.1:54817_ c:control_collection s:shard1 r:core_node1 x:collection1] o.a.s.u.p.UpdateRequestProcessorChain inserting DistributedUpdateProcessorFactory into updateRequestProcessorChain "stored_sig"
   [junit4]   2> 605754 INFO  (coreLoadExecutor-2061-thread-1-processing-n:127.0.0.1:54817_) [n:127.0.0.1:54817_ c:control_collection s:shard1 r:core_node1 x:collection1] o.a.s.u.p.UpdateRequestProcessorChain creating updateRequestProcessorChain "distrib-dup-test-chain-explicit"
   [junit4]   2> 605754 INFO  (coreLoadExecutor-2061-thread-1-processing-n:127.0.0.1:54817_) [n:127.0.0.1:54817_ c:control_collection s:shard1 r:core_node1 x:collection1] o.a.s.u.p.UpdateRequestProcessorChain creating updateRequestProcessorChain "distrib-dup-test-chain-implicit"
   [junit4]   2> 605754 INFO  (coreLoadExecutor-2061-thread-1-processing-n:127.0.0.1:54817_) [n:127.0.0.1:54817_ c:control_collection s:shard1 r:core_node1 x:collection1] o.a.s.u.p.UpdateRequestProcessorChain inserting DistributedUpdateProcessorFactory into updateRequestProcessorChain "distrib-dup-test-chain-implicit"
   [junit4]   2> 605754 INFO  (coreLoadExecutor-2061-thread-1-processing-n:127.0.0.1:54817_) [n:127.0.0.1:54817_ c:control_collection s:shard1 r:core_node1 x:collection1] o.a.s.c.SolrCore no updateRequestProcessorChain defined as default, creating implicit default
   [junit4]   2> 605754 WARN  (coreLoadExecutor-2061-thread-1-processing-n:127.0.0.1:54817_) [n:127.0.0.1:54817_ c:control_collection s:shard1 r:core_node1 x:collection1] o.a.s.c.RequestHandlers INVALID paramSet a in requestHandler {type = requestHandler,name = /dump,class = DumpRequestHandler,args = {defaults={a=A,b=B}}}
   [junit4]   2> 605762 INFO  (coreLoadExecutor-2061-thread-1-processing-n:127.0.0.1:54817_) [n:127.0.0.1:54817_ c:control_collection s:shard1 r:core_node1 x:collection1] o.a.s.h.l.XMLLoader xsltCacheLifetimeSeconds=60
   [junit4]   2> 605763 INFO  (coreLoadExecutor-2061-thread-1-processing-n:127.0.0.1:54817_) [n:127.0.0.1:54817_ c:control_collection s:shard1 r:core_node1 x:collection1] o.a.s.h.l.XMLLoader xsltCacheLifetimeSeconds=60
   [junit4]   2> 605765 INFO  (coreLoadExecutor-2061-thread-1-processing-n:127.0.0.1:54817_) [n:127.0.0.1:54817_ c:control_collection s:shard1 r:core_node1 x:collection1] o.a.s.h.l.XMLLoader xsltCacheLifetimeSeconds=60
   [junit4]   2> 605766 INFO  (coreLoadExecutor-2061-thread-1-processing-n:127.0.0.1:54817_) [n:127.0.0.1:54817_ c:control_collection s:shard1 r:core_node1 x:collection1] o.a.s.h.l.XMLLoader xsltCacheLifetimeSeconds=60
   [junit4]   2> 605774 INFO  (coreLoadExecutor-2061-thread-1-processing-n:127.0.0.1:54817_) [n:127.0.0.1:54817_ c:control_collection s:shard1 r:core_node1 x:collection1] o.a.s.c.RequestHandlers Registered paths: /admin/mbeans,standard,/dump,/update/csv,/sql,/update/json/docs,/admin/luke,/export,/admin/segments,/get,/admin/system,/replication,/admin/properties,/config,/stream,/schema,/admin/plugins,/admin/logging,/update/json,/admin/ping,/admin/threads,/update,/admin/file
   [junit4]   2> 605774 INFO  (coreLoadExecutor-2061-thread-1-processing-n:127.0.0.1:54817_) [n:127.0.0.1:54817_ c:control_collection s:shard1 r:core_node1 x:collection1] o.a.s.c.SolrCore Using default statsCache cache: org.apache.solr.search.stats.LocalStatsCache
   [junit4]   2> 605775 INFO  (coreLoadExecutor-2061-thread-1-processing-n:127.0.0.1:54817_) [n:127.0.0.1:54817_ c:control_collection s:shard1 r:core_node1 x:collection1] o.a.s.u.UpdateHandler Using UpdateLog implementation: org.apache.solr.update.UpdateLog
   [junit4]   2> 605775 INFO  (coreLoadExecutor-2061-thread-1-processing-n:127.0.0.1:54817_) [n:127.0.0.1:54817_ c:control_collection s:shard1 r:core_node1 x:collection1] o.a.s.u.UpdateLog Initializing UpdateLog: dataDir= defaultSyncLevel=FLUSH numRecordsToKeep=100 maxNumLogsToKeep=10 numVersionBuckets=65536
   [junit4]   2> 605776 INFO  (coreLoadExecutor-2061-thread-1-processing-n:127.0.0.1:54817_) [n:127.0.0.1:54817_ c:control_collection s:shard1 r:core_node1 x:collection1] o.a.s.u.CommitTracker Hard AutoCommit: disabled
   [junit4]   2> 605776 INFO  (coreLoadExecutor-2061-thread-1-processing-n:127.0.0.1:54817_) [n:127.0.0.1:54817_ c:control_collection s:shard1 r:core_node1 x:collection1] o.a.s.u.CommitTracker Soft AutoCommit: disabled
   [junit4]   2> 605776 INFO  (coreLoadExecutor-2061-thread-1-processing-n:127.0.0.1:54817_) [n:127.0.0.1:54817_ c:control_collection s:shard1 r:core_node1 x:collection1] o.a.s.u.RandomMergePolicy RandomMergePolicy wrapping class org.apache.lucene.index.AlcoholicMergePolicy: [AlcoholicMergePolicy: minMergeSize=0, mergeFactor=10, maxMergeSize=1721132120, maxMergeSizeForForcedMerge=9223372036854775807, calibrateSizeByDeletes=true, maxMergeDocs=2147483647, maxCFSSegmentSizeMB=8.796093022207999E12, noCFSRatio=0.1]
   [junit4]   2> 605780 INFO  (coreLoadExecutor-2061-thread-1-processing-n:127.0.0.1:54817_) [n:127.0.0.1:54817_ c:control_collection s:shard1 r:core_node1 x:collection1] o.a.s.c.SolrDeletionPolicy SolrDeletionPolicy.onInit: commits: num=1
   [junit4]   2> 	commit{dir=MockDirectoryWrapper(RAMDirectory@376b1725 lockFactory=org.apache.lucene.store.SingleInstanceLockFactory@29cc9a8e),segFN=segments_1,generation=1}
   [junit4]   2> 605780 INFO  (coreLoadExecutor-2061-thread-1-processing-n:127.0.0.1:54817_) [n:127.0.0.1:54817_ c:control_collection s:shard1 r:core_node1 x:collection1] o.a.s.c.SolrDeletionPolicy newest commit generation = 1
   [junit4]   2> 605780 INFO  (coreLoadExecutor-2061-thread-1-processing-n:127.0.0.1:54817_) [n:127.0.0.1:54817_ c:control_collection s:shard1 r:core_node1 x:collection1] o.a.s.s.SolrIndexSearcher Opening [Searcher@59857e79[collection1] main]
   [junit4]   2> 605780 INFO  (coreLoadExecutor-2061-thread-1-processing-n:127.0.0.1:54817_) [n:127.0.0.1:54817_ c:control_collection s:shard1 r:core_node1 x:collection1] o.a.s.c.c.ZkStateReader Load collection config from: [/collections/control_collection]
   [junit4]   2> 605782 INFO  (coreLoadExecutor-2061-thread-1-processing-n:127.0.0.1:54817_) [n:127.0.0.1:54817_ c:control_collection s:shard1 r:core_node1 x:collection1] o.a.s.c.c.ZkStateReader path=[/collections/control_collection] [configName]=[conf1] specified config exists in ZooKeeper
   [junit4]   2> 605782 INFO  (coreLoadExecutor-2061-thread-1-processing-n:127.0.0.1:54817_) [n:127.0.0.1:54817_ c:control_collection s:shard1 r:core_node1 x:collection1] o.a.s.r.ManagedResourceStorage Setting up ZooKeeper-based storage for the RestManager with znodeBase: /configs/conf1
   [junit4]   2> 605782 INFO  (coreLoadExecutor-2061-thread-1-processing-n:127.0.0.1:54817_) [n:127.0.0.1:54817_ c:control_collection s:shard1 r:core_node1 x:collection1] o.a.s.r.ManagedResourceStorage Configured ZooKeeperStorageIO with znodeBase: /configs/conf1
   [junit4]   2> 605782 INFO  (coreLoadExecutor-2061-thread-1-processing-n:127.0.0.1:54817_) [n:127.0.0.1:54817_ c:control_collection s:shard1 r:core_node1 x:collection1] o.a.s.r.RestManager Initializing RestManager with initArgs: {}
   [junit4]   2> 605782 INFO  (coreLoadExecutor-2061-thread-1-processing-n:127.0.0.1:54817_) [n:127.0.0.1:54817_ c:control_collection s:shard1 r:core_node1 x:collection1] o.a.s.r.ManagedResourceStorage Reading _rest_managed.json using ZooKeeperStorageIO:path=/configs/conf1
   [junit4]   2> 605783 INFO  (coreLoadExecutor-2061-thread-1-processing-n:127.0.0.1:54817_) [n:127.0.0.1:54817_ c:control_collection s:shard1 r:core_node1 x:collection1] o.a.s.r.ManagedResourceStorage No data found for znode /configs/conf1/_rest_managed.json
   [junit4]   2> 605783 INFO  (coreLoadExecutor-2061-thread-1-processing-n:127.0.0.1:54817_) [n:127.0.0.1:54817_ c:control_collection s:shard1 r:core_node1 x:collection1] o.a.s.r.ManagedResourceStorage Loaded null at path _rest_managed.json using ZooKeeperStorageIO:path=/configs/conf1
   [junit4]   2> 605783 INFO  (coreLoadExecutor-2061-thread-1-processing-n:127.0.0.1:54817_) [n:127.0.0.1:54817_ c:control_collection s:shard1 r:core_node1 x:collection1] o.a.s.r.RestManager Initializing 0 registered ManagedResources
   [junit4]   2> 605783 INFO  (coreLoadExecutor-2061-thread-1-processing-n:127.0.0.1:54817_) [n:127.0.0.1:54817_ c:control_collection s:shard1 r:core_node1 x:collection1] o.a.s.h.ReplicationHandler Commits will be reserved for  10000
   [junit4]   2> 605784 INFO  (searcherExecutor-2062-thread-1-processing-n:127.0.0.1:54817_ x:collection1 s:shard1 c:control_collection r:core_node1) [n:127.0.0.1:54817_ c:control_collection s:shard1 r:core_node1 x:collection1] o.a.s.c.SolrCore [collection1] Registered new searcher Searcher@59857e79[collection1] main{ExitableDirectoryReader(UninvertingDirectoryReader())}
   [junit4]   2> 605784 INFO  (coreLoadExecutor-2061-thread-1-processing-n:127.0.0.1:54817_) [n:127.0.0.1:54817_ c:control_collection s:shard1 r:core_node1 x:collection1] o.a.s.u.UpdateLog Looking up max value of version field to seed version buckets
   [junit4]   2> 605784 INFO  (coreLoadExecutor-2061-thread-1-processing-n:127.0.0.1:54817_) [n:127.0.0.1:54817_ c:control_collection s:shard1 r:core_node1 x:collection1] o.a.s.u.VersionInfo Refreshing highest value of _version_ for 65536 version buckets from index
   [junit4]   2> 605784 INFO  (coreLoadExecutor-2061-thread-1-processing-n:127.0.0.1:54817_) [n:127.0.0.1:54817_ c:control_collection s:shard1 r:core_node1 x:collection1] o.a.s.u.VersionInfo No terms found for _version_, cannot seed version bucket highest value from index
   [junit4]   2> 605784 INFO  (coreLoadExecutor-2061-thread-1-processing-n:127.0.0.1:54817_) [n:127.0.0.1:54817_ c:control_collection s:shard1 r:core_node1 x:collection1] o.a.s.u.UpdateLog Could not find max version in index or recent updates, using new clock 1531817188854333440
   [junit4]   2> 605786 INFO  (coreLoadExecutor-2061-thread-1-processing-n:127.0.0.1:54817_) [n:127.0.0.1:54817_ c:control_collection s:shard1 r:core_node1 x:collection1] o.a.s.u.UpdateLog Took 1.0ms to seed version buckets with highest version 1531817188854333440
   [junit4]   2> 605786 INFO  (coreLoadExecutor-2061-thread-1-processing-n:127.0.0.1:54817_) [n:127.0.0.1:54817_ c:control_collection s:shard1 r:core_node1 x:collection1] o.a.s.c.ZkController watch zkdir /configs/conf1
   [junit4]   2> 605787 INFO  (coreLoadExecutor-2061-thread-1-processing-n:127.0.0.1:54817_) [n:127.0.0.1:54817_ c:control_collection s:shard1 r:core_node1 x:collection1] o.a.s.c.CoreContainer registering core: collection1
   [junit4]   2> 605787 INFO  (coreZkRegister-2055-thread-1-processing-n:127.0.0.1:54817_ x:collection1 s:shard1 c:control_collection r:core_node1) [n:127.0.0.1:54817_ c:control_collection s:shard1 r:core_node1 x:collection1] o.a.s.c.ZkController Register replica - core:collection1 address:http://127.0.0.1:54817 collection:control_collection shard:shard1
   [junit4]   2> 605788 INFO  (coreZkRegister-2055-thread-1-processing-n:127.0.0.1:54817_ x:collection1 s:shard1 c:control_collection r:core_node1) [n:127.0.0.1:54817_ c:control_collection s:shard1 r:core_node1 x:collection1] o.a.s.c.c.SolrZkClient makePath: /collections/control_collection/leader_elect/shard1/election
   [junit4]   2> 605794 INFO  (coreZkRegister-2055-thread-1-processing-n:127.0.0.1:54817_ x:collection1 s:shard1 c:control_collection r:core_node1) [n:127.0.0.1:54817_ c:control_collection s:shard1 r:core_node1 x:collection1] o.a.s.c.LeaderElector Joined leadership election with path: /collections/control_collection/leader_elect/shard1/election/95738574182547460-core_node1-n_0000000000
   [junit4]   2> 605795 INFO  (coreZkRegister-2055-thread-1-processing-n:127.0.0.1:54817_ x:collection1 s:shard1 c:control_collection r:core_node1) [n:127.0.0.1:54817_ c:control_collection s:shard1 r:core_node1 x:collection1] o.a.s.c.ShardLeaderElectionContext Running the leader process for shard=shard1 and weAreReplacement=false and leaderVoteWait=180000
   [junit4]   2> 605799 INFO  (coreZkRegister-2055-thread-1-processing-n:127.0.0.1:54817_ x:collection1 s:shard1 c:control_collection r:core_node1) [n:127.0.0.1:54817_ c:control_collection s:shard1 r:core_node1 x:collection1] o.a.s.c.ShardLeaderElectionContext Enough replicas found to continue.
   [junit4]   2> 605799 INFO  (coreZkRegister-2055-thread-1-processing-n:127.0.0.1:54817_ x:collection1 s:shard1 c:control_collection r:core_node1) [n:127.0.0.1:54817_ c:control_collection s:shard1 r:core_node1 x:collection1] o.a.s.c.ShardLeaderElectionContext I may be the new leader - try and sync
   [junit4]   2> 605799 INFO  (coreZkRegister-2055-thread-1-processing-n:127.0.0.1:54817_ x:collection1 s:shard1 c:control_collection r:core_node1) [n:127.0.0.1:54817_ c:control_collection s:shard1 r:core_node1 x:collection1] o.a.s.c.SyncStrategy Sync replicas to http://127.0.0.1:54817/collection1/
   [junit4]   2> 605799 INFO  (coreZkRegister-2055-thread-1-processing-n:127.0.0.1:54817_ x:collection1 s:shard1 c:control_collection r:core_node1) [n:127.0.0.1:54817_ c:control_collection s:shard1 r:core_node1 x:collection1] o.a.s.c.SyncStrategy Sync Success - now sync replicas to me
   [junit4]   2> 605799 INFO  (coreZkRegister-2055-thread-1-processing-n:127.0.0.1:54817_ x:collection1 s:shard1 c:control_collection r:core_node1) [n:127.0.0.1:54817_ c:control_collection s:shard1 r:core_node1 x:collection1] o.a.s.c.SyncStrategy http://127.0.0.1:54817/collection1/ has no replicas
   [junit4]   2> 605799 INFO  (OverseerStateUpdate-95738574182547460-127.0.0.1:54817_-n_0000000000) [n:127.0.0.1:54817_    ] o.a.s.c.Overseer processMessage: queueSize: 1, message = {
   [junit4]   2>   "operation":"leader",
   [junit4]   2>   "shard":"shard1",
   [junit4]   2>   "collection":"control_collection"} current state version: 1
   [junit4]   2> 605800 INFO  (coreZkRegister-2055-thread-1-processing-n:127.0.0.1:54817_ x:collection1 s:shard1 c:control_collection r:core_node1) [n:127.0.0.1:54817_ c:control_collection s:shard1 r:core_node1 x:collection1] o.a.s.c.c.SolrZkClient makePath: /collections/control_collection/leaders/shard1
   [junit4]   2> 605805 INFO  (coreZkRegister-2055-thread-1-processing-n:127.0.0.1:54817_ x:collection1 s:shard1 c:control_collection r:core_node1) [n:127.0.0.1:54817_ c:control_collection s:shard1 r:core_node1 x:collection1] o.a.s.c.ShardLeaderElectionContextBase Creating leader registration node /collections/control_collection/leaders/shard1/leader after winning as /collections/control_collection/leader_elect/shard1/election/95738574182547460-core_node1-n_0000000000
   [junit4]   2> 605808 INFO  (coreZkRegister-2055-thread-1-processing-n:127.0.0.1:54817_ x:collection1 s:shard1 c:control_collection r:core_node1) [n:127.0.0.1:54817_ c:control_collection s:shard1 r:core_node1 x:collection1] o.a.s.c.ShardLeaderElectionContext I am the new leader: http://127.0.0.1:54817/collection1/ shard1
   [junit4]   2> 605810 INFO  (OverseerStateUpdate-95738574182547460-127.0.0.1:54817_-n_0000000000) [n:127.0.0.1:54817_    ] o.a.s.c.Overseer processMessage: queueSize: 1, message = {
   [junit4]   2>   "operation":"leader",
   [junit4]   2>   "shard":"shard1",
   [junit4]   2>   "collection":"control_collection",
   [junit4]   2>   "base_url":"http://127.0.0.1:54817",
   [junit4]   2>   "core":"collection1",
   [junit4]   2>   "state":"active"} current state version: 1
   [junit4]   2> 605916 INFO  (zkCallback-739-thread-1-processing-n:127.0.0.1:54817_) [n:127.0.0.1:54817_    ] o.a.s.c.c.ZkStateReader A cluster state change: [WatchedEvent state:SyncConnected type:NodeDataChanged path:/clusterstate.json], has occurred - updating... (live nodes size: [1])
   [junit4]   2> 605919 INFO  (coreZkRegister-2055-thread-1-processing-n:127.0.0.1:54817_ x:collection1 s:shard1 c:control_collection r:core_node1) [n:127.0.0.1:54817_ c:control_collection s:shard1 r:core_node1 x:collection1] o.a.s.c.ZkController We are http://127.0.0.1:54817/collection1/ and leader is http://127.0.0.1:54817/collection1/
   [junit4]   2> 605919 INFO  (coreZkRegister-2055-thread-1-processing-n:127.0.0.1:54817_ x:collection1 s:shard1 c:control_collection r:core_node1) [n:127.0.0.1:54817_ c:control_collection s:shard1 r:core_node1 x:collection1] o.a.s.c.ZkController No LogReplay needed for core=collection1 baseURL=http://127.0.0.1:54817
   [junit4]   2> 605919 INFO  (coreZkRegister-2055-thread-1-processing-n:127.0.0.1:54817_ x:collection1 s:shard1 c:control_collection r:core_node1) [n:127.0.0.1:54817_ c:control_collection s:shard1 r:core_node1 x:collection1] o.a.s.c.ZkController I am the leader, no recovery necessary
   [junit4]   2> 605919 INFO  (coreZkRegister-2055-thread-1-processing-n:127.0.0.1:54817_ x:collection1 s:shard1 c:control_collection r:core_node1) [n:127.0.0.1:54817_ c:control_collection s:shard1 r:core_node1 x:collection1] o.a.s.c.ZkController publishing state=active
   [junit4]   2> 605919 INFO  (coreZkRegister-2055-thread-1-processing-n:127.0.0.1:54817_ x:collection1 s:shard1 c:control_collection r:core_node1) [n:127.0.0.1:54817_ c:control_collection s:shard1 r:core_node1 x:collection1] o.a.s.c.ZkController numShards not found on descriptor - reading it from system property
   [junit4]   2> 605922 INFO  (OverseerStateUpdate-95738574182547460-127.0.0.1:54817_-n_0000000000) [n:127.0.0.1:54817_    ] o.a.s.c.Overseer processMessage: queueSize: 1, message = {
   [junit4]   2>   "core":"collection1",
   [junit4]   2>   "core_node_name":"core_node1",
   [junit4]   2>   "roles":null,
   [junit4]   2>   "base_url":"http://127.0.0.1:54817",
   [junit4]   2>   "node_name":"127.0.0.1:54817_",
   [junit4]   2>   "numShards":"1",
   [junit4]   2>   "state":"active",
   [junit4]   2>   "shard":"shard1",
   [junit4]   2>   "collection":"control_collection",
   [junit4]   2>   "operation":"state"} current state version: 2
   [junit4]   2> 605923 INFO  (OverseerStateUpdate-95738574182547460-127.0.0.1:54817_-n_0000000000) [n:127.0.0.1:54817_    ] o.a.s.c.o.ReplicaMutator Update state numShards=1 message={
   [junit4]   2>   "core":"collection1",
   [junit4]   2>   "core_node_name":"core_node1",
   [junit4]   2>   "roles":null,
   [junit4]   2>   "base_url":"http://127.0.0.1:54817",
   [junit4]   2>   "node_name":"127.0.0.1:54817_",
   [junit4]   2>   "numShards":"1",
   [junit4]   2>   "state":"active",
   [junit4]   2>   "shard":"shard1",
   [junit4]   2>   "collection":"control_collection",
   [junit4]   2>   "operation":"state"}
   [junit4]   2> 606033 INFO  (zkCallback-739-thread-1-processing-n:127.0.0.1:54817_) [n:127.0.0.1:54817_    ] o.a.s.c.c.ZkStateReader A cluster state change: [WatchedEvent state:SyncConnected type:NodeDataChanged path:/clusterstate.json], has occurred - updating... (live nodes size: [1])
   [junit4]   2> 606070 INFO  (TEST-CustomCollectionTest.test-seed#[54A1CA51B80AF88A]) [    ] o.a.s.c.c.SolrZkClient Using default ZkCredentialsProvider
   [junit4]   2> 606071 INFO  (TEST-CustomCollectionTest.test-seed#[54A1CA51B80AF88A]) [    ] o.a.s.c.c.ConnectionManager Waiting for client to connect to ZooKeeper
   [junit4]   2> 606073 INFO  (zkCallback-741-thread-1) [    ] o.a.s.c.c.ConnectionManager Watcher org.apache.solr.common.cloud.ConnectionManager@5ed8c5d1 name:ZooKeeperConnection Watcher:127.0.0.1:54814/solr got event WatchedEvent state:SyncConnected type:None path:null path:null type:None
   [junit4]   2> 606073 INFO  (TEST-CustomCollectionTest.test-seed#[54A1CA51B80AF88A]) [    ] o.a.s.c.c.ConnectionManager Client is connected to ZooKeeper
   [junit4]   2> 606073 INFO  (TEST-CustomCollectionTest.test-seed#[54A1CA51B80AF88A]) [    ] o.a.s.c.c.SolrZkClient Using default ZkACLProvider
   [junit4]   2> 606073 INFO  (TEST-CustomCollectionTest.test-seed#[54A1CA51B80AF88A]) [    ] o.a.s.c.c.ZkStateReader Updating cluster state from ZooKeeper... 
   [junit4]   2> 606075 INFO  (TEST-CustomCollectionTest.test-seed#[54A1CA51B80AF88A]) [    ] o.a.s.c.c.ZkStateReader Updated live nodes from ZooKeeper... (0) -> (1)
   [junit4]   2> 606077 INFO  (TEST-CustomCollectionTest.test-seed#[54A1CA51B80AF88A]) [    ] o.a.s.c.ChaosMonkey monkey: init - expire sessions:false cause connection loss:false
   [junit4]   2> 606447 INFO  (TEST-CustomCollectionTest.test-seed#[54A1CA51B80AF88A]) [    ] o.a.s.SolrTestCaseJ4 Writing core.properties file to /Users/jenkins/workspace/Lucene-Solr-6.x-MacOSX/solr/build/solr-core/test/J1/temp/solr.cloud.CustomCollectionTest_54A1CA51B80AF88A-001/shard-1-001/cores/collection1
   [junit4]   2> 606450 INFO  (TEST-CustomCollectionTest.test-seed#[54A1CA51B80AF88A]) [    ] o.a.s.c.AbstractFullDistribZkTestBase create jetty 1 in directory /Users/jenkins/workspace/Lucene-Solr-6.x-MacOSX/solr/build/solr-core/test/J1/temp/solr.cloud.CustomCollectionTest_54A1CA51B80AF88A-001/shard-1-001
   [junit4]   2> 606450 INFO  (TEST-CustomCollectionTest.test-seed#[54A1CA51B80AF88A]) [    ] o.e.j.s.Server jetty-9.3.8.v20160314
   [junit4]   2> 606456 INFO  (TEST-CustomCollectionTest.test-seed#[54A1CA51B80AF88A]) [    ] o.e.j.s.h.ContextHandler Started o.e.j.s.ServletContextHandler@65210a86{/,null,AVAILABLE}
   [junit4]   2> 606458 INFO  (TEST-CustomCollectionTest.test-seed#[54A1CA51B80AF88A]) [    ] o.e.j.s.ServerConnector Started ServerConnector@44b390d{HTTP/1.1,[http/1.1]}{127.0.0.1:54822}
   [junit4]   2> 606463 INFO  (TEST-CustomCollectionTest.test-seed#[54A1CA51B80AF88A]) [    ] o.e.j.s.Server Started @611905ms
   [junit4]   2> 606463 INFO  (TEST-CustomCollectionTest.test-seed#[54A1CA51B80AF88A]) [    ] o.a.s.c.s.e.JettySolrRunner Jetty properties: {solr.data.dir=/Users/jenkins/workspace/Lucene-Solr-6.x-MacOSX/solr/build/solr-core/test/J1/temp/solr.cloud.CustomCollectionTest_54A1CA51B80AF88A-001/tempDir-001/jetty1, solrconfig=solrconfig.xml, hostContext=/, hostPort=54822, coreRootDirectory=/Users/jenkins/workspace/Lucene-Solr-6.x-MacOSX/solr/build/solr-core/test/J1/../../../../../../../../../Users/jenkins/workspace/Lucene-Solr-6.x-MacOSX/solr/build/solr-core/test/J1/temp/solr.cloud.CustomCollectionTest_54A1CA51B80AF88A-001/shard-1-001/cores}
   [junit4]   2> 606464 INFO  (TEST-CustomCollectionTest.test-seed#[54A1CA51B80AF88A]) [    ] o.a.s.s.SolrDispatchFilter SolrDispatchFilter.init(): sun.misc.Launcher$AppClassLoader@4554617c
   [junit4]   2> 606464 INFO  (TEST-CustomCollectionTest.test-seed#[54A1CA51B80AF88A]) [    ] o.a.s.c.SolrResourceLoader new SolrResourceLoader for directory: '/Users/jenkins/workspace/Lucene-Solr-6.x-MacOSX/solr/build/solr-core/test/J1/temp/solr.cloud.CustomCollectionTest_54A1CA51B80AF88A-001/shard-1-001'
   [junit4]   2> 606464 INFO  (TEST-CustomCollectionTest.test-seed#[54A1CA51B80AF88A]) [    ] o.a.s.c.SolrResourceLoader JNDI not configured for solr (NoInitialContextEx)
   [junit4]   2> 606464 INFO  (TEST-CustomCollectionTest.test-seed#[54A1CA51B80AF88A]) [    ] o.a.s.c.SolrResourceLoader solr home defaulted to 'solr/' (could not find system property or JNDI)
   [junit4]   2> 606465 INFO  (TEST-CustomCollectionTest.test-seed#[54A1CA51B80AF88A]) [    ] o.a.s.c.c.SolrZkClient Using default ZkCredentialsProvider
   [junit4]   2> 606475 INFO  (TEST-CustomCollectionTest.test-seed#[54A1CA51B80AF88A]) [    ] o.a.s.c.c.ConnectionManager Waiting for client to connect to ZooKeeper
   [junit4]   2> 606476 INFO  (zkCallback-742-thread-1) [    ] o.a.s.c.c.ConnectionManager Watcher org.apache.solr.common.cloud.ConnectionManager@60b72d58 name:ZooKeeperConnection Watcher:127.0.0.1:54814/solr got event WatchedEvent state:SyncConnected type:None path:null path:null type:None
   [junit4]   2> 606476 INFO  (TEST-CustomCollectionTest.test-seed#[54A1CA51B80AF88A]) [    ] o.a.s.c.c.ConnectionManager Client is connected to ZooKeeper
   [junit4]   2> 606476 INFO  (TEST-CustomCollectionTest.test-seed#[54A1CA51B80AF88A]) [    ] o.a.s.c.c.SolrZkClient Using default ZkACLProvider
   [junit4]   2> 606479 INFO  (TEST-CustomCollectionTest.test-seed#[54A1CA51B80AF88A]) [    ] o.a.s.s.SolrDispatchFilter Loading solr.xml from SolrHome (not found in ZooKeeper)
   [junit4]   2> 606479 INFO  (TEST-CustomCollectionTest.test-seed#[54A1CA51B80AF88A]) [    ] o.a.s.c.SolrXmlConfig Loading container configuration from /Users/jenkins/workspace/Lucene-Solr-6.x-MacOSX/solr/build/solr-core/test/J1/temp/solr.cloud.CustomCollectionTest_54A1CA51B80AF88A-001/shard-1-001/solr.xml
   [junit4]   2> 606494 INFO  (TEST-CustomCollectionTest.test-seed#[54A1CA51B80AF88A]) [    ] o.a.s.c.CorePropertiesLocator Config-defined core root directory: /Users/jenkins/workspace/Lucene-Solr-6.x-MacOSX/solr/build/solr-core/test/J1/../../../../../../../../../Users/jenkins/workspace/Lucene-Solr-6.x-MacOSX/solr/build/solr-core/test/J1/temp/solr.cloud.CustomCollectionTest_54A1CA51B80AF88A-001/shard-1-001/cores
   [junit4]   2> 606495 INFO  (TEST-CustomCollectionTest.test-seed#[54A1CA51B80AF88A]) [    ] o.a.s.c.CoreContainer New CoreContainer 1642268413
   [junit4]   2> 606495 INFO  (TEST-CustomCollectionTest.test-seed#[54A1CA51B80AF88A]) [    ] o.a.s.c.CoreContainer Loading cores into CoreContainer [instanceDir=/Users/jenkins/workspace/Lucene-Solr-6.x-MacOSX/solr/build/solr-core/test/J1/temp/solr.cloud.CustomCollectionTest_54A1CA51B80AF88A-001/shard-1-001]
   [junit4]   2> 606495 WARN  (TEST-CustomCollectionTest.test-seed#[54A1CA51B80AF88A]) [    ] o.a.s.c.CoreContainer Couldn't add files from /Users/jenkins/workspace/Lucene-Solr-6.x-MacOSX/solr/build/solr-core/test/J1/temp/solr.cloud.CustomCollectionTest_54A1CA51B80AF88A-001/shard-1-001/lib to classpath: /Users/jenkins/workspace/Lucene-Solr-6.x-MacOSX/solr/build/solr-core/test/J1/temp/solr.cloud.CustomCollectionTest_54A1CA51B80AF88A-001/shard-1-001/lib
   [junit4]   2> 606495 INFO  (TEST-CustomCollectionTest.test-seed#[54A1CA51B80AF88A]) [    ] o.a.s.h.c.HttpShardHandlerFactory created with socketTimeout : 90000,urlScheme : ,connTimeout : 15000,maxConnectionsPerHost : 20,maxConnections : 10000,corePoolSize : 0,maximumPoolSize : 2147483647,maxThreadIdleTime : 5,sizeOfQueue : -1,fairnessPolicy : false,useRetries : false,
   [junit4]   2> 606512 INFO  (TEST-CustomCollectionTest.test-seed#[54A1CA51B80AF88A]) [    ] o.a.s.u.UpdateShardHandler Creating UpdateShardHandler HTTP client with params: socketTimeout=340000&connTimeout=45000&retry=true
   [junit4]   2> 606513 INFO  (TEST-CustomCollectionTest.test-seed#[54A1CA51B80AF88A]) [    ] o.a.s.l.LogWatcher SLF4J impl is org.slf4j.impl.Log4jLoggerFactory
   [junit4]   2> 606513 INFO  (TEST-CustomCollectionTest.test-seed#[54A1CA51B80AF88A]) [    ] o.a.s.l.LogWatcher Registering Log Listener [Log4j (org.slf4j.impl.Log4jLoggerFactory)]
   [junit4]   2> 606513 INFO  (TEST-CustomCollectionTest.test-seed#[54A1CA51B80AF88A]) [    ] o.a.s.c.ZkContainer Zookeeper client=127.0.0.1:54814/solr
   [junit4]   2> 606513 INFO  (TEST-CustomCollectionTest.test-seed#[54A1CA51B80AF88A]) [    ] o.a.s.c.ZkController zkHost includes chroot
   [junit4]   2> 606513 INFO  (TEST-CustomCollectionTest.test-seed#[54A1CA51B80AF88A]) [    ] o.a.s.c.c.SolrZkClient Using default ZkCredentialsProvider
   [junit4]   2> 606518 INFO  (TEST-CustomCollectionTest.test-seed#[54A1CA51B80AF88A]) [    ] o.a.s.c.c.ConnectionManager Waiting for client to connect to ZooKeeper
   [junit4]   2> 606520 INFO  (zkCallback-745-thread-1) [    ] o.a.s.c.c.ConnectionManager Watcher org.apache.solr.common.cloud.ConnectionManager@3f8acb25 name:ZooKeeperConnection Watcher:127.0.0.1:54814 got event WatchedEvent state:SyncConnected type:None path:null path:null type:None
   [junit4]   2> 606521 INFO  (TEST-CustomCollectionTest.test-seed#[54A1CA51B80AF88A]) [    ] o.a.s.c.c.ConnectionManager Client is connected to ZooKeeper
   [junit4]   2> 606521 INFO  (TEST-CustomCollectionTest.test-seed#[54A1CA51B80AF88A]) [    ] o.a.s.c.c.SolrZkClient Using default ZkACLProvider
   [junit4]   2> 606524 INFO  (TEST-CustomCollectionTest.test-seed#[54A1CA51B80AF88A]) [n:127.0.0.1:54822_    ] o.a.s.c.ZkController Added new OnReconnect listener org.apache.solr.cloud.ZkController$$Lambda$11/2082288878@13a9960b
   [junit4]   2> 606531 INFO  (TEST-CustomCollectionTest.test-seed#[54A1CA51B80AF88A]) [n:127.0.0.1:54822_    ] o.a.s.c.c.ConnectionManager Waiting for client to connect to ZooKeeper
   [junit4]   2> 606532 INFO  (zkCallback-746-thread-1-processing-n:127.0.0.1:54822_) [n:127.0.0.1:54822_    ] o.a.s.c.c.ConnectionManager Watcher org.apache.solr.common.cloud.ConnectionManager@297f323e name:ZooKeeperConnection Watcher:127.0.0.1:54814/solr got event WatchedEvent state:SyncConnected type:None path:null path:null type:None
   [junit4]   2> 606533 INFO  (TEST-CustomCollectionTest.test-seed#[54A1CA51B80AF88A]) [n:127.0.0.1:54822_    ] o.a.s.c.c.ConnectionManager Client is connected to ZooKeeper
   [junit4]   2> 606550 INFO  (TEST-CustomCollectionTest.test-seed#[54A1CA51B80AF88A]) [n:127.0.0.1:54822_    ] o.a.s.c.c.ZkStateReader Updating cluster state from ZooKeeper... 
   [junit4]   2> 606553 INFO  (TEST-CustomCollectionTest.test-seed#[54A1CA51B80AF88A]) [n:127.0.0.1:54822_    ] o.a.s.c.c.ZkStateReader Updated live nodes from ZooKeeper... (0) -> (1)
   [junit4]   2> 606557 INFO  (TEST-CustomCollectionTest.test-seed#[54A1CA51B80AF88A]) [n:127.0.0.1:54822_    ] o.a.s.c.Overseer Overseer (id=null) closing
   [junit4]   2> 606558 INFO  (TEST-CustomCollectionTest.test-seed#[54A1CA51B80AF88A]) [n:127.0.0.1:54822_    ] o.a.s.c.LeaderElector Joined leadership election with path: /overseer_elect/election/95738574182547464-127.0.0.1:54822_-n_0000000001
   [junit4]   2> 606559 INFO  (TEST-CustomCollectionTest.test-seed#[54A1CA51B80AF88A]) [n:127.0.0.1:54822_    ] o.a.s.c.LeaderElector Watching path /overseer_elect/election/95738574182547460-127.0.0.1:54817_-n_0000000000 to know if I could be the leader
   [junit4]   2> 606560 INFO  (TEST-CustomCollectionTest.test-seed#[54A1CA51B80AF88A]) [n:127.0.0.1:54822_    ] o.a.s.c.ZkController Publish node=127.0.0.1:54822_ as DOWN
   [junit4]   2> 606563 INFO  (OverseerStateUpdate-95738574182547460-127.0.0.1:54817_-n_0000000000) [n:127.0.0.1:54817_    ] o.a.s.c.Overseer processMessage: queueSize: 1, message = {
   [junit4]   2>   "operation":"downnode",
   [junit4]   2>   "node_name":"127.0.0.1:54822_"} current state version: 3
   [junit4]   2> 606564 INFO  (OverseerStateUpdate-95738574182547460-127.0.0.1:54817_-n_0000000000) [n:127.0.0.1:54817_    ] o.a.s.c.o.NodeMutator DownNode state invoked for node: 127.0.0.1:54822_
   [junit4]   2> 606668 INFO  (zkCallback-741-thread-1) [    ] o.a.s.c.c.ZkStateReader A cluster state change: [WatchedEvent state:SyncConnected type:NodeDataChanged path:/clusterstate.json], has occurred - updating... (live nodes size: [1])
   [junit4]   2> 606668 INFO  (zkCallback-746-thread-1-processing-n:127.0.0.1:54822_) [n:127.0.0.1:54822_    ] o.a.s.c.c.ZkStateReader A cluster state change: [WatchedEvent state:SyncConnected type:NodeDataChanged path:/clusterstate.json], has occurred - updating... (live nodes size: [1])
   [junit4]   2> 606668 INFO  (zkCallback-739-thread-1-processing-n:127.0.0.1:54817_) [n:127.0.0.1:54817_    ] o.a.s.c.c.ZkStateReader A cluster state change: [WatchedEvent state:SyncConnected type:NodeDataChanged path:/clusterstate.json], has occurred - updating... (live nodes size: [1])
   [junit4]   2> 607565 INFO  (TEST-CustomCollectionTest.test-seed#[54A1CA51B80AF88A]) [n:127.0.0.1:54822_    ] o.a.s.c.ZkController Register node as live in ZooKeeper:/live_nodes/127.0.0.1:54822_
   [junit4]   2> 607566 INFO  (TEST-CustomCollectionTest.test-seed#[54A1CA51B80AF88A]) [n:127.0.0.1:54822_    ] o.a.s.c.c.SolrZkClient makePath: /live_nodes/127.0.0.1:54822_
   [junit4]   2> 607568 INFO  (zkCallback-746-thread-1-processing-n:127.0.0.1:54822_) [n:127.0.0.1:54822_    ] o.a.s.c.c.ZkStateReader A live node change: [WatchedEvent state:SyncConnected type:NodeChildrenChanged path:/live_nodes], has occurred - updating... (live nodes size: [1])
   [junit4]   2> 607569 INFO  (zkCallback-739-thread-1-processing-n:127.0.0.1:54817_) [n:127.0.0.1:54817_    ] o.a.s.c.c.ZkStateReader A live node change: [WatchedEvent state:SyncConnected type:NodeChildrenChanged path:/live_nodes], has occurred - updating... (live nodes size: [1])
   [junit4]   2> 607569 INFO  (zkCallback-741-thread-1) [    ] o.a.s.c.c.ZkStateReader A live node change: [WatchedEvent state:SyncConnected type:NodeChildrenChanged path:/live_nodes], has occurred - updating... (live nodes size: [1])
   [junit4]   2> 607575 INFO  (zkCallback-746-thread-1-processing-n:127.0.0.1:54822_) [n:127.0.0.1:54822_    ] o.a.s.c.c.ZkStateReader Updated live nodes from ZooKeeper... (1) -> (2)
   [junit4]   2> 607576 INFO  (zkCallback-739-thread-1-processing-n:127.0.0.1:54817_) [n:127.0.0.1:54817_    ] o.a.s.c.c.ZkStateReader Updated live nodes from ZooKeeper... (1) -> (2)
   [junit4]   2> 607576 INFO  (zkCallback-741-thread-1) [    ] o.a.s.c.c.ZkStateReader Updated live nodes from ZooKeeper... (1) -> (2)
   [junit4]   2> 607578 INFO  (TEST-CustomCollectionTest.test-seed#[54A1CA51B80AF88A]) [n:127.0.0.1:54822_    ] o.a.s.c.CoreContainer Security conf doesn't exist. Skipping setup for authorization module.
   [junit4]   2> 607578 INFO  (TEST-CustomCollectionTest.test-seed#[54A1CA51B80AF88A]) [n:127.0.0.1:54822_    ] o.a.s.c.CoreContainer No authentication plugin used.
   [junit4]   2> 607579 INFO  (TEST-CustomCollectionTest.test-seed#[54A1CA51B80AF88A]) [n:127.0.0.1:54822_    ] o.a.s.c.CorePropertiesLocator Looking for core definitions underneath /Users/jenkins/workspace/Lucene-Solr-6.x-MacOSX/solr/build/solr-core/test/J1/../../../../../../../../../Users/jenkins/workspace/Lucene-Solr-6.x-MacOSX/solr/build/solr-core/test/J1/temp/solr.cloud.CustomCollectionTest_54A1CA51B80AF88A-001/shard-1-001/cores
   [junit4]   2> 607581 INFO  (TEST-CustomCollectionTest.test-seed#[54A1CA51B80AF88A]) [n:127.0.0.1:54822_    ] o.a.s.c.CoreDescriptor Created CoreDescriptor: {name=collection1, config=solrconfig.xml, transient=false, schema=schema.xml, loadOnStartup=true, configSetProperties=configsetprops.json, collection=collection1, coreNodeName=, dataDir=data/, shard=}
   [junit4]   2> 607581 INFO  (TEST-CustomCollectionTest.test-seed#[54A1CA51B80AF88A]) [n:127.0.0.1:54822_    ] o.a.s.c.CorePropertiesLocator Found core collection1 in /Users/jenkins/workspace/Lucene-Solr-6.x-MacOSX/solr/build/solr-core/test/J1/../../../../../../../../../Users/jenkins/workspace/Lucene-Solr-6.x-MacOSX/solr/build/solr-core/test/J1/temp/solr.cloud.CustomCollectionTest_54A1CA51B80AF88A-001/shard-1-001/cores/collection1
   [junit4]   2> 607581 INFO  (TEST-CustomCollectionTest.test-seed#[54A1CA51B80AF88A]) [n:127.0.0.1:54822_    ] o.a.s.c.CorePropertiesLocator Found 1 core definitions
   [junit4]   2> 607583 INFO  (TEST-CustomCollectionTest.test-seed#[54A1CA51B80AF88A]) [n:127.0.0.1:54822_    ] o.a.s.s.SolrDispatchFilter user.dir=/Users/jenkins/workspace/Lucene-Solr-6.x-MacOSX/solr/build/solr-core/test/J1
   [junit4]   2> 607583 INFO  (TEST-CustomCollectionTest.test-seed#[54A1CA51B80AF88A]) [n:127.0.0.1:54822_    ] o.a.s.s.SolrDispatchFilter SolrDispatchFilter.init() done
   [junit4]   2> 607583 INFO  (coreLoadExecutor-2072-thread-1-processing-n:127.0.0.1:54822_) [n:127.0.0.1:54822_ c:collection1   x:collection1] o.a.s.c.ZkController publishing state=down
   [junit4]   2> 607583 INFO  (coreLoadExecutor-2072-thread-1-processing-n:127.0.0.1:54822_) [n:127.0.0.1:54822_ c:collection1   x:collection1] o.a.s.c.ZkController numShards not found on descriptor - reading it from system property
   [junit4]   2> 607586 INFO  (coreLoadExecutor-2072-thread-1-processing-n:127.0.0.1:54822_) [n:127.0.0.1:54822_ c:collection1   x:collection1] o.a.s.c.ZkController look for our core node name
   [junit4]   2> 607586 INFO  (OverseerStateUpdate-95738574182547460-127.0.0.1:54817_-n_0000000000) [n:127.0.0.1:54817_    ] o.a.s.c.Overseer processMessage: queueSize: 1, message = {
   [junit4]   2>   "core":"collection1",
   [junit4]   2>   "roles":null,
   [junit4]   2>   "base_url":"http://127.0.0.1:54822",
   [junit4]   2>   "node_name":"127.0.0.1:54822_",
   [junit4]   2>   "numShards":"2",
   [junit4]   2>   "state":"down",
   [junit4]   2>   "shard":null,
   [junit4]   2>   "collection":"collection1",
   [junit4]   2>   "operation":"state"} current state version: 4
   [junit4]   2> 607587 INFO  (OverseerStateUpdate-95738574182547460-127.0.0.1:54817_-n_0000000000) [n:127.0.0.1:54817_    ] o.a.s.c.o.ReplicaMutator Update state numShards=2 message={
   [junit4]   2>   "core":"collection1",
   [junit4]   2>   "roles":null,
   [junit4]   2>   "base_url":"http://127.0.0.1:54822",
   [junit4]   2>   "node_name":"127.0.0.1:54822_",
   [junit4]   2>   "numShards":"2",
   [junit4]   2>   "state":"down",
   [junit4]   2>   "shard":null,
   [junit4]   2>   "collection":"collection1",
   [junit4]   2>   "operation":"state"}
   [junit4]   2> 607587 INFO  (OverseerStateUpdate-95738574182547460-127.0.0.1:54817_-n_0000000000) [n:127.0.0.1:54817_    ] o.a.s.c.o.ClusterStateMutator building a new cName: collection1
   [junit4]   2> 607587 INFO  (OverseerStateUpdate-95738574182547460-127.0.0.1:54817_-n_0000000000) [n:127.0.0.1:54817_    ] o.a.s.c.o.ReplicaMutator Assigning new node to shard shard=shard2
   [junit4]   2> 607695 INFO  (zkCallback-739-thread-1-processing-n:127.0.0.1:54817_) [n:127.0.0.1:54817_    ] o.a.s.c.c.ZkStateReader A cluster state change: [WatchedEvent state:SyncConnected type:NodeDataChanged path:/clusterstate.json], has occurred - updating... (live nodes size: [2])
   [junit4]   2> 607695 INFO  (zkCallback-746-thread-1-processing-n:127.0.0.1:54822_) [n:127.0.0.1:54822_    ] o.a.s.c.c.ZkStateReader A cluster state change: [WatchedEvent state:SyncConnected type:NodeDataChanged path:/clusterstate.json], has occurred - updating... (live nodes size: [2])
   [junit4]   2> 607695 INFO  (zkCallback-741-thread-1) [    ] o.a.s.c.c.ZkStateReader A cluster state change: [WatchedEvent state:SyncConnected type:NodeDataChanged path:/clusterstate.json], has occurred - updating... (live nodes size: [2])
   [junit4]   2> 608587 INFO  (coreLoadExecutor-2072-thread-1-processing-n:127.0.0.1:54822_) [n:127.0.0.1:54822_ c:collection1   x:collection1] o.a.s.c.ZkController waiting to find shard id in clusterstate for collection1
   [junit4]   2> 608587 INFO  (coreLoadExecutor-2072-thread-1-processing-n:127.0.0.1:54822_) [n:127.0.0.1:54822_ c:collection1   x:collection1] o.a.s.c.ZkController Check for collection zkNode:collection1
   [junit4]   2> 608588 INFO  (coreLoadExecutor-2072-thread-1-processing-n:127.0.0.1:54822_) [n:127.0.0.1:54822_ c:collection1   x:collection1] o.a.s.c.ZkController Collection zkNode exists
   [junit4]   2> 608588 INFO  (coreLoadExecutor-2072-thread-1-processing-n:127.0.0.1:54822_) [n:127.0.0.1:54822_ c:collection1   x:collection1] o.a.s.c.c.ZkStateReader Load collection config from: [/collections/collection1]
   [junit4]   2> 608590 INFO  (coreLoadExecutor-2072-thread-1-processing-n:127.0.0.1:54822_) [n:127.0.0.1:54822_ c:collection1   x:collection1] o.a.s.c.c.ZkStateReader path=[/collections/collection1] [configName]=[conf1] specified config exists in ZooKeeper
   [junit4]   2> 608590 INFO  (coreLoadExecutor-2072-thread-1-processing-n:127.0.0.1:54822_) [n:127.0.0.1:54822_ c:collection1   x:collection1] o.a.s.c.SolrResourceLoader new SolrResourceLoader for directory: '/Users/jenkins/workspace/Lucene-Solr-6.x-MacOSX/solr/build/solr-core/test/J1/temp/solr.cloud.CustomCollectionTest_54A1CA51B80AF88A-001/shard-1-001/cores/collection1'
   [junit4]   2> 608590 INFO  (coreLoadExecutor-2072-thread-1-processing-n:127.0.0.1:54822_) [n:127.0.0.1:54822_ c:collection1   x:collection1] o.a.s.c.SolrResourceLoader JNDI not configured for solr (NoInitialContextEx)
   [junit4]   2> 608590 INFO  (coreLoadExecutor-2072-thread-1-processing-n:127.0.0.1:54822_) [n:127.0.0.1:54822_ c:collection1   x:collection1] o.a.s.c.SolrResourceLoader solr home defaulted to 'solr/' (could not find system property or JNDI)
   [junit4]   2> 608593 INFO  (coreLoadExecutor-2072-thread-1-processing-n:127.0.0.1:54822_) [n:127.0.0.1:54822_ c:collection1   x:collection1] o.a.s.c.Config loaded config solrconfig.xml with version 0 
   [junit4]   2> 608599 INFO  (coreLoadExecutor-2072-thread-1-processing-n:127.0.0.1:54822_) [n:127.0.0.1:54822_ c:collection1   x:collection1] o.a.s.c.SolrConfig current version of requestparams : -1
   [junit4]   2> 608603 INFO  (coreLoadExecutor-2072-thread-1-processing-n:127.0.0.1:54822_) [n:127.0.0.1:54822_ c:collection1   x:collection1] o.a.s.c.SolrConfig Using Lucene MatchVersion: 6.1.0
   [junit4]   2> 608609 INFO  (coreLoadExecutor-2072-thread-1-processing-n:127.0.0.1:54822_) [n:127.0.0.1:54822_ c:collection1   x:collection1] o.a.s.c.SolrConfig Loaded SolrConfig: solrconfig.xml
   [junit4]   2> 608622 INFO  (coreLoadExecutor-2072-thread-1-processing-n:127.0.0.1:54822_) [n:127.0.0.1:54822_ c:collection1   x:collection1] o.a.s.s.IndexSchema [collection1] Schema name=test
   [junit4]   2> 608713 INFO  (coreLoadExecutor-2072-thread-1-processing-n:127.0.0.1:54822_) [n:127.0.0.1:54822_ c:collection1   x:collection1] o.a.s.s.OpenExchangeRatesOrgProvider Initialized with rates=open-exchange-rates.json, refreshInterval=1440.
   [junit4]   2> 608721 INFO  (coreLoadExecutor-2072-thread-1-processing-n:127.0.0.1:54822_) [n:127.0.0.1:54822_ c:collection1   x:collection1] o.a.s.s.IndexSchema default search field in schema is text
   [junit4]   2> 608723 INFO  (coreLoadExecutor-2072-thread-1-processing-n:127.0.0.1:54822_) [n:127.0.0.1:54822_ c:collection1   x:collection1] o.a.s.s.IndexSchema unique key field: id
   [junit4]   2> 608736 INFO  (coreLoadExecutor-2072-thread-1-processing-n:127.0.0.1:54822_) [n:127.0.0.1:54822_ c:collection1   x:collection1] o.a.s.s.FileExchangeRateProvider Reloading exchange rates from file currency.xml
   [junit4]   2> 608739 INFO  (coreLoadExecutor-2072-thread-1-processing-n:127.0.0.1:54822_) [n:127.0.0.1:54822_ c:collection1   x:collection1] o.a.s.s.FileExchangeRateProvider Reloading exchange rates from file currency.xml
   [junit4]   2> 608741 INFO  (coreLoadExecutor-2072-thread-1-processing-n:127.0.0.1:54822_) [n:127.0.0.1:54822_ c:collection1   x:collection1] o.a.s.s.OpenExchangeRatesOrgProvider Reloading exchange rates from open-exchange-rates.json
   [junit4]   2> 608743 INFO  (coreLoadExecutor-2072-thread-1-processing-n:127.0.0.1:54822_) [n:127.0.0.1:54822_ c:collection1   x:collection1] o.a.s.s.OpenExchangeRatesOrgProvider Reloading exchange rates from open-exchange-rates.json
   [junit4]   2> 608746 INFO  (coreLoadExecutor-2072-thread-1-processing-n:127.0.0.1:54822_) [n:127.0.0.1:54822_ c:collection1   x:collection1] o.a.s.c.ConfigSetProperties Did not find ConfigSet properties, assuming default properties: Can't find resource 'configsetprops.json' in classpath or '/configs/conf1', cwd=/Users/jenkins/workspace/Lucene-Solr-6.x-MacOSX/solr/build/solr-core/test/J1
   [junit4]   2> 608746 INFO  (coreLoadExecutor-2072-thread-1-processing-n:127.0.0.1:54822_) [n:127.0.0.1:54822_ c:collection1   x:collection1] o.a.s.c.CoreContainer Creating SolrCore 'collection1' using configuration from collection collection1
   [junit4]   2> 608746 INFO  (coreLoadExecutor-2072-thread-1-processing-n:127.0.0.1:54822_) [n:127.0.0.1:54822_ c:collection1 s:shard2 r:core_node1 x:collection1] o.a.s.c.SolrCore org.apache.solr.core.MockDirectoryFactory
   [junit4]   2> 608746 INFO  (coreLoadExecutor-2072-thread-1-processing-n:127.0.0.1:54822_) [n:127.0.0.1:54822_ c:collection1 s:shard2 r:core_node1 x:collection1] o.a.s.c.SolrCore [[collection1] ] Opening new SolrCore at [/Users/jenkins/workspace/Lucene-Solr-6.x-MacOSX/solr/build/solr-core/test/J1/temp/solr.cloud.CustomCollectionTest_54A1CA51B80AF88A-001/shard-1-001/cores/collection1], dataDir=[/Users/jenkins/workspace/Lucene-Solr-6.x-MacOSX/solr/build/solr-core/test/J1/../../../../../../../../../Users/jenkins/workspace/Lucene-Solr-6.x-MacOSX/solr/build/solr-core/test/J1/temp/solr.cloud.CustomCollectionTest_54A1CA51B80AF88A-001/shard-1-001/cores/collection1/data/]
   [junit4]   2> 608746 INFO  (coreLoadExecutor-2072-thread-1-processing-n:127.0.0.1:54822_) [n:127.0.0.1:54822_ c:collection1 s:shard2 r:core_node1 x:collection1] o.a.s.c.JmxMonitoredMap JMX monitoring is enabled. Adding Solr mbeans to JMX Server: com.sun.jmx.mbeanserver.JmxMBeanServer@46015a1c
   [junit4]   2> 608747 INFO  (coreLoadExecutor-2072-thread-1-processing-n:127.0.0.1:54822_) [n:127.0.0.1:54822_ c:collection1 s:shard2 r:core_node1 x:collection1] o.a.s.c.CachingDirectoryFactory return new directory for /Users/jenkins/workspace/Lucene-Solr-6.x-MacOSX/solr/build/solr-core/test/J1/../../../../../../../../../Users/jenkins/workspace/Lucene-Solr-6.x-MacOSX/solr/build/solr-core/test/J1/temp/solr.cloud.CustomCollectionTest_54A1CA51B80AF88A-001/shard-1-001/cores/collection1/data
   [junit4]   2> 608747 INFO  (coreLoadExecutor-2072-thread-1-processing-n:127.0.0.1:54822_) [n:127.0.0.1:54822_ c:collection1 s:shard2 r:core_node1 x:collection1] o.a.s.c.SolrCore New index directory detected: old=null new=/Users/jenkins/workspace/Lucene-Solr-6.x-MacOSX/solr/build/solr-core/test/J1/../../../../../../../../../Users/jenkins/workspace/Lucene-Solr-6.x-MacOSX/solr/build/solr-core/test/J1/temp/solr.cloud.CustomCollectionTest_54A1CA51B80AF88A-001/shard-1-001/cores/collection1/data/index/
   [junit4]   2> 608747 WARN  (coreLoadExecutor-2072-thread-1-processing-n:127.0.0.1:54822_) [n:127.0.0.1:54822_ c:collection1 s:shard2 r:core_node1 x:collection1] o.a.s.c.SolrCore [collection1] Solr index directory '/Users/jenkins/workspace/Lucene-Solr-6.x-MacOSX/solr/build/solr-core/test/J1/../../../../../../../../../Users/jenkins/workspace/Lucene-Solr-6.x-MacOSX/solr/build/solr-core/test/J1/temp/solr.cloud.CustomCollectionTest_54A1CA51B80AF88A-001/shard-1-001/cores/collection1/data/index' doesn't exist. Creating new index...
   [junit4]   2> 608747 INFO  (coreLoadExecutor-2072-thread-1-processing-n:127.0.0.1:54822_) [n:127.0.0.1:54822_ c:collection1 s:shard2 r:core_node1 x:collection1] o.a.s.c.CachingDirectoryFactory return new directory for /Users/jenkins/workspace/Lucene-Solr-6.x-MacOSX/solr/build/solr-core/test/J1/../../../../../../../../../Users/jenkins/workspace/Lucene-Solr-6.x-MacOSX/solr/build/solr-core/test/J1/temp/solr.cloud.CustomCollectionTest_54A1CA51B80AF88A-001/shard-1-001/cores/collection1/data/index
   [junit4]   2> 608748 INFO  (coreLoadExecutor-2072-thread-1-processing-n:127.0.0.1:54822_) [n:127.0.0.1:54822_ c:collection1 s:shard2 r:core_node1 x:collection1] o.a.s.u.RandomMergePolicy RandomMergePolicy wrapping class org.apache.lucene.index.LogByteSizeMergePolicy: [LogByteSizeMergePolicy: minMergeSize=1677721, mergeFactor=41, maxMergeSize=2147483648, maxMergeSizeForForcedMerge=9223372036854775807, calibrateSizeByDeletes=true, maxMergeDocs=2147483647, maxCFSSegmentSizeMB=8.796093022207999E12, noCFSRatio=0.5267959904182583]
   [junit4]   2> 608748 INFO  (coreLoadExecutor-2072-thread-1-processing-n:127.0.0.1:54822_) [n:127.0.0.1:54822_ c:collection1 s:shard2 r:core_node1 x:collection1] o.a.s.c.SolrDeletionPolicy SolrDele

[...truncated too long message...]

eate/delete watches above limit:
   [junit4]   2> 
   [junit4]   2> 	10	/solr/aliases.json
   [junit4]   2> 	5	/solr/security.json
   [junit4]   2> 	5	/solr/configs/conf1
   [junit4]   2> 
   [junit4]   2> Maximum concurrent data watches above limit:
   [junit4]   2> 
   [junit4]   2> 	10	/solr/clusterstate.json
   [junit4]   2> 	3	/solr/collections/implicitcoll3/leader_elect/b/election/95738574182547470-core_node1-n_0000000000
   [junit4]   2> 	3	/solr/collections/implicitcoll0/leader_elect/b/election/95738574182547470-core_node5-n_0000000000
   [junit4]   2> 	3	/solr/collections/implicitcoll2/leader_elect/x/election/95738574182547467-core_node20-n_0000000001
   [junit4]   2> 	2	/solr/collections/implicitcoll3/leader_elect/b/election/95738574182547464-core_node5-n_0000000001
   [junit4]   2> 	2	/solr/collections/implicitcoll2/leader_elect/a/election/95738574182547470-core_node3-n_0000000000
   [junit4]   2> 	2	/solr/collections/implicitcoll5/leader_elect/b/election/95738574182547467-core_node3-n_0000000001
   [junit4]   2> 	2	/solr/collections/implicitcollwithShardField/leader_elect/c/election/95738574182547470-core_node17-n_0000000001
   [junit4]   2> 	2	/solr/collections/implicitcoll0/leader_elect/a/election/95738574182547470-core_node10-n_0000000000
   [junit4]   2> 	2	/solr/collections/implicitcoll5/leader_elect/b/election/95738574182547473-core_node2-n_0000000000
   [junit4]   2> 	2	/solr/collections/implicitcoll4/leader_elect/b/election/95738574182547467-core_node13-n_0000000001
   [junit4]   2> 	2	/solr/collections/implicitcoll4/leader_elect/b/election/95738574182547470-core_node6-n_0000000000
   [junit4]   2> 	2	/solr/collections/implicitcoll0/leader_elect/c/election/95738574182547473-core_node4-n_0000000001
   [junit4]   2> 	2	/solr/collections/implicitcollwithShardField/leader_elect/c/election/95738574182547464-core_node16-n_0000000002
   [junit4]   2> 	2	/solr/collections/implicitcollwithShardField/leader_elect/b/election/95738574182547470-core_node15-n_0000000002
   [junit4]   2> 	2	/solr/collections/implicitcoll1/leader_elect/a/election/95738574182547473-core_node11-n_0000000000
   [junit4]   2> 	2	/solr/collections/implicitcoll1/leader_elect/a/election/95738574182547470-core_node13-n_0000000002
   [junit4]   2> 	2	/solr/collections/implicitcollwithShardField/leader_elect/a/election/95738574182547473-core_node1-n_0000000000
   [junit4]   2> 	2	/solr/collections/implicitcoll2/leader_elect/b/election/95738574182547473-core_node6-n_0000000000
   [junit4]   2> 	2	/solr/collections/implicitcollwithShardField/leader_elect/b/election/95738574182547473-core_node3-n_0000000000
   [junit4]   2> 	2	/solr/collections/implicitcoll5/leader_elect/a/election/95738574182547473-core_node1-n_0000000001
   [junit4]   2> 	2	/solr/collections/implicitcoll2/leader_elect/x/election/95738574182547473-core_node18-n_0000000000
   [junit4]   2> 	2	/solr/collections/implicitcoll3/leader_elect/c/election/95738574182547473-core_node2-n_0000000001
   [junit4]   2> 
   [junit4]   2> Maximum concurrent children watches above limit:
   [junit4]   2> 
   [junit4]   2> 	10	/solr/live_nodes
   [junit4]   2> 	10	/solr/collections
   [junit4]   2> 	5	/solr/overseer/queue
   [junit4]   2> 	5	/solr/overseer/collection-queue-work
   [junit4]   2> 	3	/solr/overseer/queue-work
   [junit4]   2> 
   [junit4]   2> NOTE: reproduce with: ant test  -Dtestcase=CustomCollectionTest -Dtests.method=test -Dtests.seed=54A1CA51B80AF88A -Dtests.slow=true -Dtests.locale=ar-AE -Dtests.timezone=Africa/Gaborone -Dtests.asserts=true -Dtests.file.encoding=UTF-8
   [junit4] ERROR    208s J1 | CustomCollectionTest.test <<<
   [junit4]    > Throwable #1: org.apache.solr.client.solrj.impl.HttpSolrClient$RemoteSolrException: Error from server at http://127.0.0.1:54847: collection already exists: implicitcollwithShardField
   [junit4]    > 	at __randomizedtesting.SeedInfo.seed([54A1CA51B80AF88A:DCF5F58B16F69572]:0)
   [junit4]    > 	at org.apache.solr.client.solrj.impl.HttpSolrClient.executeMethod(HttpSolrClient.java:590)
   [junit4]    > 	at org.apache.solr.client.solrj.impl.HttpSolrClient.request(HttpSolrClient.java:259)
   [junit4]    > 	at org.apache.solr.client.solrj.impl.HttpSolrClient.request(HttpSolrClient.java:248)
   [junit4]    > 	at org.apache.solr.client.solrj.impl.LBHttpSolrClient.doRequest(LBHttpSolrClient.java:404)
   [junit4]    > 	at org.apache.solr.client.solrj.impl.LBHttpSolrClient.request(LBHttpSolrClient.java:357)
   [junit4]    > 	at org.apache.solr.client.solrj.impl.CloudSolrClient.sendRequest(CloudSolrClient.java:1192)
   [junit4]    > 	at org.apache.solr.client.solrj.impl.CloudSolrClient.requestWithRetryOnStaleState(CloudSolrClient.java:962)
   [junit4]    > 	at org.apache.solr.client.solrj.impl.CloudSolrClient.request(CloudSolrClient.java:898)
   [junit4]    > 	at org.apache.solr.client.solrj.SolrClient.request(SolrClient.java:1219)
   [junit4]    > 	at org.apache.solr.cloud.AbstractFullDistribZkTestBase.createCollection(AbstractFullDistribZkTestBase.java:1595)
   [junit4]    > 	at org.apache.solr.cloud.AbstractFullDistribZkTestBase.createCollection(AbstractFullDistribZkTestBase.java:1549)
   [junit4]    > 	at org.apache.solr.cloud.CustomCollectionTest.testCustomCollectionsAPI(CustomCollectionTest.java:285)
   [junit4]    > 	at org.apache.solr.cloud.CustomCollectionTest.test(CustomCollectionTest.java:99)
   [junit4]    > 	at org.apache.solr.BaseDistributedSearchTestCase$ShardsRepeatRule$ShardsFixedStatement.callStatement(BaseDistributedSearchTestCase.java:992)
   [junit4]    > 	at org.apache.solr.BaseDistributedSearchTestCase$ShardsRepeatRule$ShardsStatement.evaluate(BaseDistributedSearchTestCase.java:967)
   [junit4]    > 	at java.lang.Thread.run(Thread.java:745)
   [junit4]   2> 811783 INFO  (SUITE-CustomCollectionTest-seed#[54A1CA51B80AF88A]-worker) [    ] o.a.s.SolrTestCaseJ4 ###deleteCore
   [junit4]   2> NOTE: leaving temporary files on disk at: /Users/jenkins/workspace/Lucene-Solr-6.x-MacOSX/solr/build/solr-core/test/J1/temp/solr.cloud.CustomCollectionTest_54A1CA51B80AF88A-001
   [junit4]   2> NOTE: test params are: codec=Asserting(Lucene60): {other_tl1=PostingsFormat(name=MockRandom), range_facet_l_dv=PostingsFormat(name=LuceneFixedGap), multiDefault=PostingsFormat(name=Asserting), intDefault=PostingsFormat(name=MockRandom), a_i1=PostingsFormat(name=Asserting), range_facet_l=PostingsFormat(name=Asserting), _version_=PostingsFormat(name=MockRandom), a_t=PostingsFormat(name=Asserting), id=PostingsFormat(name=LuceneFixedGap), range_facet_i_dv=PostingsFormat(name=Asserting), text=FSTOrd50, _route_=FSTOrd50, timestamp=PostingsFormat(name=Asserting)}, docValues:{range_facet_l_dv=DocValuesFormat(name=Lucene54), range_facet_i_dv=DocValuesFormat(name=Asserting), timestamp=DocValuesFormat(name=Asserting)}, maxPointsInLeafNode=1282, maxMBSortInHeap=4.075486897378523, sim=ClassicSimilarity, locale=ar-AE, timezone=Africa/Gaborone
   [junit4]   2> NOTE: Mac OS X 10.11.4 x86_64/Oracle Corporation 1.8.0_72 (64-bit)/cpus=3,threads=1,free=109605376,total=518979584
   [junit4]   2> NOTE: All tests run in this JVM: [TestConfigSetProperties, CdcrVersionReplicationTest, TestBinaryResponseWriter, TestOrdValues, TestCustomSort, BufferStoreTest, HdfsDirectoryFactoryTest, SuggestComponentTest, TestSolrQueryResponse, HighlighterConfigTest, TestConfigSetsAPI, DateMathParserTest, TestShardHandlerFactory, TestSuggestSpellingConverter, TestZkChroot, TestScoreJoinQPScore, TestFiltering, TestSolrIndexConfig, FullSolrCloudDistribCmdsTest, TestSQLHandler, TestSchemaVersionResource, TestPerFieldSimilarityWithDefaultOverride, TestRandomFaceting, SegmentsInfoRequestHandlerTest, CollectionReloadTest, DefaultValueUpdateProcessorTest, BinaryUpdateRequestHandlerTest, DirectoryFactoryTest, TestReloadDeadlock, TestOmitPositions, SpellingQueryConverterTest, TestTestInjection, TestCoreDiscovery, AtomicUpdatesTest, TestAddFieldRealTimeGet, FileUtilsTest, TestDynamicFieldResource, ConfigSetsAPITest, TestIndexSearcher, TestExclusionRuleCollectionAccess, InfoHandlerTest, RAMDirectoryFactoryTest, TestSolrJ, TestRealTimeGet, SuggesterTest, FieldAnalysisRequestHandlerTest, DistributedFacetPivotSmallTest, TestTrackingShardHandlerFactory, TestFuzzyAnalyzedSuggestions, TestTrie, TestCloudSchemaless, DistributedSuggestComponentTest, TestCharFilters, TestRestManager, TestRecovery, CursorMarkTest, TolerantUpdateProcessorTest, TestJettySolrRunner, TestSolr4Spatial2, ZkSolrClientTest, TestSolrCoreProperties, DistributedQueryComponentCustomSortTest, StressHdfsTest, BadIndexSchemaTest, SolrInfoMBeanTest, ConjunctionSolrSpellCheckerTest, TestQueryTypes, CustomCollectionTest]
   [junit4] Completed [131/587 (1!)] on J1 in 207.88s, 1 test, 1 error <<< FAILURES!

[...truncated 1491 lines...]
BUILD FAILED
/Users/jenkins/workspace/Lucene-Solr-6.x-MacOSX/build.xml:740: The following error occurred while executing this line:
/Users/jenkins/workspace/Lucene-Solr-6.x-MacOSX/build.xml:684: The following error occurred while executing this line:
/Users/jenkins/workspace/Lucene-Solr-6.x-MacOSX/build.xml:59: The following error occurred while executing this line:
/Users/jenkins/workspace/Lucene-Solr-6.x-MacOSX/solr/build.xml:233: The following error occurred while executing this line:
/Users/jenkins/workspace/Lucene-Solr-6.x-MacOSX/solr/common-build.xml:529: The following error occurred while executing this line:
/Users/jenkins/workspace/Lucene-Solr-6.x-MacOSX/lucene/common-build.xml:1457: The following error occurred while executing this line:
/Users/jenkins/workspace/Lucene-Solr-6.x-MacOSX/lucene/common-build.xml:1014: There were test failures: 587 suites (10 ignored), 2366 tests, 1 error, 119 ignored (69 assumptions) [seed: 54A1CA51B80AF88A]

Total time: 89 minutes 42 seconds
Build step 'Invoke Ant' marked build as failure
Archiving artifacts
[WARNINGS] Skipping publisher since build result is FAILURE
Recording test results
Email was triggered for: Failure - Any
Sending email for trigger: Failure - Any