You are viewing a plain text version of this content. The canonical link for it is here.
Posted to builds@solr.apache.org by Apache Jenkins Server <je...@builds.apache.org> on 2021/11/11 09:03:55 UTC
[JENKINS] Solr » Solr-Check-main - Build # 1937 - Failure!
Build: https://ci-builds.apache.org/job/Solr/job/Solr-Check-main/1937/
All tests passed
Build Log:
[...truncated 708 lines...]
ERROR: Error installing /home/jenkins/.gradle/caches/modules-2/files-2.1/rubygems/http_parser.rb/0.8.0/8aa1092bbc1f10fd9622224babf2b2a98d4d4b22/http_parser.rb-0.8.0.gem:
ERROR: Failed to build gem native extension.
current directory: /home/jenkins/jenkins-slave/workspace/Solr/Solr-Check-main/solr/solr-ref-guide/build/.gems/gems/http_parser.rb-0.8.0/ext/ruby_http_parser
/usr/local/asfpackages/java/oraclejdk-11.0.11/bin/java -cp :/home/jenkins/.gradle/caches/modules-2/files-2.1/org.jruby/jruby-complete/9.2.9.0/8e44ce7a1417966d89957bd766a148601e28828b/jruby-complete-9.2.9.0.jar org.jruby.Main -r ./siteconf20211111-3140105-3po9z4.rb extconf.rb
WARNING: An illegal reflective access operation has occurred
WARNING: Illegal reflective access by com.headius.backport9.modules.Modules (file:/home/jenkins/.gradle/caches/modules-2/files-2.1/org.jruby/jruby-complete/9.2.9.0/8e44ce7a1417966d89957bd766a148601e28828b/jruby-complete-9.2.9.0.jar) to method sun.nio.ch.NativeThread.signal(long)
WARNING: Please consider reporting this to the maintainers of com.headius.backport9.modules.Modules
WARNING: Use --illegal-access=warn to enable warnings of further illegal reflective access operations
WARNING: All illegal access operations will be denied in a future release
creating Makefile
current directory: /home/jenkins/jenkins-slave/workspace/Solr/Solr-Check-main/solr/solr-ref-guide/build/.gems/gems/http_parser.rb-0.8.0/ext/ruby_http_parser
make "DESTDIR=" clean
Makefile:225: *** multiple target patterns. Stop.
current directory: /home/jenkins/jenkins-slave/workspace/Solr/Solr-Check-main/solr/solr-ref-guide/build/.gems/gems/http_parser.rb-0.8.0/ext/ruby_http_parser
make "DESTDIR="
Makefile:225: *** multiple target patterns. Stop.
make failed, exit code 2
Gem files will remain installed in /home/jenkins/jenkins-slave/workspace/Solr/Solr-Check-main/solr/solr-ref-guide/build/.gems/gems/http_parser.rb-0.8.0 for inspection.
Results logged to /home/jenkins/jenkins-slave/workspace/Solr/Solr-Check-main/solr/solr-ref-guide/build/.gems/extensions/universal-java-11/2.5.0/http_parser.rb-0.8.0/gem_make.out
Successfully installed eventmachine-1.2.7-java
Successfully installed public_suffix-4.0.6
Successfully installed temple-0.8.2
Successfully installed asciidoctor-2.0.16
Successfully installed safe_yaml-1.0.5
Successfully installed rouge-3.26.1
Successfully installed pathutil-0.16.2
Successfully installed mercenary-0.3.6
Successfully installed liquid-4.0.3
Successfully installed kramdown-2.3.1
Successfully installed jekyll-watch-2.2.1
Successfully installed jekyll-sass-converter-1.5.2
Successfully installed em-websocket-0.5.3
Successfully installed colorator-1.1.0
Successfully installed addressable-2.8.0
Successfully installed concurrent-ruby-1.1.9
Successfully installed i18n-0.9.5
Successfully installed tilt-2.0.10
Successfully installed slim-4.1.0
Successfully installed jekyll-3.9.1
Successfully installed jekyll-asciidoc-3.0.0
29 gems installed
> Task :solr:solr-ref-guide:jrubyPrepare FAILED
> Task :solr:solr-ref-guide:prepareLocalJavadocLinksSiteSources
Syncing source files to /home/jenkins/jenkins-slave/workspace/Solr/Solr-Check-main/solr/solr-ref-guide/build/local-jdoc-links-site-content using props:
htmlOutDir -> ../local-jdoc-links-site
javadocLink -> https://docs.oracle.com/en/java/javase/11/docs/api/java.base/
solrGuideDraftStatus -> DRAFT
solrRootPath -> /home/jenkins/jenkins-slave/workspace/Solr/Solr-Check-main/solr/
solrDocsVersion -> 9.0
solrGuideVersionPath -> 9_0
buildDate -> 2021-11-11
buildYear -> 2021
htmlSolrJavadocs -> link:../../../documentation/build/site
htmlLuceneJavadocs -> link:../../../documentation/build/lucene-javadocs
ivyCommonsCodec -> 1.13
ivyDropwizardMetrics -> 4.1.5
ivyHadoop -> 3.2.0
ivyLog4j -> 2.14.1
ivyOpennlpTools -> 1.9.1
ivyTika -> 1.27
ivyZookeeper -> 3.7.0
Building up tree of all known pages
WARNING: An illegal reflective access operation has occurred
WARNING: Illegal reflective access by org.jruby.util.SecurityHelper (file:/home/jenkins/.gradle/caches/modules-2/files-2.1/org.jruby/jruby-core/9.2.6.0/653601d48b38528e76840c6eac1ae46e2dae1a74/jruby-core-9.2.6.0.jar) to field java.lang.reflect.Field.modifiers
WARNING: Please consider reporting this to the maintainers of org.jruby.util.SecurityHelper
WARNING: Use --illegal-access=warn to enable warnings of further illegal reflective access operations
WARNING: All illegal access operations will be denied in a future release
Looping over pages to build nav data
Creating /home/jenkins/jenkins-slave/workspace/Solr/Solr-Check-main/solr/solr-ref-guide/build/local-jdoc-links-site-content/_data/scrollnav.json
Creating /home/jenkins/jenkins-slave/workspace/Solr/Solr-Check-main/solr/solr-ref-guide/build/local-jdoc-links-site-content/_data/sidebar.json
> Task :solr:solr-ref-guide:prepareSiteSources
Syncing source files to /home/jenkins/jenkins-slave/workspace/Solr/Solr-Check-main/solr/solr-ref-guide/build/html-site-content using props:
htmlOutDir -> ../html-site
javadocLink -> https://docs.oracle.com/en/java/javase/11/docs/api/java.base/
solrGuideDraftStatus -> DRAFT
solrRootPath -> /home/jenkins/jenkins-slave/workspace/Solr/Solr-Check-main/solr/
solrDocsVersion -> 9.0
solrGuideVersionPath -> 9_0
buildDate -> 2021-11-11
buildYear -> 2021
htmlSolrJavadocs -> https://solr.apache.org/docs/9_0_0/
htmlLuceneJavadocs -> https://lucene.apache.org/core/9_0_0-prerelease9
ivyCommonsCodec -> 1.13
ivyDropwizardMetrics -> 4.1.5
ivyHadoop -> 3.2.0
ivyLog4j -> 2.14.1
ivyOpennlpTools -> 1.9.1
ivyTika -> 1.27
ivyZookeeper -> 3.7.0
Building up tree of all known pages
WARNING: An illegal reflective access operation has occurred
WARNING: Illegal reflective access by org.jruby.util.SecurityHelper (file:/home/jenkins/.gradle/caches/modules-2/files-2.1/org.jruby/jruby-core/9.2.6.0/653601d48b38528e76840c6eac1ae46e2dae1a74/jruby-core-9.2.6.0.jar) to field java.lang.reflect.Field.modifiers
WARNING: Please consider reporting this to the maintainers of org.jruby.util.SecurityHelper
WARNING: Use --illegal-access=warn to enable warnings of further illegal reflective access operations
WARNING: All illegal access operations will be denied in a future release
Looping over pages to build nav data
Creating /home/jenkins/jenkins-slave/workspace/Solr/Solr-Check-main/solr/solr-ref-guide/build/html-site-content/_data/scrollnav.json
Creating /home/jenkins/jenkins-slave/workspace/Solr/Solr-Check-main/solr/solr-ref-guide/build/html-site-content/_data/sidebar.json
> Task :solr:solr-ref-guide:test NO-SOURCE
> Task :solr:solr-ref-guide:wipeTaskTemp
> Task :solr:solrj:test
:solr:solrj:test (SUCCESS): 1705 test(s), 25 skipped
> Task :solr:solrj:wipeTaskTemp
> Task :solr:solrj:check
> Task :solr:test-framework:test
:solr:test-framework:test (SUCCESS): 15 test(s)
> Task :solr:test-framework:wipeTaskTemp
> Task :solr:test-framework:check
> Task :solr:webapp:test NO-SOURCE
> Task :solr:webapp:wipeTaskTemp
> Task :solr:webapp:check
> Task :solr:contrib:analysis-extras:test
:solr:contrib:analysis-extras:test (SUCCESS): 30 test(s)
> Task :solr:contrib:analysis-extras:wipeTaskTemp
> Task :solr:contrib:analysis-extras:check
> Task :solr:contrib:analytics:test
:solr:contrib:analytics:test (SUCCESS): 472 test(s)
> Task :solr:contrib:analytics:wipeTaskTemp
> Task :solr:contrib:analytics:check
> Task :solr:contrib:clustering:test
:solr:contrib:clustering:test (SUCCESS): 15 test(s)
> Task :solr:contrib:clustering:wipeTaskTemp
> Task :solr:contrib:clustering:check
> Task :solr:contrib:extraction:test
:solr:contrib:extraction:test (SUCCESS): 20 test(s)
> Task :solr:contrib:extraction:wipeTaskTemp
> Task :solr:contrib:extraction:check
> Task :solr:contrib:gcs-repository:test
:solr:contrib:gcs-repository:test (SUCCESS): 13 test(s), 10 skipped
> Task :solr:contrib:gcs-repository:wipeTaskTemp
> Task :solr:contrib:gcs-repository:check
> Task :solr:contrib:jaegertracer-configurator:test
:solr:contrib:jaegertracer-configurator:test (SUCCESS): 1 test(s)
> Task :solr:contrib:jaegertracer-configurator:wipeTaskTemp
> Task :solr:contrib:jaegertracer-configurator:check
> Task :solr:contrib:langid:test
:solr:contrib:langid:test (SUCCESS): 43 test(s)
> Task :solr:contrib:langid:wipeTaskTemp
> Task :solr:contrib:langid:check
> Task :solr:contrib:ltr:test
:solr:contrib:ltr:test (SUCCESS): 164 test(s)
> Task :solr:contrib:ltr:wipeTaskTemp
> Task :solr:contrib:ltr:check
> Task :solr:contrib:prometheus-exporter:test
:solr:contrib:prometheus-exporter:test (SUCCESS): 20 test(s)
> Task :solr:contrib:prometheus-exporter:wipeTaskTemp
> Task :solr:contrib:prometheus-exporter:check
> Task :solr:contrib:s3-repository:test
:solr:contrib:s3-repository:test (SUCCESS): 42 test(s)
> Task :solr:contrib:s3-repository:wipeTaskTemp
> Task :solr:contrib:s3-repository:check
> Task :solr:contrib:scripting:test
:solr:contrib:scripting:test (SUCCESS): 22 test(s), 1 skipped
> Task :solr:contrib:scripting:wipeTaskTemp
> Task :solr:contrib:scripting:check
FAILURE: Build failed with an exception.
* What went wrong:
Execution failed for task ':solr:solr-ref-guide:jrubyPrepare'.
> Process 'command '/usr/local/asfpackages/java/oraclejdk-11.0.11/bin/java'' finished with non-zero exit value 1
* Try:
Run with --stacktrace option to get the stack trace. Run with --info or --debug option to get more log output. Run with --scan to get full insights.
* Get more help at https://help.gradle.org
Deprecated Gradle features were used in this build, making it incompatible with Gradle 8.0.
You can use '--warning-mode all' to show the individual deprecation warnings and determine if they come from your own scripts or plugins.
See https://docs.gradle.org/7.2/userguide/command_line_interface.html#sec:command_line_warnings
BUILD FAILED in 49m 1s
403 actionable tasks: 403 executed
Build step 'Invoke Gradle script' changed build result to FAILURE
Build step 'Invoke Gradle script' marked build as failure
Archiving artifacts
Recording test results
[Checks API] No suitable checks publisher found.
Email was triggered for: Failure - Any
Sending email for trigger: Failure - Any
[JENKINS] Solr » Solr-Check-main - Build # 1942 - Still Failing!
Posted by Apache Jenkins Server <je...@builds.apache.org>.
Build: https://ci-builds.apache.org/job/Solr/job/Solr-Check-main/1942/
All tests passed
Build Log:
[...truncated 704 lines...]
ERROR: Error installing /home/jenkins/.gradle/caches/modules-2/files-2.1/rubygems/http_parser.rb/0.8.0/8aa1092bbc1f10fd9622224babf2b2a98d4d4b22/http_parser.rb-0.8.0.gem:
ERROR: Failed to build gem native extension.
current directory: /home/jenkins/jenkins-slave/workspace/Solr/Solr-Check-main/solr/solr-ref-guide/build/.gems/gems/http_parser.rb-0.8.0/ext/ruby_http_parser
/usr/local/asfpackages/java/oraclejdk-11.0.11/bin/java -cp :/home/jenkins/.gradle/caches/modules-2/files-2.1/org.jruby/jruby-complete/9.2.9.0/8e44ce7a1417966d89957bd766a148601e28828b/jruby-complete-9.2.9.0.jar org.jruby.Main -r ./siteconf20211111-1495084-1vozvo0.rb extconf.rb
WARNING: An illegal reflective access operation has occurred
WARNING: Illegal reflective access by com.headius.backport9.modules.Modules (file:/home/jenkins/.gradle/caches/modules-2/files-2.1/org.jruby/jruby-complete/9.2.9.0/8e44ce7a1417966d89957bd766a148601e28828b/jruby-complete-9.2.9.0.jar) to method sun.nio.ch.NativeThread.signal(long)
WARNING: Please consider reporting this to the maintainers of com.headius.backport9.modules.Modules
WARNING: Use --illegal-access=warn to enable warnings of further illegal reflective access operations
WARNING: All illegal access operations will be denied in a future release
creating Makefile
current directory: /home/jenkins/jenkins-slave/workspace/Solr/Solr-Check-main/solr/solr-ref-guide/build/.gems/gems/http_parser.rb-0.8.0/ext/ruby_http_parser
make "DESTDIR=" clean
Makefile:225: *** multiple target patterns. Stop.
current directory: /home/jenkins/jenkins-slave/workspace/Solr/Solr-Check-main/solr/solr-ref-guide/build/.gems/gems/http_parser.rb-0.8.0/ext/ruby_http_parser
make "DESTDIR="
Makefile:225: *** multiple target patterns. Stop.
make failed, exit code 2
Gem files will remain installed in /home/jenkins/jenkins-slave/workspace/Solr/Solr-Check-main/solr/solr-ref-guide/build/.gems/gems/http_parser.rb-0.8.0 for inspection.
Results logged to /home/jenkins/jenkins-slave/workspace/Solr/Solr-Check-main/solr/solr-ref-guide/build/.gems/extensions/universal-java-11/2.5.0/http_parser.rb-0.8.0/gem_make.out
Successfully installed eventmachine-1.2.7-java
Successfully installed public_suffix-4.0.6
Successfully installed temple-0.8.2
Successfully installed asciidoctor-2.0.16
Successfully installed safe_yaml-1.0.5
Successfully installed rouge-3.26.1
Successfully installed pathutil-0.16.2
Successfully installed mercenary-0.3.6
Successfully installed liquid-4.0.3
Successfully installed kramdown-2.3.1
Successfully installed jekyll-watch-2.2.1
Successfully installed jekyll-sass-converter-1.5.2
Successfully installed em-websocket-0.5.3
Successfully installed colorator-1.1.0
Successfully installed addressable-2.8.0
Successfully installed concurrent-ruby-1.1.9
Successfully installed i18n-0.9.5
Successfully installed tilt-2.0.10
Successfully installed slim-4.1.0
Successfully installed jekyll-3.9.1
Successfully installed jekyll-asciidoc-3.0.0
29 gems installed
> Task :solr:solr-ref-guide:jrubyPrepare FAILED
> Task :solr:solr-ref-guide:prepareLocalJavadocLinksSiteSources
Syncing source files to /home/jenkins/jenkins-slave/workspace/Solr/Solr-Check-main/solr/solr-ref-guide/build/local-jdoc-links-site-content using props:
htmlOutDir -> ../local-jdoc-links-site
javadocLink -> https://docs.oracle.com/en/java/javase/11/docs/api/java.base/
solrGuideDraftStatus -> DRAFT
solrRootPath -> /home/jenkins/jenkins-slave/workspace/Solr/Solr-Check-main/solr/
solrDocsVersion -> 9.0
solrGuideVersionPath -> 9_0
buildDate -> 2021-11-11
buildYear -> 2021
htmlSolrJavadocs -> link:../../../documentation/build/site
htmlLuceneJavadocs -> link:../../../documentation/build/lucene-javadocs
ivyCommonsCodec -> 1.13
ivyDropwizardMetrics -> 4.1.5
ivyHadoop -> 3.2.0
ivyLog4j -> 2.14.1
ivyOpennlpTools -> 1.9.1
ivyTika -> 1.27
ivyZookeeper -> 3.7.0
Building up tree of all known pages
WARNING: An illegal reflective access operation has occurred
WARNING: Illegal reflective access by org.jruby.util.SecurityHelper (file:/home/jenkins/.gradle/caches/modules-2/files-2.1/org.jruby/jruby-core/9.2.6.0/653601d48b38528e76840c6eac1ae46e2dae1a74/jruby-core-9.2.6.0.jar) to field java.lang.reflect.Field.modifiers
WARNING: Please consider reporting this to the maintainers of org.jruby.util.SecurityHelper
WARNING: Use --illegal-access=warn to enable warnings of further illegal reflective access operations
WARNING: All illegal access operations will be denied in a future release
Looping over pages to build nav data
Creating /home/jenkins/jenkins-slave/workspace/Solr/Solr-Check-main/solr/solr-ref-guide/build/local-jdoc-links-site-content/_data/scrollnav.json
Creating /home/jenkins/jenkins-slave/workspace/Solr/Solr-Check-main/solr/solr-ref-guide/build/local-jdoc-links-site-content/_data/sidebar.json
> Task :solr:solr-ref-guide:prepareSiteSources
Syncing source files to /home/jenkins/jenkins-slave/workspace/Solr/Solr-Check-main/solr/solr-ref-guide/build/html-site-content using props:
htmlOutDir -> ../html-site
javadocLink -> https://docs.oracle.com/en/java/javase/11/docs/api/java.base/
solrGuideDraftStatus -> DRAFT
solrRootPath -> /home/jenkins/jenkins-slave/workspace/Solr/Solr-Check-main/solr/
solrDocsVersion -> 9.0
solrGuideVersionPath -> 9_0
buildDate -> 2021-11-11
buildYear -> 2021
htmlSolrJavadocs -> https://solr.apache.org/docs/9_0_0/
htmlLuceneJavadocs -> https://lucene.apache.org/core/9_0_0-prerelease9
ivyCommonsCodec -> 1.13
ivyDropwizardMetrics -> 4.1.5
ivyHadoop -> 3.2.0
ivyLog4j -> 2.14.1
ivyOpennlpTools -> 1.9.1
ivyTika -> 1.27
ivyZookeeper -> 3.7.0
Building up tree of all known pages
WARNING: An illegal reflective access operation has occurred
WARNING: Illegal reflective access by org.jruby.util.SecurityHelper (file:/home/jenkins/.gradle/caches/modules-2/files-2.1/org.jruby/jruby-core/9.2.6.0/653601d48b38528e76840c6eac1ae46e2dae1a74/jruby-core-9.2.6.0.jar) to field java.lang.reflect.Field.modifiers
WARNING: Please consider reporting this to the maintainers of org.jruby.util.SecurityHelper
WARNING: Use --illegal-access=warn to enable warnings of further illegal reflective access operations
WARNING: All illegal access operations will be denied in a future release
Looping over pages to build nav data
Creating /home/jenkins/jenkins-slave/workspace/Solr/Solr-Check-main/solr/solr-ref-guide/build/html-site-content/_data/scrollnav.json
Creating /home/jenkins/jenkins-slave/workspace/Solr/Solr-Check-main/solr/solr-ref-guide/build/html-site-content/_data/sidebar.json
> Task :solr:solr-ref-guide:test NO-SOURCE
> Task :solr:solr-ref-guide:wipeTaskTemp
> Task :solr:solrj:test
:solr:solrj:test (SUCCESS): 1705 test(s), 19 skipped
> Task :solr:solrj:wipeTaskTemp
> Task :solr:solrj:check
> Task :solr:test-framework:test
:solr:test-framework:test (SUCCESS): 15 test(s)
> Task :solr:test-framework:wipeTaskTemp
> Task :solr:test-framework:check
> Task :solr:webapp:test NO-SOURCE
> Task :solr:webapp:wipeTaskTemp
> Task :solr:webapp:check
> Task :solr:contrib:analysis-extras:test
:solr:contrib:analysis-extras:test (SUCCESS): 30 test(s)
> Task :solr:contrib:analysis-extras:wipeTaskTemp
> Task :solr:contrib:analysis-extras:check
> Task :solr:contrib:analytics:test
:solr:contrib:analytics:test (SUCCESS): 472 test(s)
> Task :solr:contrib:analytics:wipeTaskTemp
> Task :solr:contrib:analytics:check
> Task :solr:contrib:clustering:test
:solr:contrib:clustering:test (SUCCESS): 15 test(s)
> Task :solr:contrib:clustering:wipeTaskTemp
> Task :solr:contrib:clustering:check
> Task :solr:contrib:extraction:test
:solr:contrib:extraction:test (SUCCESS): 20 test(s)
> Task :solr:contrib:extraction:wipeTaskTemp
> Task :solr:contrib:extraction:check
> Task :solr:contrib:gcs-repository:test
:solr:contrib:gcs-repository:test (SUCCESS): 13 test(s)
> Task :solr:contrib:gcs-repository:wipeTaskTemp
> Task :solr:contrib:gcs-repository:check
> Task :solr:contrib:jaegertracer-configurator:test
:solr:contrib:jaegertracer-configurator:test (SUCCESS): 1 test(s)
> Task :solr:contrib:jaegertracer-configurator:wipeTaskTemp
> Task :solr:contrib:jaegertracer-configurator:check
> Task :solr:contrib:langid:test
:solr:contrib:langid:test (SUCCESS): 43 test(s)
> Task :solr:contrib:langid:wipeTaskTemp
> Task :solr:contrib:langid:check
> Task :solr:contrib:ltr:test
:solr:contrib:ltr:test (SUCCESS): 164 test(s)
> Task :solr:contrib:ltr:wipeTaskTemp
> Task :solr:contrib:ltr:check
> Task :solr:contrib:prometheus-exporter:test
:solr:contrib:prometheus-exporter:test (SUCCESS): 20 test(s)
> Task :solr:contrib:prometheus-exporter:wipeTaskTemp
> Task :solr:contrib:prometheus-exporter:check
> Task :solr:contrib:s3-repository:test
:solr:contrib:s3-repository:test (SUCCESS): 42 test(s)
> Task :solr:contrib:s3-repository:wipeTaskTemp
> Task :solr:contrib:s3-repository:check
> Task :solr:contrib:scripting:test
:solr:contrib:scripting:test (SUCCESS): 22 test(s), 1 skipped
> Task :solr:contrib:scripting:wipeTaskTemp
> Task :solr:contrib:scripting:check
FAILURE: Build failed with an exception.
* What went wrong:
Execution failed for task ':solr:solr-ref-guide:jrubyPrepare'.
> Process 'command '/usr/local/asfpackages/java/oraclejdk-11.0.11/bin/java'' finished with non-zero exit value 1
* Try:
Run with --stacktrace option to get the stack trace. Run with --info or --debug option to get more log output. Run with --scan to get full insights.
* Get more help at https://help.gradle.org
Deprecated Gradle features were used in this build, making it incompatible with Gradle 8.0.
You can use '--warning-mode all' to show the individual deprecation warnings and determine if they come from your own scripts or plugins.
See https://docs.gradle.org/7.2/userguide/command_line_interface.html#sec:command_line_warnings
BUILD FAILED in 47m 28s
403 actionable tasks: 403 executed
Build step 'Invoke Gradle script' changed build result to FAILURE
Build step 'Invoke Gradle script' marked build as failure
Archiving artifacts
Recording test results
[Checks API] No suitable checks publisher found.
Email was triggered for: Failure - Any
Sending email for trigger: Failure - Any
[JENKINS] Solr » Solr-Check-main - Build # 1941 - Still Failing!
Posted by Apache Jenkins Server <je...@builds.apache.org>.
Build: https://ci-builds.apache.org/job/Solr/job/Solr-Check-main/1941/
All tests passed
Build Log:
[...truncated 707 lines...]
ERROR: Error installing /home/jenkins/.gradle/caches/modules-2/files-2.1/rubygems/http_parser.rb/0.8.0/8aa1092bbc1f10fd9622224babf2b2a98d4d4b22/http_parser.rb-0.8.0.gem:
ERROR: Failed to build gem native extension.
current directory: /home/jenkins/jenkins-slave/workspace/Solr/Solr-Check-main/solr/solr-ref-guide/build/.gems/gems/http_parser.rb-0.8.0/ext/ruby_http_parser
/usr/local/asfpackages/java/oraclejdk-11.0.11/bin/java -cp :/home/jenkins/.gradle/caches/modules-2/files-2.1/org.jruby/jruby-complete/9.2.9.0/8e44ce7a1417966d89957bd766a148601e28828b/jruby-complete-9.2.9.0.jar org.jruby.Main -r ./siteconf20211111-1253352-aw0t0i.rb extconf.rb
WARNING: An illegal reflective access operation has occurred
WARNING: Illegal reflective access by com.headius.backport9.modules.Modules (file:/home/jenkins/.gradle/caches/modules-2/files-2.1/org.jruby/jruby-complete/9.2.9.0/8e44ce7a1417966d89957bd766a148601e28828b/jruby-complete-9.2.9.0.jar) to method sun.nio.ch.NativeThread.signal(long)
WARNING: Please consider reporting this to the maintainers of com.headius.backport9.modules.Modules
WARNING: Use --illegal-access=warn to enable warnings of further illegal reflective access operations
WARNING: All illegal access operations will be denied in a future release
creating Makefile
current directory: /home/jenkins/jenkins-slave/workspace/Solr/Solr-Check-main/solr/solr-ref-guide/build/.gems/gems/http_parser.rb-0.8.0/ext/ruby_http_parser
make "DESTDIR=" clean
Makefile:225: *** multiple target patterns. Stop.
current directory: /home/jenkins/jenkins-slave/workspace/Solr/Solr-Check-main/solr/solr-ref-guide/build/.gems/gems/http_parser.rb-0.8.0/ext/ruby_http_parser
make "DESTDIR="
Makefile:225: *** multiple target patterns. Stop.
make failed, exit code 2
Gem files will remain installed in /home/jenkins/jenkins-slave/workspace/Solr/Solr-Check-main/solr/solr-ref-guide/build/.gems/gems/http_parser.rb-0.8.0 for inspection.
Results logged to /home/jenkins/jenkins-slave/workspace/Solr/Solr-Check-main/solr/solr-ref-guide/build/.gems/extensions/universal-java-11/2.5.0/http_parser.rb-0.8.0/gem_make.out
Successfully installed eventmachine-1.2.7-java
Successfully installed public_suffix-4.0.6
Successfully installed temple-0.8.2
Successfully installed asciidoctor-2.0.16
Successfully installed safe_yaml-1.0.5
Successfully installed rouge-3.26.1
Successfully installed pathutil-0.16.2
Successfully installed mercenary-0.3.6
Successfully installed liquid-4.0.3
Successfully installed kramdown-2.3.1
Successfully installed jekyll-watch-2.2.1
Successfully installed jekyll-sass-converter-1.5.2
Successfully installed em-websocket-0.5.3
Successfully installed colorator-1.1.0
Successfully installed addressable-2.8.0
Successfully installed concurrent-ruby-1.1.9
Successfully installed i18n-0.9.5
Successfully installed tilt-2.0.10
Successfully installed slim-4.1.0
Successfully installed jekyll-3.9.1
Successfully installed jekyll-asciidoc-3.0.0
29 gems installed
> Task :solr:solr-ref-guide:jrubyPrepare FAILED
> Task :solr:solr-ref-guide:prepareLocalJavadocLinksSiteSources
Syncing source files to /home/jenkins/jenkins-slave/workspace/Solr/Solr-Check-main/solr/solr-ref-guide/build/local-jdoc-links-site-content using props:
htmlOutDir -> ../local-jdoc-links-site
javadocLink -> https://docs.oracle.com/en/java/javase/11/docs/api/java.base/
solrGuideDraftStatus -> DRAFT
solrRootPath -> /home/jenkins/jenkins-slave/workspace/Solr/Solr-Check-main/solr/
solrDocsVersion -> 9.0
solrGuideVersionPath -> 9_0
buildDate -> 2021-11-11
buildYear -> 2021
htmlSolrJavadocs -> link:../../../documentation/build/site
htmlLuceneJavadocs -> link:../../../documentation/build/lucene-javadocs
ivyCommonsCodec -> 1.13
ivyDropwizardMetrics -> 4.1.5
ivyHadoop -> 3.2.0
ivyLog4j -> 2.14.1
ivyOpennlpTools -> 1.9.1
ivyTika -> 1.27
ivyZookeeper -> 3.7.0
Building up tree of all known pages
WARNING: An illegal reflective access operation has occurred
WARNING: Illegal reflective access by org.jruby.util.SecurityHelper (file:/home/jenkins/.gradle/caches/modules-2/files-2.1/org.jruby/jruby-core/9.2.6.0/653601d48b38528e76840c6eac1ae46e2dae1a74/jruby-core-9.2.6.0.jar) to field java.lang.reflect.Field.modifiers
WARNING: Please consider reporting this to the maintainers of org.jruby.util.SecurityHelper
WARNING: Use --illegal-access=warn to enable warnings of further illegal reflective access operations
WARNING: All illegal access operations will be denied in a future release
Looping over pages to build nav data
Creating /home/jenkins/jenkins-slave/workspace/Solr/Solr-Check-main/solr/solr-ref-guide/build/local-jdoc-links-site-content/_data/scrollnav.json
Creating /home/jenkins/jenkins-slave/workspace/Solr/Solr-Check-main/solr/solr-ref-guide/build/local-jdoc-links-site-content/_data/sidebar.json
> Task :solr:solr-ref-guide:prepareSiteSources
Syncing source files to /home/jenkins/jenkins-slave/workspace/Solr/Solr-Check-main/solr/solr-ref-guide/build/html-site-content using props:
htmlOutDir -> ../html-site
javadocLink -> https://docs.oracle.com/en/java/javase/11/docs/api/java.base/
solrGuideDraftStatus -> DRAFT
solrRootPath -> /home/jenkins/jenkins-slave/workspace/Solr/Solr-Check-main/solr/
solrDocsVersion -> 9.0
solrGuideVersionPath -> 9_0
buildDate -> 2021-11-11
buildYear -> 2021
htmlSolrJavadocs -> https://solr.apache.org/docs/9_0_0/
htmlLuceneJavadocs -> https://lucene.apache.org/core/9_0_0-prerelease9
ivyCommonsCodec -> 1.13
ivyDropwizardMetrics -> 4.1.5
ivyHadoop -> 3.2.0
ivyLog4j -> 2.14.1
ivyOpennlpTools -> 1.9.1
ivyTika -> 1.27
ivyZookeeper -> 3.7.0
Building up tree of all known pages
WARNING: An illegal reflective access operation has occurred
WARNING: Illegal reflective access by org.jruby.util.SecurityHelper (file:/home/jenkins/.gradle/caches/modules-2/files-2.1/org.jruby/jruby-core/9.2.6.0/653601d48b38528e76840c6eac1ae46e2dae1a74/jruby-core-9.2.6.0.jar) to field java.lang.reflect.Field.modifiers
WARNING: Please consider reporting this to the maintainers of org.jruby.util.SecurityHelper
WARNING: Use --illegal-access=warn to enable warnings of further illegal reflective access operations
WARNING: All illegal access operations will be denied in a future release
Looping over pages to build nav data
Creating /home/jenkins/jenkins-slave/workspace/Solr/Solr-Check-main/solr/solr-ref-guide/build/html-site-content/_data/scrollnav.json
Creating /home/jenkins/jenkins-slave/workspace/Solr/Solr-Check-main/solr/solr-ref-guide/build/html-site-content/_data/sidebar.json
> Task :solr:solr-ref-guide:test NO-SOURCE
> Task :solr:solr-ref-guide:wipeTaskTemp
> Task :solr:solrj:test
:solr:solrj:test (SUCCESS): 1705 test(s), 21 skipped
> Task :solr:solrj:wipeTaskTemp
> Task :solr:solrj:check
> Task :solr:test-framework:test
:solr:test-framework:test (SUCCESS): 15 test(s)
> Task :solr:test-framework:wipeTaskTemp
> Task :solr:test-framework:check
> Task :solr:webapp:test NO-SOURCE
> Task :solr:webapp:wipeTaskTemp
> Task :solr:webapp:check
> Task :solr:contrib:analysis-extras:test
:solr:contrib:analysis-extras:test (SUCCESS): 30 test(s)
> Task :solr:contrib:analysis-extras:wipeTaskTemp
> Task :solr:contrib:analysis-extras:check
> Task :solr:contrib:analytics:test
:solr:contrib:analytics:test (SUCCESS): 472 test(s)
> Task :solr:contrib:analytics:wipeTaskTemp
> Task :solr:contrib:analytics:check
> Task :solr:contrib:clustering:test
:solr:contrib:clustering:test (SUCCESS): 15 test(s)
> Task :solr:contrib:clustering:wipeTaskTemp
> Task :solr:contrib:clustering:check
> Task :solr:contrib:extraction:test
:solr:contrib:extraction:test (SUCCESS): 20 test(s)
> Task :solr:contrib:extraction:wipeTaskTemp
> Task :solr:contrib:extraction:check
> Task :solr:contrib:gcs-repository:test
:solr:contrib:gcs-repository:test (SUCCESS): 13 test(s), 3 skipped
> Task :solr:contrib:gcs-repository:wipeTaskTemp
> Task :solr:contrib:gcs-repository:check
> Task :solr:contrib:jaegertracer-configurator:test
:solr:contrib:jaegertracer-configurator:test (SUCCESS): 1 test(s)
> Task :solr:contrib:jaegertracer-configurator:wipeTaskTemp
> Task :solr:contrib:jaegertracer-configurator:check
> Task :solr:contrib:langid:test
:solr:contrib:langid:test (SUCCESS): 43 test(s)
> Task :solr:contrib:langid:wipeTaskTemp
> Task :solr:contrib:langid:check
> Task :solr:contrib:ltr:test
:solr:contrib:ltr:test (SUCCESS): 164 test(s)
> Task :solr:contrib:ltr:wipeTaskTemp
> Task :solr:contrib:ltr:check
> Task :solr:contrib:prometheus-exporter:test
:solr:contrib:prometheus-exporter:test (SUCCESS): 20 test(s)
> Task :solr:contrib:prometheus-exporter:wipeTaskTemp
> Task :solr:contrib:prometheus-exporter:check
> Task :solr:contrib:s3-repository:test
:solr:contrib:s3-repository:test (SUCCESS): 42 test(s)
> Task :solr:contrib:s3-repository:wipeTaskTemp
> Task :solr:contrib:s3-repository:check
> Task :solr:contrib:scripting:test
:solr:contrib:scripting:test (SUCCESS): 22 test(s), 1 skipped
> Task :solr:contrib:scripting:wipeTaskTemp
> Task :solr:contrib:scripting:check
FAILURE: Build failed with an exception.
* What went wrong:
Execution failed for task ':solr:solr-ref-guide:jrubyPrepare'.
> Process 'command '/usr/local/asfpackages/java/oraclejdk-11.0.11/bin/java'' finished with non-zero exit value 1
* Try:
Run with --stacktrace option to get the stack trace. Run with --info or --debug option to get more log output. Run with --scan to get full insights.
* Get more help at https://help.gradle.org
Deprecated Gradle features were used in this build, making it incompatible with Gradle 8.0.
You can use '--warning-mode all' to show the individual deprecation warnings and determine if they come from your own scripts or plugins.
See https://docs.gradle.org/7.2/userguide/command_line_interface.html#sec:command_line_warnings
BUILD FAILED in 46m 52s
403 actionable tasks: 403 executed
Build step 'Invoke Gradle script' changed build result to FAILURE
Build step 'Invoke Gradle script' marked build as failure
Archiving artifacts
Recording test results
[Checks API] No suitable checks publisher found.
Email was triggered for: Failure - Any
Sending email for trigger: Failure - Any
[JENKINS] Solr » Solr-Check-main - Build # 1940 - Still Failing!
Posted by Apache Jenkins Server <je...@builds.apache.org>.
Build: https://ci-builds.apache.org/job/Solr/job/Solr-Check-main/1940/
1 tests failed.
FAILED: org.apache.solr.cloud.api.collections.TestCollectionAPI.test
Error Message:
org.apache.solr.client.solrj.SolrServerException: IOException occurred when talking to server at: http://127.0.0.1:37045
Stack Trace:
org.apache.solr.client.solrj.SolrServerException: IOException occurred when talking to server at: http://127.0.0.1:37045
at __randomizedtesting.SeedInfo.seed([ECD53D3281644886:648102E82F98257E]:0)
at app//org.apache.solr.client.solrj.impl.HttpSolrClient.executeMethod(HttpSolrClient.java:681)
at app//org.apache.solr.client.solrj.impl.HttpSolrClient.request(HttpSolrClient.java:239)
at app//org.apache.solr.client.solrj.impl.HttpSolrClient.request(HttpSolrClient.java:222)
at app//org.apache.solr.client.solrj.impl.LBSolrClient.doRequest(LBSolrClient.java:389)
at app//org.apache.solr.client.solrj.impl.LBSolrClient.request(LBSolrClient.java:359)
at app//org.apache.solr.client.solrj.impl.BaseCloudSolrClient.sendRequest(BaseCloudSolrClient.java:1132)
at app//org.apache.solr.client.solrj.impl.BaseCloudSolrClient.requestWithRetryOnStaleState(BaseCloudSolrClient.java:898)
at app//org.apache.solr.client.solrj.impl.BaseCloudSolrClient.request(BaseCloudSolrClient.java:832)
at app//org.apache.solr.client.solrj.SolrRequest.process(SolrRequest.java:226)
at app//org.apache.solr.client.solrj.SolrRequest.process(SolrRequest.java:243)
at app//org.apache.solr.cloud.api.collections.TestCollectionAPI.clusterStatusWithCollectionHealthState(TestCollectionAPI.java:381)
at app//org.apache.solr.cloud.api.collections.TestCollectionAPI.test(TestCollectionAPI.java:96)
at java.base@11.0.11/jdk.internal.reflect.NativeMethodAccessorImpl.invoke0(Native Method)
at java.base@11.0.11/jdk.internal.reflect.NativeMethodAccessorImpl.invoke(NativeMethodAccessorImpl.java:62)
at java.base@11.0.11/jdk.internal.reflect.DelegatingMethodAccessorImpl.invoke(DelegatingMethodAccessorImpl.java:43)
at java.base@11.0.11/java.lang.reflect.Method.invoke(Method.java:566)
at app//com.carrotsearch.randomizedtesting.RandomizedRunner.invoke(RandomizedRunner.java:1754)
at app//com.carrotsearch.randomizedtesting.RandomizedRunner$8.evaluate(RandomizedRunner.java:942)
at app//com.carrotsearch.randomizedtesting.RandomizedRunner$9.evaluate(RandomizedRunner.java:978)
at app//com.carrotsearch.randomizedtesting.RandomizedRunner$10.evaluate(RandomizedRunner.java:992)
at app//org.apache.solr.BaseDistributedSearchTestCase$ShardsRepeatRule$ShardsFixedStatement.callStatement(BaseDistributedSearchTestCase.java:1081)
at app//org.apache.solr.BaseDistributedSearchTestCase$ShardsRepeatRule$ShardsStatement.evaluate(BaseDistributedSearchTestCase.java:1052)
at app//com.carrotsearch.randomizedtesting.rules.SystemPropertiesRestoreRule$1.evaluate(SystemPropertiesRestoreRule.java:57)
at app//org.junit.rules.RunRules.evaluate(RunRules.java:20)
at app//org.apache.lucene.util.TestRuleSetupTeardownChained$1.evaluate(TestRuleSetupTeardownChained.java:44)
at app//org.apache.lucene.util.AbstractBeforeAfterRule$1.evaluate(AbstractBeforeAfterRule.java:43)
at app//org.apache.lucene.util.TestRuleThreadAndTestName$1.evaluate(TestRuleThreadAndTestName.java:45)
at app//org.apache.lucene.util.TestRuleIgnoreAfterMaxFailures$1.evaluate(TestRuleIgnoreAfterMaxFailures.java:60)
at app//org.apache.lucene.util.TestRuleMarkFailure$1.evaluate(TestRuleMarkFailure.java:44)
at app//org.junit.rules.RunRules.evaluate(RunRules.java:20)
at app//com.carrotsearch.randomizedtesting.rules.StatementAdapter.evaluate(StatementAdapter.java:36)
at app//com.carrotsearch.randomizedtesting.ThreadLeakControl$StatementRunner.run(ThreadLeakControl.java:370)
at app//com.carrotsearch.randomizedtesting.ThreadLeakControl.forkTimeoutingTask(ThreadLeakControl.java:819)
at app//com.carrotsearch.randomizedtesting.ThreadLeakControl$3.evaluate(ThreadLeakControl.java:470)
at app//com.carrotsearch.randomizedtesting.RandomizedRunner.runSingleTest(RandomizedRunner.java:951)
at app//com.carrotsearch.randomizedtesting.RandomizedRunner$5.evaluate(RandomizedRunner.java:836)
at app//com.carrotsearch.randomizedtesting.RandomizedRunner$6.evaluate(RandomizedRunner.java:887)
at app//com.carrotsearch.randomizedtesting.RandomizedRunner$7.evaluate(RandomizedRunner.java:898)
at app//com.carrotsearch.randomizedtesting.rules.StatementAdapter.evaluate(StatementAdapter.java:36)
at app//org.apache.lucene.util.AbstractBeforeAfterRule$1.evaluate(AbstractBeforeAfterRule.java:43)
at app//org.apache.lucene.util.AbstractBeforeAfterRule$1.evaluate(AbstractBeforeAfterRule.java:43)
at app//com.carrotsearch.randomizedtesting.rules.SystemPropertiesRestoreRule$1.evaluate(SystemPropertiesRestoreRule.java:57)
at app//org.junit.rules.RunRules.evaluate(RunRules.java:20)
at app//org.apache.lucene.util.AbstractBeforeAfterRule$1.evaluate(AbstractBeforeAfterRule.java:43)
at app//com.carrotsearch.randomizedtesting.rules.StatementAdapter.evaluate(StatementAdapter.java:36)
at app//org.apache.lucene.util.TestRuleStoreClassName$1.evaluate(TestRuleStoreClassName.java:38)
at app//com.carrotsearch.randomizedtesting.rules.NoShadowingOrOverridesOnMethodsRule$1.evaluate(NoShadowingOrOverridesOnMethodsRule.java:40)
at app//com.carrotsearch.randomizedtesting.rules.NoShadowingOrOverridesOnMethodsRule$1.evaluate(NoShadowingOrOverridesOnMethodsRule.java:40)
at app//com.carrotsearch.randomizedtesting.rules.StatementAdapter.evaluate(StatementAdapter.java:36)
at app//com.carrotsearch.randomizedtesting.rules.StatementAdapter.evaluate(StatementAdapter.java:36)
at app//org.apache.lucene.util.TestRuleAssertionsRequired$1.evaluate(TestRuleAssertionsRequired.java:53)
at app//org.apache.lucene.util.AbstractBeforeAfterRule$1.evaluate(AbstractBeforeAfterRule.java:43)
at app//org.apache.lucene.util.TestRuleMarkFailure$1.evaluate(TestRuleMarkFailure.java:44)
at app//org.apache.lucene.util.TestRuleIgnoreAfterMaxFailures$1.evaluate(TestRuleIgnoreAfterMaxFailures.java:60)
at app//org.apache.lucene.util.TestRuleIgnoreTestSuites$1.evaluate(TestRuleIgnoreTestSuites.java:47)
at app//org.junit.rules.RunRules.evaluate(RunRules.java:20)
at app//com.carrotsearch.randomizedtesting.rules.StatementAdapter.evaluate(StatementAdapter.java:36)
at app//com.carrotsearch.randomizedtesting.ThreadLeakControl$StatementRunner.run(ThreadLeakControl.java:370)
at app//com.carrotsearch.randomizedtesting.ThreadLeakControl.lambda$forkTimeoutingTask$0(ThreadLeakControl.java:826)
at java.base@11.0.11/java.lang.Thread.run(Thread.java:834)
Caused by: org.apache.http.NoHttpResponseException: 127.0.0.1:37045 failed to respond
at app//org.apache.http.impl.conn.DefaultHttpResponseParser.parseHead(DefaultHttpResponseParser.java:141)
at app//org.apache.http.impl.conn.DefaultHttpResponseParser.parseHead(DefaultHttpResponseParser.java:56)
at app//org.apache.http.impl.io.AbstractMessageParser.parse(AbstractMessageParser.java:259)
at app//org.apache.http.impl.DefaultBHttpClientConnection.receiveResponseHeader(DefaultBHttpClientConnection.java:163)
at app//org.apache.http.impl.conn.CPoolProxy.receiveResponseHeader(CPoolProxy.java:157)
at app//org.apache.http.protocol.HttpRequestExecutor.doReceiveResponse(HttpRequestExecutor.java:273)
at app//org.apache.http.protocol.HttpRequestExecutor.execute(HttpRequestExecutor.java:125)
at app//org.apache.http.impl.execchain.MainClientExec.execute(MainClientExec.java:272)
at app//org.apache.http.impl.execchain.ProtocolExec.execute(ProtocolExec.java:186)
at app//org.apache.http.impl.execchain.RetryExec.execute(RetryExec.java:89)
at app//org.apache.http.impl.execchain.RedirectExec.execute(RedirectExec.java:110)
at app//org.apache.http.impl.client.InternalHttpClient.doExecute(InternalHttpClient.java:185)
at app//org.apache.http.impl.client.CloseableHttpClient.execute(CloseableHttpClient.java:83)
at app//org.apache.http.impl.client.CloseableHttpClient.execute(CloseableHttpClient.java:56)
at app//org.apache.solr.client.solrj.impl.HttpSolrClient.executeMethod(HttpSolrClient.java:551)
... 59 more
Build Log:
[...truncated 2874 lines...]
ERROR: Error installing /home/jenkins/.gradle/caches/modules-2/files-2.1/rubygems/http_parser.rb/0.8.0/8aa1092bbc1f10fd9622224babf2b2a98d4d4b22/http_parser.rb-0.8.0.gem:
ERROR: Failed to build gem native extension.
current directory: /home/jenkins/jenkins-slave/workspace/Solr/Solr-Check-main/solr/solr-ref-guide/build/.gems/gems/http_parser.rb-0.8.0/ext/ruby_http_parser
/usr/local/asfpackages/java/oraclejdk-11.0.11/bin/java -cp :/home/jenkins/.gradle/caches/modules-2/files-2.1/org.jruby/jruby-complete/9.2.9.0/8e44ce7a1417966d89957bd766a148601e28828b/jruby-complete-9.2.9.0.jar org.jruby.Main -r ./siteconf20211111-17479-1h2mlfe.rb extconf.rb
WARNING: An illegal reflective access operation has occurred
WARNING: Illegal reflective access by com.headius.backport9.modules.Modules (file:/home/jenkins/.gradle/caches/modules-2/files-2.1/org.jruby/jruby-complete/9.2.9.0/8e44ce7a1417966d89957bd766a148601e28828b/jruby-complete-9.2.9.0.jar) to method sun.nio.ch.NativeThread.signal(long)
WARNING: Please consider reporting this to the maintainers of com.headius.backport9.modules.Modules
WARNING: Use --illegal-access=warn to enable warnings of further illegal reflective access operations
WARNING: All illegal access operations will be denied in a future release
creating Makefile
current directory: /home/jenkins/jenkins-slave/workspace/Solr/Solr-Check-main/solr/solr-ref-guide/build/.gems/gems/http_parser.rb-0.8.0/ext/ruby_http_parser
make "DESTDIR=" clean
Makefile:225: *** multiple target patterns. Stop.
current directory: /home/jenkins/jenkins-slave/workspace/Solr/Solr-Check-main/solr/solr-ref-guide/build/.gems/gems/http_parser.rb-0.8.0/ext/ruby_http_parser
make "DESTDIR="
Makefile:225: *** multiple target patterns. Stop.
make failed, exit code 2
Gem files will remain installed in /home/jenkins/jenkins-slave/workspace/Solr/Solr-Check-main/solr/solr-ref-guide/build/.gems/gems/http_parser.rb-0.8.0 for inspection.
Results logged to /home/jenkins/jenkins-slave/workspace/Solr/Solr-Check-main/solr/solr-ref-guide/build/.gems/extensions/universal-java-11/2.5.0/http_parser.rb-0.8.0/gem_make.out
Successfully installed eventmachine-1.2.7-java
Successfully installed public_suffix-4.0.6
Successfully installed temple-0.8.2
Successfully installed asciidoctor-2.0.16
Successfully installed safe_yaml-1.0.5
Successfully installed rouge-3.26.1
Successfully installed pathutil-0.16.2
Successfully installed mercenary-0.3.6
Successfully installed liquid-4.0.3
Successfully installed kramdown-2.3.1
Successfully installed jekyll-watch-2.2.1
Successfully installed jekyll-sass-converter-1.5.2
Successfully installed em-websocket-0.5.3
Successfully installed colorator-1.1.0
Successfully installed addressable-2.8.0
Successfully installed concurrent-ruby-1.1.9
Successfully installed i18n-0.9.5
Successfully installed tilt-2.0.10
Successfully installed slim-4.1.0
Successfully installed jekyll-3.9.1
Successfully installed jekyll-asciidoc-3.0.0
29 gems installed
> Task :solr:solr-ref-guide:jrubyPrepare FAILED
> Task :solr:solr-ref-guide:prepareLocalJavadocLinksSiteSources
Syncing source files to /home/jenkins/jenkins-slave/workspace/Solr/Solr-Check-main/solr/solr-ref-guide/build/local-jdoc-links-site-content using props:
htmlOutDir -> ../local-jdoc-links-site
javadocLink -> https://docs.oracle.com/en/java/javase/11/docs/api/java.base/
solrGuideDraftStatus -> DRAFT
solrRootPath -> /home/jenkins/jenkins-slave/workspace/Solr/Solr-Check-main/solr/
solrDocsVersion -> 9.0
solrGuideVersionPath -> 9_0
buildDate -> 2021-11-11
buildYear -> 2021
htmlSolrJavadocs -> link:../../../documentation/build/site
htmlLuceneJavadocs -> link:../../../documentation/build/lucene-javadocs
ivyCommonsCodec -> 1.13
ivyDropwizardMetrics -> 4.1.5
ivyHadoop -> 3.2.0
ivyLog4j -> 2.14.1
ivyOpennlpTools -> 1.9.1
ivyTika -> 1.27
ivyZookeeper -> 3.7.0
Building up tree of all known pages
WARNING: An illegal reflective access operation has occurred
WARNING: Illegal reflective access by org.jruby.util.SecurityHelper (file:/home/jenkins/.gradle/caches/modules-2/files-2.1/org.jruby/jruby-core/9.2.6.0/653601d48b38528e76840c6eac1ae46e2dae1a74/jruby-core-9.2.6.0.jar) to field java.lang.reflect.Field.modifiers
WARNING: Please consider reporting this to the maintainers of org.jruby.util.SecurityHelper
WARNING: Use --illegal-access=warn to enable warnings of further illegal reflective access operations
WARNING: All illegal access operations will be denied in a future release
Looping over pages to build nav data
Creating /home/jenkins/jenkins-slave/workspace/Solr/Solr-Check-main/solr/solr-ref-guide/build/local-jdoc-links-site-content/_data/scrollnav.json
Creating /home/jenkins/jenkins-slave/workspace/Solr/Solr-Check-main/solr/solr-ref-guide/build/local-jdoc-links-site-content/_data/sidebar.json
> Task :solr:solr-ref-guide:prepareSiteSources
Syncing source files to /home/jenkins/jenkins-slave/workspace/Solr/Solr-Check-main/solr/solr-ref-guide/build/html-site-content using props:
htmlOutDir -> ../html-site
javadocLink -> https://docs.oracle.com/en/java/javase/11/docs/api/java.base/
solrGuideDraftStatus -> DRAFT
solrRootPath -> /home/jenkins/jenkins-slave/workspace/Solr/Solr-Check-main/solr/
solrDocsVersion -> 9.0
solrGuideVersionPath -> 9_0
buildDate -> 2021-11-11
buildYear -> 2021
htmlSolrJavadocs -> https://solr.apache.org/docs/9_0_0/
htmlLuceneJavadocs -> https://lucene.apache.org/core/9_0_0-prerelease9
ivyCommonsCodec -> 1.13
ivyDropwizardMetrics -> 4.1.5
ivyHadoop -> 3.2.0
ivyLog4j -> 2.14.1
ivyOpennlpTools -> 1.9.1
ivyTika -> 1.27
ivyZookeeper -> 3.7.0
Building up tree of all known pages
WARNING: An illegal reflective access operation has occurred
WARNING: Illegal reflective access by org.jruby.util.SecurityHelper (file:/home/jenkins/.gradle/caches/modules-2/files-2.1/org.jruby/jruby-core/9.2.6.0/653601d48b38528e76840c6eac1ae46e2dae1a74/jruby-core-9.2.6.0.jar) to field java.lang.reflect.Field.modifiers
WARNING: Please consider reporting this to the maintainers of org.jruby.util.SecurityHelper
WARNING: Use --illegal-access=warn to enable warnings of further illegal reflective access operations
WARNING: All illegal access operations will be denied in a future release
Looping over pages to build nav data
Creating /home/jenkins/jenkins-slave/workspace/Solr/Solr-Check-main/solr/solr-ref-guide/build/html-site-content/_data/scrollnav.json
Creating /home/jenkins/jenkins-slave/workspace/Solr/Solr-Check-main/solr/solr-ref-guide/build/html-site-content/_data/sidebar.json
> Task :solr:solr-ref-guide:test NO-SOURCE
> Task :solr:solr-ref-guide:wipeTaskTemp
> Task :solr:solrj:test
:solr:solrj:test (SUCCESS): 1705 test(s), 25 skipped
> Task :solr:solrj:wipeTaskTemp
> Task :solr:solrj:check
> Task :solr:test-framework:test
:solr:test-framework:test (SUCCESS): 15 test(s)
> Task :solr:test-framework:wipeTaskTemp
> Task :solr:test-framework:check
> Task :solr:webapp:test NO-SOURCE
> Task :solr:webapp:wipeTaskTemp
> Task :solr:webapp:check
> Task :solr:contrib:analysis-extras:test
:solr:contrib:analysis-extras:test (SUCCESS): 30 test(s)
> Task :solr:contrib:analysis-extras:wipeTaskTemp
> Task :solr:contrib:analysis-extras:check
> Task :solr:contrib:analytics:test
:solr:contrib:analytics:test (SUCCESS): 472 test(s)
> Task :solr:contrib:analytics:wipeTaskTemp
> Task :solr:contrib:analytics:check
> Task :solr:contrib:clustering:test
:solr:contrib:clustering:test (SUCCESS): 15 test(s)
> Task :solr:contrib:clustering:wipeTaskTemp
> Task :solr:contrib:clustering:check
> Task :solr:contrib:extraction:test
:solr:contrib:extraction:test (SUCCESS): 20 test(s)
> Task :solr:contrib:extraction:wipeTaskTemp
> Task :solr:contrib:extraction:check
> Task :solr:contrib:gcs-repository:test
:solr:contrib:gcs-repository:test (SUCCESS): 13 test(s)
> Task :solr:contrib:gcs-repository:wipeTaskTemp
> Task :solr:contrib:gcs-repository:check
> Task :solr:contrib:jaegertracer-configurator:test
:solr:contrib:jaegertracer-configurator:test (SUCCESS): 1 test(s)
> Task :solr:contrib:jaegertracer-configurator:wipeTaskTemp
> Task :solr:contrib:jaegertracer-configurator:check
> Task :solr:contrib:langid:test
:solr:contrib:langid:test (SUCCESS): 43 test(s)
> Task :solr:contrib:langid:wipeTaskTemp
> Task :solr:contrib:langid:check
> Task :solr:contrib:ltr:test
:solr:contrib:ltr:test (SUCCESS): 164 test(s)
> Task :solr:contrib:ltr:wipeTaskTemp
> Task :solr:contrib:ltr:check
> Task :solr:contrib:prometheus-exporter:test
:solr:contrib:prometheus-exporter:test (SUCCESS): 20 test(s)
> Task :solr:contrib:prometheus-exporter:wipeTaskTemp
> Task :solr:contrib:prometheus-exporter:check
> Task :solr:contrib:s3-repository:test
:solr:contrib:s3-repository:test (SUCCESS): 42 test(s)
> Task :solr:contrib:s3-repository:wipeTaskTemp
> Task :solr:contrib:s3-repository:check
> Task :solr:contrib:scripting:test
:solr:contrib:scripting:test (SUCCESS): 22 test(s), 1 skipped
> Task :solr:contrib:scripting:wipeTaskTemp
> Task :solr:contrib:scripting:check
ERROR: The following test(s) have failed:
- org.apache.solr.cloud.api.collections.TestCollectionAPI.test (:solr:core)
Test output: /home/jenkins/jenkins-slave/workspace/Solr/Solr-Check-main/solr/core/build/test-results/test/outputs/OUTPUT-org.apache.solr.cloud.api.collections.TestCollectionAPI.txt
Reproduce with: gradlew :solr:core:test --tests "org.apache.solr.cloud.api.collections.TestCollectionAPI.test" -Ptests.jvms=4 -Ptests.haltonfailure=false -Ptests.jvmargs=-XX:TieredStopAtLevel=1 -Ptests.seed=ECD53D3281644886 -Ptests.multiplier=2 -Ptests.badapples=false -Ptests.file.encoding=UTF-8
FAILURE: Build failed with an exception.
* What went wrong:
Execution failed for task ':solr:solr-ref-guide:jrubyPrepare'.
> Process 'command '/usr/local/asfpackages/java/oraclejdk-11.0.11/bin/java'' finished with non-zero exit value 1
* Try:
Run with --stacktrace option to get the stack trace. Run with --info or --debug option to get more log output. Run with --scan to get full insights.
* Get more help at https://help.gradle.org
Deprecated Gradle features were used in this build, making it incompatible with Gradle 8.0.
You can use '--warning-mode all' to show the individual deprecation warnings and determine if they come from your own scripts or plugins.
See https://docs.gradle.org/7.2/userguide/command_line_interface.html#sec:command_line_warnings
BUILD FAILED in 51m 34s
403 actionable tasks: 403 executed
Build step 'Invoke Gradle script' changed build result to FAILURE
Build step 'Invoke Gradle script' marked build as failure
Archiving artifacts
Recording test results
[Checks API] No suitable checks publisher found.
Email was triggered for: Failure - Any
Sending email for trigger: Failure - Any
[JENKINS] Solr » Solr-Check-main - Build # 1939 - Still Failing!
Posted by Apache Jenkins Server <je...@builds.apache.org>.
Build: https://ci-builds.apache.org/job/Solr/job/Solr-Check-main/1939/
All tests passed
Build Log:
[...truncated 706 lines...]
ERROR: Error installing /home/jenkins/.gradle/caches/modules-2/files-2.1/rubygems/http_parser.rb/0.8.0/8aa1092bbc1f10fd9622224babf2b2a98d4d4b22/http_parser.rb-0.8.0.gem:
ERROR: Failed to build gem native extension.
current directory: /home/jenkins/jenkins-slave/workspace/Solr/Solr-Check-main/solr/solr-ref-guide/build/.gems/gems/http_parser.rb-0.8.0/ext/ruby_http_parser
/usr/local/asfpackages/java/oraclejdk-11.0.11/bin/java -cp :/home/jenkins/.gradle/caches/modules-2/files-2.1/org.jruby/jruby-complete/9.2.9.0/8e44ce7a1417966d89957bd766a148601e28828b/jruby-complete-9.2.9.0.jar org.jruby.Main -r ./siteconf20211111-4184892-o7asc3.rb extconf.rb
WARNING: An illegal reflective access operation has occurred
WARNING: Illegal reflective access by com.headius.backport9.modules.Modules (file:/home/jenkins/.gradle/caches/modules-2/files-2.1/org.jruby/jruby-complete/9.2.9.0/8e44ce7a1417966d89957bd766a148601e28828b/jruby-complete-9.2.9.0.jar) to method sun.nio.ch.NativeThread.signal(long)
WARNING: Please consider reporting this to the maintainers of com.headius.backport9.modules.Modules
WARNING: Use --illegal-access=warn to enable warnings of further illegal reflective access operations
WARNING: All illegal access operations will be denied in a future release
creating Makefile
current directory: /home/jenkins/jenkins-slave/workspace/Solr/Solr-Check-main/solr/solr-ref-guide/build/.gems/gems/http_parser.rb-0.8.0/ext/ruby_http_parser
make "DESTDIR=" clean
Makefile:225: *** multiple target patterns. Stop.
current directory: /home/jenkins/jenkins-slave/workspace/Solr/Solr-Check-main/solr/solr-ref-guide/build/.gems/gems/http_parser.rb-0.8.0/ext/ruby_http_parser
make "DESTDIR="
Makefile:225: *** multiple target patterns. Stop.
make failed, exit code 2
Gem files will remain installed in /home/jenkins/jenkins-slave/workspace/Solr/Solr-Check-main/solr/solr-ref-guide/build/.gems/gems/http_parser.rb-0.8.0 for inspection.
Results logged to /home/jenkins/jenkins-slave/workspace/Solr/Solr-Check-main/solr/solr-ref-guide/build/.gems/extensions/universal-java-11/2.5.0/http_parser.rb-0.8.0/gem_make.out
Successfully installed eventmachine-1.2.7-java
Successfully installed public_suffix-4.0.6
Successfully installed temple-0.8.2
Successfully installed asciidoctor-2.0.16
Successfully installed safe_yaml-1.0.5
Successfully installed rouge-3.26.1
Successfully installed pathutil-0.16.2
Successfully installed mercenary-0.3.6
Successfully installed liquid-4.0.3
Successfully installed kramdown-2.3.1
Successfully installed jekyll-watch-2.2.1
Successfully installed jekyll-sass-converter-1.5.2
Successfully installed em-websocket-0.5.3
Successfully installed colorator-1.1.0
Successfully installed addressable-2.8.0
Successfully installed concurrent-ruby-1.1.9
Successfully installed i18n-0.9.5
Successfully installed tilt-2.0.10
Successfully installed slim-4.1.0
Successfully installed jekyll-3.9.1
Successfully installed jekyll-asciidoc-3.0.0
29 gems installed
> Task :solr:solr-ref-guide:jrubyPrepare FAILED
> Task :solr:solr-ref-guide:prepareLocalJavadocLinksSiteSources
Syncing source files to /home/jenkins/jenkins-slave/workspace/Solr/Solr-Check-main/solr/solr-ref-guide/build/local-jdoc-links-site-content using props:
htmlOutDir -> ../local-jdoc-links-site
javadocLink -> https://docs.oracle.com/en/java/javase/11/docs/api/java.base/
solrGuideDraftStatus -> DRAFT
solrRootPath -> /home/jenkins/jenkins-slave/workspace/Solr/Solr-Check-main/solr/
solrDocsVersion -> 9.0
solrGuideVersionPath -> 9_0
buildDate -> 2021-11-11
buildYear -> 2021
htmlSolrJavadocs -> link:../../../documentation/build/site
htmlLuceneJavadocs -> link:../../../documentation/build/lucene-javadocs
ivyCommonsCodec -> 1.13
ivyDropwizardMetrics -> 4.1.5
ivyHadoop -> 3.2.0
ivyLog4j -> 2.14.1
ivyOpennlpTools -> 1.9.1
ivyTika -> 1.27
ivyZookeeper -> 3.7.0
Building up tree of all known pages
WARNING: An illegal reflective access operation has occurred
WARNING: Illegal reflective access by org.jruby.util.SecurityHelper (file:/home/jenkins/.gradle/caches/modules-2/files-2.1/org.jruby/jruby-core/9.2.6.0/653601d48b38528e76840c6eac1ae46e2dae1a74/jruby-core-9.2.6.0.jar) to field java.lang.reflect.Field.modifiers
WARNING: Please consider reporting this to the maintainers of org.jruby.util.SecurityHelper
WARNING: Use --illegal-access=warn to enable warnings of further illegal reflective access operations
WARNING: All illegal access operations will be denied in a future release
Looping over pages to build nav data
Creating /home/jenkins/jenkins-slave/workspace/Solr/Solr-Check-main/solr/solr-ref-guide/build/local-jdoc-links-site-content/_data/scrollnav.json
Creating /home/jenkins/jenkins-slave/workspace/Solr/Solr-Check-main/solr/solr-ref-guide/build/local-jdoc-links-site-content/_data/sidebar.json
> Task :solr:solr-ref-guide:prepareSiteSources
Syncing source files to /home/jenkins/jenkins-slave/workspace/Solr/Solr-Check-main/solr/solr-ref-guide/build/html-site-content using props:
htmlOutDir -> ../html-site
javadocLink -> https://docs.oracle.com/en/java/javase/11/docs/api/java.base/
solrGuideDraftStatus -> DRAFT
solrRootPath -> /home/jenkins/jenkins-slave/workspace/Solr/Solr-Check-main/solr/
solrDocsVersion -> 9.0
solrGuideVersionPath -> 9_0
buildDate -> 2021-11-11
buildYear -> 2021
htmlSolrJavadocs -> https://solr.apache.org/docs/9_0_0/
htmlLuceneJavadocs -> https://lucene.apache.org/core/9_0_0-prerelease9
ivyCommonsCodec -> 1.13
ivyDropwizardMetrics -> 4.1.5
ivyHadoop -> 3.2.0
ivyLog4j -> 2.14.1
ivyOpennlpTools -> 1.9.1
ivyTika -> 1.27
ivyZookeeper -> 3.7.0
Building up tree of all known pages
WARNING: An illegal reflective access operation has occurred
WARNING: Illegal reflective access by org.jruby.util.SecurityHelper (file:/home/jenkins/.gradle/caches/modules-2/files-2.1/org.jruby/jruby-core/9.2.6.0/653601d48b38528e76840c6eac1ae46e2dae1a74/jruby-core-9.2.6.0.jar) to field java.lang.reflect.Field.modifiers
WARNING: Please consider reporting this to the maintainers of org.jruby.util.SecurityHelper
WARNING: Use --illegal-access=warn to enable warnings of further illegal reflective access operations
WARNING: All illegal access operations will be denied in a future release
Looping over pages to build nav data
Creating /home/jenkins/jenkins-slave/workspace/Solr/Solr-Check-main/solr/solr-ref-guide/build/html-site-content/_data/scrollnav.json
Creating /home/jenkins/jenkins-slave/workspace/Solr/Solr-Check-main/solr/solr-ref-guide/build/html-site-content/_data/sidebar.json
> Task :solr:solr-ref-guide:test NO-SOURCE
> Task :solr:solr-ref-guide:wipeTaskTemp
> Task :solr:solrj:test
:solr:solrj:test (SUCCESS): 1705 test(s), 16 skipped
> Task :solr:solrj:wipeTaskTemp
> Task :solr:solrj:check
> Task :solr:test-framework:test
:solr:test-framework:test (SUCCESS): 15 test(s)
> Task :solr:test-framework:wipeTaskTemp
> Task :solr:test-framework:check
> Task :solr:webapp:test NO-SOURCE
> Task :solr:webapp:wipeTaskTemp
> Task :solr:webapp:check
> Task :solr:contrib:analysis-extras:test
:solr:contrib:analysis-extras:test (SUCCESS): 30 test(s)
> Task :solr:contrib:analysis-extras:wipeTaskTemp
> Task :solr:contrib:analysis-extras:check
> Task :solr:contrib:analytics:test
:solr:contrib:analytics:test (SUCCESS): 472 test(s)
> Task :solr:contrib:analytics:wipeTaskTemp
> Task :solr:contrib:analytics:check
> Task :solr:contrib:clustering:test
:solr:contrib:clustering:test (SUCCESS): 15 test(s)
> Task :solr:contrib:clustering:wipeTaskTemp
> Task :solr:contrib:clustering:check
> Task :solr:contrib:extraction:test
:solr:contrib:extraction:test (SUCCESS): 20 test(s)
> Task :solr:contrib:extraction:wipeTaskTemp
> Task :solr:contrib:extraction:check
> Task :solr:contrib:gcs-repository:test
:solr:contrib:gcs-repository:test (SUCCESS): 13 test(s), 10 skipped
> Task :solr:contrib:gcs-repository:wipeTaskTemp
> Task :solr:contrib:gcs-repository:check
> Task :solr:contrib:jaegertracer-configurator:test
:solr:contrib:jaegertracer-configurator:test (SUCCESS): 1 test(s)
> Task :solr:contrib:jaegertracer-configurator:wipeTaskTemp
> Task :solr:contrib:jaegertracer-configurator:check
> Task :solr:contrib:langid:test
:solr:contrib:langid:test (SUCCESS): 43 test(s)
> Task :solr:contrib:langid:wipeTaskTemp
> Task :solr:contrib:langid:check
> Task :solr:contrib:ltr:test
:solr:contrib:ltr:test (SUCCESS): 164 test(s)
> Task :solr:contrib:ltr:wipeTaskTemp
> Task :solr:contrib:ltr:check
> Task :solr:contrib:prometheus-exporter:test
:solr:contrib:prometheus-exporter:test (SUCCESS): 20 test(s)
> Task :solr:contrib:prometheus-exporter:wipeTaskTemp
> Task :solr:contrib:prometheus-exporter:check
> Task :solr:contrib:s3-repository:test
:solr:contrib:s3-repository:test (SUCCESS): 42 test(s)
> Task :solr:contrib:s3-repository:wipeTaskTemp
> Task :solr:contrib:s3-repository:check
> Task :solr:contrib:scripting:test
:solr:contrib:scripting:test (SUCCESS): 22 test(s), 1 skipped
> Task :solr:contrib:scripting:wipeTaskTemp
> Task :solr:contrib:scripting:check
FAILURE: Build failed with an exception.
* What went wrong:
Execution failed for task ':solr:solr-ref-guide:jrubyPrepare'.
> Process 'command '/usr/local/asfpackages/java/oraclejdk-11.0.11/bin/java'' finished with non-zero exit value 1
* Try:
Run with --stacktrace option to get the stack trace. Run with --info or --debug option to get more log output. Run with --scan to get full insights.
* Get more help at https://help.gradle.org
Deprecated Gradle features were used in this build, making it incompatible with Gradle 8.0.
You can use '--warning-mode all' to show the individual deprecation warnings and determine if they come from your own scripts or plugins.
See https://docs.gradle.org/7.2/userguide/command_line_interface.html#sec:command_line_warnings
BUILD FAILED in 47m 39s
403 actionable tasks: 403 executed
Build step 'Invoke Gradle script' changed build result to FAILURE
Build step 'Invoke Gradle script' marked build as failure
Archiving artifacts
Recording test results
[Checks API] No suitable checks publisher found.
Email was triggered for: Failure - Any
Sending email for trigger: Failure - Any
[JENKINS] Solr » Solr-Check-main - Build # 1938 - Still Failing!
Posted by Apache Jenkins Server <je...@builds.apache.org>.
Build: https://ci-builds.apache.org/job/Solr/job/Solr-Check-main/1938/
All tests passed
Build Log:
[...truncated 708 lines...]
ERROR: Error installing /home/jenkins/.gradle/caches/modules-2/files-2.1/rubygems/http_parser.rb/0.8.0/8aa1092bbc1f10fd9622224babf2b2a98d4d4b22/http_parser.rb-0.8.0.gem:
ERROR: Failed to build gem native extension.
current directory: /home/jenkins/jenkins-slave/workspace/Solr/Solr-Check-main/solr/solr-ref-guide/build/.gems/gems/http_parser.rb-0.8.0/ext/ruby_http_parser
/usr/local/asfpackages/java/oraclejdk-11.0.11/bin/java -cp :/home/jenkins/.gradle/caches/modules-2/files-2.1/org.jruby/jruby-complete/9.2.9.0/8e44ce7a1417966d89957bd766a148601e28828b/jruby-complete-9.2.9.0.jar org.jruby.Main -r ./siteconf20211111-3693599-zzy3bh.rb extconf.rb
WARNING: An illegal reflective access operation has occurred
WARNING: Illegal reflective access by com.headius.backport9.modules.Modules (file:/home/jenkins/.gradle/caches/modules-2/files-2.1/org.jruby/jruby-complete/9.2.9.0/8e44ce7a1417966d89957bd766a148601e28828b/jruby-complete-9.2.9.0.jar) to method sun.nio.ch.NativeThread.signal(long)
WARNING: Please consider reporting this to the maintainers of com.headius.backport9.modules.Modules
WARNING: Use --illegal-access=warn to enable warnings of further illegal reflective access operations
WARNING: All illegal access operations will be denied in a future release
creating Makefile
current directory: /home/jenkins/jenkins-slave/workspace/Solr/Solr-Check-main/solr/solr-ref-guide/build/.gems/gems/http_parser.rb-0.8.0/ext/ruby_http_parser
make "DESTDIR=" clean
Makefile:225: *** multiple target patterns. Stop.
current directory: /home/jenkins/jenkins-slave/workspace/Solr/Solr-Check-main/solr/solr-ref-guide/build/.gems/gems/http_parser.rb-0.8.0/ext/ruby_http_parser
make "DESTDIR="
Makefile:225: *** multiple target patterns. Stop.
make failed, exit code 2
Gem files will remain installed in /home/jenkins/jenkins-slave/workspace/Solr/Solr-Check-main/solr/solr-ref-guide/build/.gems/gems/http_parser.rb-0.8.0 for inspection.
Results logged to /home/jenkins/jenkins-slave/workspace/Solr/Solr-Check-main/solr/solr-ref-guide/build/.gems/extensions/universal-java-11/2.5.0/http_parser.rb-0.8.0/gem_make.out
Successfully installed eventmachine-1.2.7-java
Successfully installed public_suffix-4.0.6
Successfully installed temple-0.8.2
Successfully installed asciidoctor-2.0.16
Successfully installed safe_yaml-1.0.5
Successfully installed rouge-3.26.1
Successfully installed pathutil-0.16.2
Successfully installed mercenary-0.3.6
Successfully installed liquid-4.0.3
Successfully installed kramdown-2.3.1
Successfully installed jekyll-watch-2.2.1
Successfully installed jekyll-sass-converter-1.5.2
Successfully installed em-websocket-0.5.3
Successfully installed colorator-1.1.0
Successfully installed addressable-2.8.0
Successfully installed concurrent-ruby-1.1.9
Successfully installed i18n-0.9.5
Successfully installed tilt-2.0.10
Successfully installed slim-4.1.0
Successfully installed jekyll-3.9.1
Successfully installed jekyll-asciidoc-3.0.0
29 gems installed
> Task :solr:solr-ref-guide:jrubyPrepare FAILED
> Task :solr:solr-ref-guide:prepareLocalJavadocLinksSiteSources
Syncing source files to /home/jenkins/jenkins-slave/workspace/Solr/Solr-Check-main/solr/solr-ref-guide/build/local-jdoc-links-site-content using props:
htmlOutDir -> ../local-jdoc-links-site
javadocLink -> https://docs.oracle.com/en/java/javase/11/docs/api/java.base/
solrGuideDraftStatus -> DRAFT
solrRootPath -> /home/jenkins/jenkins-slave/workspace/Solr/Solr-Check-main/solr/
solrDocsVersion -> 9.0
solrGuideVersionPath -> 9_0
buildDate -> 2021-11-11
buildYear -> 2021
htmlSolrJavadocs -> link:../../../documentation/build/site
htmlLuceneJavadocs -> link:../../../documentation/build/lucene-javadocs
ivyCommonsCodec -> 1.13
ivyDropwizardMetrics -> 4.1.5
ivyHadoop -> 3.2.0
ivyLog4j -> 2.14.1
ivyOpennlpTools -> 1.9.1
ivyTika -> 1.27
ivyZookeeper -> 3.7.0
Building up tree of all known pages
WARNING: An illegal reflective access operation has occurred
WARNING: Illegal reflective access by org.jruby.util.SecurityHelper (file:/home/jenkins/.gradle/caches/modules-2/files-2.1/org.jruby/jruby-core/9.2.6.0/653601d48b38528e76840c6eac1ae46e2dae1a74/jruby-core-9.2.6.0.jar) to field java.lang.reflect.Field.modifiers
WARNING: Please consider reporting this to the maintainers of org.jruby.util.SecurityHelper
WARNING: Use --illegal-access=warn to enable warnings of further illegal reflective access operations
WARNING: All illegal access operations will be denied in a future release
Looping over pages to build nav data
Creating /home/jenkins/jenkins-slave/workspace/Solr/Solr-Check-main/solr/solr-ref-guide/build/local-jdoc-links-site-content/_data/scrollnav.json
Creating /home/jenkins/jenkins-slave/workspace/Solr/Solr-Check-main/solr/solr-ref-guide/build/local-jdoc-links-site-content/_data/sidebar.json
> Task :solr:solr-ref-guide:prepareSiteSources
Syncing source files to /home/jenkins/jenkins-slave/workspace/Solr/Solr-Check-main/solr/solr-ref-guide/build/html-site-content using props:
htmlOutDir -> ../html-site
javadocLink -> https://docs.oracle.com/en/java/javase/11/docs/api/java.base/
solrGuideDraftStatus -> DRAFT
solrRootPath -> /home/jenkins/jenkins-slave/workspace/Solr/Solr-Check-main/solr/
solrDocsVersion -> 9.0
solrGuideVersionPath -> 9_0
buildDate -> 2021-11-11
buildYear -> 2021
htmlSolrJavadocs -> https://solr.apache.org/docs/9_0_0/
htmlLuceneJavadocs -> https://lucene.apache.org/core/9_0_0-prerelease9
ivyCommonsCodec -> 1.13
ivyDropwizardMetrics -> 4.1.5
ivyHadoop -> 3.2.0
ivyLog4j -> 2.14.1
ivyOpennlpTools -> 1.9.1
ivyTika -> 1.27
ivyZookeeper -> 3.7.0
Building up tree of all known pages
WARNING: An illegal reflective access operation has occurred
WARNING: Illegal reflective access by org.jruby.util.SecurityHelper (file:/home/jenkins/.gradle/caches/modules-2/files-2.1/org.jruby/jruby-core/9.2.6.0/653601d48b38528e76840c6eac1ae46e2dae1a74/jruby-core-9.2.6.0.jar) to field java.lang.reflect.Field.modifiers
WARNING: Please consider reporting this to the maintainers of org.jruby.util.SecurityHelper
WARNING: Use --illegal-access=warn to enable warnings of further illegal reflective access operations
WARNING: All illegal access operations will be denied in a future release
Looping over pages to build nav data
Creating /home/jenkins/jenkins-slave/workspace/Solr/Solr-Check-main/solr/solr-ref-guide/build/html-site-content/_data/scrollnav.json
Creating /home/jenkins/jenkins-slave/workspace/Solr/Solr-Check-main/solr/solr-ref-guide/build/html-site-content/_data/sidebar.json
> Task :solr:solr-ref-guide:test NO-SOURCE
> Task :solr:solr-ref-guide:wipeTaskTemp
> Task :solr:solrj:test
:solr:solrj:test (SUCCESS): 1705 test(s), 24 skipped
> Task :solr:solrj:wipeTaskTemp
> Task :solr:solrj:check
> Task :solr:test-framework:test
:solr:test-framework:test (SUCCESS): 15 test(s)
> Task :solr:test-framework:wipeTaskTemp
> Task :solr:test-framework:check
> Task :solr:webapp:test NO-SOURCE
> Task :solr:webapp:wipeTaskTemp
> Task :solr:webapp:check
> Task :solr:contrib:analysis-extras:test
:solr:contrib:analysis-extras:test (SUCCESS): 30 test(s)
> Task :solr:contrib:analysis-extras:wipeTaskTemp
> Task :solr:contrib:analysis-extras:check
> Task :solr:contrib:analytics:test
:solr:contrib:analytics:test (SUCCESS): 472 test(s)
> Task :solr:contrib:analytics:wipeTaskTemp
> Task :solr:contrib:analytics:check
> Task :solr:contrib:clustering:test
:solr:contrib:clustering:test (SUCCESS): 15 test(s)
> Task :solr:contrib:clustering:wipeTaskTemp
> Task :solr:contrib:clustering:check
> Task :solr:contrib:extraction:test
:solr:contrib:extraction:test (SUCCESS): 20 test(s)
> Task :solr:contrib:extraction:wipeTaskTemp
> Task :solr:contrib:extraction:check
> Task :solr:contrib:gcs-repository:test
:solr:contrib:gcs-repository:test (SUCCESS): 13 test(s)
> Task :solr:contrib:gcs-repository:wipeTaskTemp
> Task :solr:contrib:gcs-repository:check
> Task :solr:contrib:jaegertracer-configurator:test
:solr:contrib:jaegertracer-configurator:test (SUCCESS): 1 test(s)
> Task :solr:contrib:jaegertracer-configurator:wipeTaskTemp
> Task :solr:contrib:jaegertracer-configurator:check
> Task :solr:contrib:langid:test
:solr:contrib:langid:test (SUCCESS): 43 test(s)
> Task :solr:contrib:langid:wipeTaskTemp
> Task :solr:contrib:langid:check
> Task :solr:contrib:ltr:test
:solr:contrib:ltr:test (SUCCESS): 164 test(s)
> Task :solr:contrib:ltr:wipeTaskTemp
> Task :solr:contrib:ltr:check
> Task :solr:contrib:prometheus-exporter:test
:solr:contrib:prometheus-exporter:test (SUCCESS): 20 test(s)
> Task :solr:contrib:prometheus-exporter:wipeTaskTemp
> Task :solr:contrib:prometheus-exporter:check
> Task :solr:contrib:s3-repository:test
:solr:contrib:s3-repository:test (SUCCESS): 42 test(s)
> Task :solr:contrib:s3-repository:wipeTaskTemp
> Task :solr:contrib:s3-repository:check
> Task :solr:contrib:scripting:test
:solr:contrib:scripting:test (SUCCESS): 22 test(s), 1 skipped
> Task :solr:contrib:scripting:wipeTaskTemp
> Task :solr:contrib:scripting:check
FAILURE: Build failed with an exception.
* What went wrong:
Execution failed for task ':solr:solr-ref-guide:jrubyPrepare'.
> Process 'command '/usr/local/asfpackages/java/oraclejdk-11.0.11/bin/java'' finished with non-zero exit value 1
* Try:
Run with --stacktrace option to get the stack trace. Run with --info or --debug option to get more log output. Run with --scan to get full insights.
* Get more help at https://help.gradle.org
Deprecated Gradle features were used in this build, making it incompatible with Gradle 8.0.
You can use '--warning-mode all' to show the individual deprecation warnings and determine if they come from your own scripts or plugins.
See https://docs.gradle.org/7.2/userguide/command_line_interface.html#sec:command_line_warnings
BUILD FAILED in 47m 54s
403 actionable tasks: 403 executed
Build step 'Invoke Gradle script' changed build result to FAILURE
Build step 'Invoke Gradle script' marked build as failure
Archiving artifacts
Recording test results
[Checks API] No suitable checks publisher found.
Email was triggered for: Failure - Any
Sending email for trigger: Failure - Any
Re: [JENKINS] Solr » Solr-Check-main - Build # 1937 - Failure!
Posted by Chris Hostetter <ho...@fucit.org>.
Created https://issues.apache.org/jira/browse/SOLR-15793
...I'm out of ideas of how to try and fix this.
: Date: Thu, 11 Nov 2021 10:19:18 -0700 (MST)
: From: Chris Hostetter <ho...@fucit.org>
: To: dev@solr.apache.org
: Cc: builds@solr.apache.org
: Subject: Re: [JENKINS] Solr » Solr-Check-main - Build # 1937 - Failure!
:
:
: This problem reproduces for me locally as well.
:
: It doesn't seem to be related to any recent changes -- even checking out a
: Git SHA from several weeks ago when 'gradle check' passed just fine now
: enounters this jruby/gem failure -- making me suspect something in a
: remote gem/dep that we fetch is now different?
:
:
: : Date: Thu, 11 Nov 2021 09:03:55 +0000 (UTC)
: : From: Apache Jenkins Server <je...@builds.apache.org>
: : Reply-To: dev@solr.apache.org
: : To: builds@solr.apache.org
: : Subject: [JENKINS] Solr » Solr-Check-main - Build # 1937 - Failure!
: :
: : Build: https://ci-builds.apache.org/job/Solr/job/Solr-Check-main/1937/
: :
: : All tests passed
: :
: : Build Log:
: : [...truncated 708 lines...]
: : ERROR: Error installing /home/jenkins/.gradle/caches/modules-2/files-2.1/rubygems/http_parser.rb/0.8.0/8aa1092bbc1f10fd9622224babf2b2a98d4d4b22/http_parser.rb-0.8.0.gem:
: : ERROR: Failed to build gem native extension.
: :
: : current directory: /home/jenkins/jenkins-slave/workspace/Solr/Solr-Check-main/solr/solr-ref-guide/build/.gems/gems/http_parser.rb-0.8.0/ext/ruby_http_parser
: : /usr/local/asfpackages/java/oraclejdk-11.0.11/bin/java -cp :/home/jenkins/.gradle/caches/modules-2/files-2.1/org.jruby/jruby-complete/9.2.9.0/8e44ce7a1417966d89957bd766a148601e28828b/jruby-complete-9.2.9.0.jar org.jruby.Main -r ./siteconf20211111-3140105-3po9z4.rb extconf.rb
: : WARNING: An illegal reflective access operation has occurred
: : WARNING: Illegal reflective access by com.headius.backport9.modules.Modules (file:/home/jenkins/.gradle/caches/modules-2/files-2.1/org.jruby/jruby-complete/9.2.9.0/8e44ce7a1417966d89957bd766a148601e28828b/jruby-complete-9.2.9.0.jar) to method sun.nio.ch.NativeThread.signal(long)
: : WARNING: Please consider reporting this to the maintainers of com.headius.backport9.modules.Modules
: : WARNING: Use --illegal-access=warn to enable warnings of further illegal reflective access operations
: : WARNING: All illegal access operations will be denied in a future release
: : creating Makefile
: :
: : current directory: /home/jenkins/jenkins-slave/workspace/Solr/Solr-Check-main/solr/solr-ref-guide/build/.gems/gems/http_parser.rb-0.8.0/ext/ruby_http_parser
: : make "DESTDIR=" clean
: : Makefile:225: *** multiple target patterns. Stop.
: :
: : current directory: /home/jenkins/jenkins-slave/workspace/Solr/Solr-Check-main/solr/solr-ref-guide/build/.gems/gems/http_parser.rb-0.8.0/ext/ruby_http_parser
: : make "DESTDIR="
: : Makefile:225: *** multiple target patterns. Stop.
: :
: : make failed, exit code 2
: :
: : Gem files will remain installed in /home/jenkins/jenkins-slave/workspace/Solr/Solr-Check-main/solr/solr-ref-guide/build/.gems/gems/http_parser.rb-0.8.0 for inspection.
: : Results logged to /home/jenkins/jenkins-slave/workspace/Solr/Solr-Check-main/solr/solr-ref-guide/build/.gems/extensions/universal-java-11/2.5.0/http_parser.rb-0.8.0/gem_make.out
: : Successfully installed eventmachine-1.2.7-java
: : Successfully installed public_suffix-4.0.6
: : Successfully installed temple-0.8.2
: : Successfully installed asciidoctor-2.0.16
: : Successfully installed safe_yaml-1.0.5
: : Successfully installed rouge-3.26.1
: : Successfully installed pathutil-0.16.2
: : Successfully installed mercenary-0.3.6
: : Successfully installed liquid-4.0.3
: : Successfully installed kramdown-2.3.1
: : Successfully installed jekyll-watch-2.2.1
: : Successfully installed jekyll-sass-converter-1.5.2
: : Successfully installed em-websocket-0.5.3
: : Successfully installed colorator-1.1.0
: : Successfully installed addressable-2.8.0
: : Successfully installed concurrent-ruby-1.1.9
: : Successfully installed i18n-0.9.5
: : Successfully installed tilt-2.0.10
: : Successfully installed slim-4.1.0
: : Successfully installed jekyll-3.9.1
: : Successfully installed jekyll-asciidoc-3.0.0
: : 29 gems installed
: :
: : > Task :solr:solr-ref-guide:jrubyPrepare FAILED
: :
: : > Task :solr:solr-ref-guide:prepareLocalJavadocLinksSiteSources
: : Syncing source files to /home/jenkins/jenkins-slave/workspace/Solr/Solr-Check-main/solr/solr-ref-guide/build/local-jdoc-links-site-content using props:
: : htmlOutDir -> ../local-jdoc-links-site
: : javadocLink -> https://docs.oracle.com/en/java/javase/11/docs/api/java.base/
: : solrGuideDraftStatus -> DRAFT
: : solrRootPath -> /home/jenkins/jenkins-slave/workspace/Solr/Solr-Check-main/solr/
: : solrDocsVersion -> 9.0
: : solrGuideVersionPath -> 9_0
: : buildDate -> 2021-11-11
: : buildYear -> 2021
: : htmlSolrJavadocs -> link:../../../documentation/build/site
: : htmlLuceneJavadocs -> link:../../../documentation/build/lucene-javadocs
: : ivyCommonsCodec -> 1.13
: : ivyDropwizardMetrics -> 4.1.5
: : ivyHadoop -> 3.2.0
: : ivyLog4j -> 2.14.1
: : ivyOpennlpTools -> 1.9.1
: : ivyTika -> 1.27
: : ivyZookeeper -> 3.7.0
: : Building up tree of all known pages
: : WARNING: An illegal reflective access operation has occurred
: : WARNING: Illegal reflective access by org.jruby.util.SecurityHelper (file:/home/jenkins/.gradle/caches/modules-2/files-2.1/org.jruby/jruby-core/9.2.6.0/653601d48b38528e76840c6eac1ae46e2dae1a74/jruby-core-9.2.6.0.jar) to field java.lang.reflect.Field.modifiers
: : WARNING: Please consider reporting this to the maintainers of org.jruby.util.SecurityHelper
: : WARNING: Use --illegal-access=warn to enable warnings of further illegal reflective access operations
: : WARNING: All illegal access operations will be denied in a future release
: : Looping over pages to build nav data
: : Creating /home/jenkins/jenkins-slave/workspace/Solr/Solr-Check-main/solr/solr-ref-guide/build/local-jdoc-links-site-content/_data/scrollnav.json
: : Creating /home/jenkins/jenkins-slave/workspace/Solr/Solr-Check-main/solr/solr-ref-guide/build/local-jdoc-links-site-content/_data/sidebar.json
: :
: : > Task :solr:solr-ref-guide:prepareSiteSources
: : Syncing source files to /home/jenkins/jenkins-slave/workspace/Solr/Solr-Check-main/solr/solr-ref-guide/build/html-site-content using props:
: : htmlOutDir -> ../html-site
: : javadocLink -> https://docs.oracle.com/en/java/javase/11/docs/api/java.base/
: : solrGuideDraftStatus -> DRAFT
: : solrRootPath -> /home/jenkins/jenkins-slave/workspace/Solr/Solr-Check-main/solr/
: : solrDocsVersion -> 9.0
: : solrGuideVersionPath -> 9_0
: : buildDate -> 2021-11-11
: : buildYear -> 2021
: : htmlSolrJavadocs -> https://solr.apache.org/docs/9_0_0/
: : htmlLuceneJavadocs -> https://lucene.apache.org/core/9_0_0-prerelease9
: : ivyCommonsCodec -> 1.13
: : ivyDropwizardMetrics -> 4.1.5
: : ivyHadoop -> 3.2.0
: : ivyLog4j -> 2.14.1
: : ivyOpennlpTools -> 1.9.1
: : ivyTika -> 1.27
: : ivyZookeeper -> 3.7.0
: : Building up tree of all known pages
: : WARNING: An illegal reflective access operation has occurred
: : WARNING: Illegal reflective access by org.jruby.util.SecurityHelper (file:/home/jenkins/.gradle/caches/modules-2/files-2.1/org.jruby/jruby-core/9.2.6.0/653601d48b38528e76840c6eac1ae46e2dae1a74/jruby-core-9.2.6.0.jar) to field java.lang.reflect.Field.modifiers
: : WARNING: Please consider reporting this to the maintainers of org.jruby.util.SecurityHelper
: : WARNING: Use --illegal-access=warn to enable warnings of further illegal reflective access operations
: : WARNING: All illegal access operations will be denied in a future release
: : Looping over pages to build nav data
: : Creating /home/jenkins/jenkins-slave/workspace/Solr/Solr-Check-main/solr/solr-ref-guide/build/html-site-content/_data/scrollnav.json
: : Creating /home/jenkins/jenkins-slave/workspace/Solr/Solr-Check-main/solr/solr-ref-guide/build/html-site-content/_data/sidebar.json
: :
: : > Task :solr:solr-ref-guide:test NO-SOURCE
: : > Task :solr:solr-ref-guide:wipeTaskTemp
: : > Task :solr:solrj:test
: : :solr:solrj:test (SUCCESS): 1705 test(s), 25 skipped
: :
: : > Task :solr:solrj:wipeTaskTemp
: : > Task :solr:solrj:check
: :
: : > Task :solr:test-framework:test
: : :solr:test-framework:test (SUCCESS): 15 test(s)
: :
: : > Task :solr:test-framework:wipeTaskTemp
: : > Task :solr:test-framework:check
: : > Task :solr:webapp:test NO-SOURCE
: : > Task :solr:webapp:wipeTaskTemp
: : > Task :solr:webapp:check
: :
: : > Task :solr:contrib:analysis-extras:test
: : :solr:contrib:analysis-extras:test (SUCCESS): 30 test(s)
: :
: : > Task :solr:contrib:analysis-extras:wipeTaskTemp
: : > Task :solr:contrib:analysis-extras:check
: : > Task :solr:contrib:analytics:test
: : :solr:contrib:analytics:test (SUCCESS): 472 test(s)
: :
: : > Task :solr:contrib:analytics:wipeTaskTemp
: : > Task :solr:contrib:analytics:check
: :
: : > Task :solr:contrib:clustering:test
: : :solr:contrib:clustering:test (SUCCESS): 15 test(s)
: :
: : > Task :solr:contrib:clustering:wipeTaskTemp
: : > Task :solr:contrib:clustering:check
: :
: : > Task :solr:contrib:extraction:test
: : :solr:contrib:extraction:test (SUCCESS): 20 test(s)
: :
: : > Task :solr:contrib:extraction:wipeTaskTemp
: : > Task :solr:contrib:extraction:check
: : > Task :solr:contrib:gcs-repository:test
: : :solr:contrib:gcs-repository:test (SUCCESS): 13 test(s), 10 skipped
: :
: : > Task :solr:contrib:gcs-repository:wipeTaskTemp
: : > Task :solr:contrib:gcs-repository:check
: :
: : > Task :solr:contrib:jaegertracer-configurator:test
: : :solr:contrib:jaegertracer-configurator:test (SUCCESS): 1 test(s)
: :
: : > Task :solr:contrib:jaegertracer-configurator:wipeTaskTemp
: : > Task :solr:contrib:jaegertracer-configurator:check
: :
: : > Task :solr:contrib:langid:test
: : :solr:contrib:langid:test (SUCCESS): 43 test(s)
: :
: : > Task :solr:contrib:langid:wipeTaskTemp
: : > Task :solr:contrib:langid:check
: : > Task :solr:contrib:ltr:test
: : :solr:contrib:ltr:test (SUCCESS): 164 test(s)
: :
: : > Task :solr:contrib:ltr:wipeTaskTemp
: : > Task :solr:contrib:ltr:check
: :
: : > Task :solr:contrib:prometheus-exporter:test
: : :solr:contrib:prometheus-exporter:test (SUCCESS): 20 test(s)
: :
: : > Task :solr:contrib:prometheus-exporter:wipeTaskTemp
: : > Task :solr:contrib:prometheus-exporter:check
: : > Task :solr:contrib:s3-repository:test
: : :solr:contrib:s3-repository:test (SUCCESS): 42 test(s)
: :
: : > Task :solr:contrib:s3-repository:wipeTaskTemp
: : > Task :solr:contrib:s3-repository:check
: :
: : > Task :solr:contrib:scripting:test
: : :solr:contrib:scripting:test (SUCCESS): 22 test(s), 1 skipped
: :
: : > Task :solr:contrib:scripting:wipeTaskTemp
: : > Task :solr:contrib:scripting:check
: :
: : FAILURE: Build failed with an exception.
: :
: : * What went wrong:
: : Execution failed for task ':solr:solr-ref-guide:jrubyPrepare'.
: : > Process 'command '/usr/local/asfpackages/java/oraclejdk-11.0.11/bin/java'' finished with non-zero exit value 1
: :
: : * Try:
: : Run with --stacktrace option to get the stack trace. Run with --info or --debug option to get more log output. Run with --scan to get full insights.
: :
: : * Get more help at https://help.gradle.org
: :
: : Deprecated Gradle features were used in this build, making it incompatible with Gradle 8.0.
: :
: : You can use '--warning-mode all' to show the individual deprecation warnings and determine if they come from your own scripts or plugins.
: :
: : See https://docs.gradle.org/7.2/userguide/command_line_interface.html#sec:command_line_warnings
: :
: : BUILD FAILED in 49m 1s
: : 403 actionable tasks: 403 executed
: : Build step 'Invoke Gradle script' changed build result to FAILURE
: : Build step 'Invoke Gradle script' marked build as failure
: : Archiving artifacts
: : Recording test results
: : [Checks API] No suitable checks publisher found.
: : Email was triggered for: Failure - Any
: : Sending email for trigger: Failure - Any
: :
:
: -Hoss
: http://www.lucidworks.com/
-Hoss
Re: [JENKINS] Solr » Solr-Check-main - Build # 1937 - Failure!
Posted by Chris Hostetter <ho...@fucit.org>.
Created https://issues.apache.org/jira/browse/SOLR-15793
...I'm out of ideas of how to try and fix this.
: Date: Thu, 11 Nov 2021 10:19:18 -0700 (MST)
: From: Chris Hostetter <ho...@fucit.org>
: To: dev@solr.apache.org
: Cc: builds@solr.apache.org
: Subject: Re: [JENKINS] Solr » Solr-Check-main - Build # 1937 - Failure!
:
:
: This problem reproduces for me locally as well.
:
: It doesn't seem to be related to any recent changes -- even checking out a
: Git SHA from several weeks ago when 'gradle check' passed just fine now
: enounters this jruby/gem failure -- making me suspect something in a
: remote gem/dep that we fetch is now different?
:
:
: : Date: Thu, 11 Nov 2021 09:03:55 +0000 (UTC)
: : From: Apache Jenkins Server <je...@builds.apache.org>
: : Reply-To: dev@solr.apache.org
: : To: builds@solr.apache.org
: : Subject: [JENKINS] Solr » Solr-Check-main - Build # 1937 - Failure!
: :
: : Build: https://ci-builds.apache.org/job/Solr/job/Solr-Check-main/1937/
: :
: : All tests passed
: :
: : Build Log:
: : [...truncated 708 lines...]
: : ERROR: Error installing /home/jenkins/.gradle/caches/modules-2/files-2.1/rubygems/http_parser.rb/0.8.0/8aa1092bbc1f10fd9622224babf2b2a98d4d4b22/http_parser.rb-0.8.0.gem:
: : ERROR: Failed to build gem native extension.
: :
: : current directory: /home/jenkins/jenkins-slave/workspace/Solr/Solr-Check-main/solr/solr-ref-guide/build/.gems/gems/http_parser.rb-0.8.0/ext/ruby_http_parser
: : /usr/local/asfpackages/java/oraclejdk-11.0.11/bin/java -cp :/home/jenkins/.gradle/caches/modules-2/files-2.1/org.jruby/jruby-complete/9.2.9.0/8e44ce7a1417966d89957bd766a148601e28828b/jruby-complete-9.2.9.0.jar org.jruby.Main -r ./siteconf20211111-3140105-3po9z4.rb extconf.rb
: : WARNING: An illegal reflective access operation has occurred
: : WARNING: Illegal reflective access by com.headius.backport9.modules.Modules (file:/home/jenkins/.gradle/caches/modules-2/files-2.1/org.jruby/jruby-complete/9.2.9.0/8e44ce7a1417966d89957bd766a148601e28828b/jruby-complete-9.2.9.0.jar) to method sun.nio.ch.NativeThread.signal(long)
: : WARNING: Please consider reporting this to the maintainers of com.headius.backport9.modules.Modules
: : WARNING: Use --illegal-access=warn to enable warnings of further illegal reflective access operations
: : WARNING: All illegal access operations will be denied in a future release
: : creating Makefile
: :
: : current directory: /home/jenkins/jenkins-slave/workspace/Solr/Solr-Check-main/solr/solr-ref-guide/build/.gems/gems/http_parser.rb-0.8.0/ext/ruby_http_parser
: : make "DESTDIR=" clean
: : Makefile:225: *** multiple target patterns. Stop.
: :
: : current directory: /home/jenkins/jenkins-slave/workspace/Solr/Solr-Check-main/solr/solr-ref-guide/build/.gems/gems/http_parser.rb-0.8.0/ext/ruby_http_parser
: : make "DESTDIR="
: : Makefile:225: *** multiple target patterns. Stop.
: :
: : make failed, exit code 2
: :
: : Gem files will remain installed in /home/jenkins/jenkins-slave/workspace/Solr/Solr-Check-main/solr/solr-ref-guide/build/.gems/gems/http_parser.rb-0.8.0 for inspection.
: : Results logged to /home/jenkins/jenkins-slave/workspace/Solr/Solr-Check-main/solr/solr-ref-guide/build/.gems/extensions/universal-java-11/2.5.0/http_parser.rb-0.8.0/gem_make.out
: : Successfully installed eventmachine-1.2.7-java
: : Successfully installed public_suffix-4.0.6
: : Successfully installed temple-0.8.2
: : Successfully installed asciidoctor-2.0.16
: : Successfully installed safe_yaml-1.0.5
: : Successfully installed rouge-3.26.1
: : Successfully installed pathutil-0.16.2
: : Successfully installed mercenary-0.3.6
: : Successfully installed liquid-4.0.3
: : Successfully installed kramdown-2.3.1
: : Successfully installed jekyll-watch-2.2.1
: : Successfully installed jekyll-sass-converter-1.5.2
: : Successfully installed em-websocket-0.5.3
: : Successfully installed colorator-1.1.0
: : Successfully installed addressable-2.8.0
: : Successfully installed concurrent-ruby-1.1.9
: : Successfully installed i18n-0.9.5
: : Successfully installed tilt-2.0.10
: : Successfully installed slim-4.1.0
: : Successfully installed jekyll-3.9.1
: : Successfully installed jekyll-asciidoc-3.0.0
: : 29 gems installed
: :
: : > Task :solr:solr-ref-guide:jrubyPrepare FAILED
: :
: : > Task :solr:solr-ref-guide:prepareLocalJavadocLinksSiteSources
: : Syncing source files to /home/jenkins/jenkins-slave/workspace/Solr/Solr-Check-main/solr/solr-ref-guide/build/local-jdoc-links-site-content using props:
: : htmlOutDir -> ../local-jdoc-links-site
: : javadocLink -> https://docs.oracle.com/en/java/javase/11/docs/api/java.base/
: : solrGuideDraftStatus -> DRAFT
: : solrRootPath -> /home/jenkins/jenkins-slave/workspace/Solr/Solr-Check-main/solr/
: : solrDocsVersion -> 9.0
: : solrGuideVersionPath -> 9_0
: : buildDate -> 2021-11-11
: : buildYear -> 2021
: : htmlSolrJavadocs -> link:../../../documentation/build/site
: : htmlLuceneJavadocs -> link:../../../documentation/build/lucene-javadocs
: : ivyCommonsCodec -> 1.13
: : ivyDropwizardMetrics -> 4.1.5
: : ivyHadoop -> 3.2.0
: : ivyLog4j -> 2.14.1
: : ivyOpennlpTools -> 1.9.1
: : ivyTika -> 1.27
: : ivyZookeeper -> 3.7.0
: : Building up tree of all known pages
: : WARNING: An illegal reflective access operation has occurred
: : WARNING: Illegal reflective access by org.jruby.util.SecurityHelper (file:/home/jenkins/.gradle/caches/modules-2/files-2.1/org.jruby/jruby-core/9.2.6.0/653601d48b38528e76840c6eac1ae46e2dae1a74/jruby-core-9.2.6.0.jar) to field java.lang.reflect.Field.modifiers
: : WARNING: Please consider reporting this to the maintainers of org.jruby.util.SecurityHelper
: : WARNING: Use --illegal-access=warn to enable warnings of further illegal reflective access operations
: : WARNING: All illegal access operations will be denied in a future release
: : Looping over pages to build nav data
: : Creating /home/jenkins/jenkins-slave/workspace/Solr/Solr-Check-main/solr/solr-ref-guide/build/local-jdoc-links-site-content/_data/scrollnav.json
: : Creating /home/jenkins/jenkins-slave/workspace/Solr/Solr-Check-main/solr/solr-ref-guide/build/local-jdoc-links-site-content/_data/sidebar.json
: :
: : > Task :solr:solr-ref-guide:prepareSiteSources
: : Syncing source files to /home/jenkins/jenkins-slave/workspace/Solr/Solr-Check-main/solr/solr-ref-guide/build/html-site-content using props:
: : htmlOutDir -> ../html-site
: : javadocLink -> https://docs.oracle.com/en/java/javase/11/docs/api/java.base/
: : solrGuideDraftStatus -> DRAFT
: : solrRootPath -> /home/jenkins/jenkins-slave/workspace/Solr/Solr-Check-main/solr/
: : solrDocsVersion -> 9.0
: : solrGuideVersionPath -> 9_0
: : buildDate -> 2021-11-11
: : buildYear -> 2021
: : htmlSolrJavadocs -> https://solr.apache.org/docs/9_0_0/
: : htmlLuceneJavadocs -> https://lucene.apache.org/core/9_0_0-prerelease9
: : ivyCommonsCodec -> 1.13
: : ivyDropwizardMetrics -> 4.1.5
: : ivyHadoop -> 3.2.0
: : ivyLog4j -> 2.14.1
: : ivyOpennlpTools -> 1.9.1
: : ivyTika -> 1.27
: : ivyZookeeper -> 3.7.0
: : Building up tree of all known pages
: : WARNING: An illegal reflective access operation has occurred
: : WARNING: Illegal reflective access by org.jruby.util.SecurityHelper (file:/home/jenkins/.gradle/caches/modules-2/files-2.1/org.jruby/jruby-core/9.2.6.0/653601d48b38528e76840c6eac1ae46e2dae1a74/jruby-core-9.2.6.0.jar) to field java.lang.reflect.Field.modifiers
: : WARNING: Please consider reporting this to the maintainers of org.jruby.util.SecurityHelper
: : WARNING: Use --illegal-access=warn to enable warnings of further illegal reflective access operations
: : WARNING: All illegal access operations will be denied in a future release
: : Looping over pages to build nav data
: : Creating /home/jenkins/jenkins-slave/workspace/Solr/Solr-Check-main/solr/solr-ref-guide/build/html-site-content/_data/scrollnav.json
: : Creating /home/jenkins/jenkins-slave/workspace/Solr/Solr-Check-main/solr/solr-ref-guide/build/html-site-content/_data/sidebar.json
: :
: : > Task :solr:solr-ref-guide:test NO-SOURCE
: : > Task :solr:solr-ref-guide:wipeTaskTemp
: : > Task :solr:solrj:test
: : :solr:solrj:test (SUCCESS): 1705 test(s), 25 skipped
: :
: : > Task :solr:solrj:wipeTaskTemp
: : > Task :solr:solrj:check
: :
: : > Task :solr:test-framework:test
: : :solr:test-framework:test (SUCCESS): 15 test(s)
: :
: : > Task :solr:test-framework:wipeTaskTemp
: : > Task :solr:test-framework:check
: : > Task :solr:webapp:test NO-SOURCE
: : > Task :solr:webapp:wipeTaskTemp
: : > Task :solr:webapp:check
: :
: : > Task :solr:contrib:analysis-extras:test
: : :solr:contrib:analysis-extras:test (SUCCESS): 30 test(s)
: :
: : > Task :solr:contrib:analysis-extras:wipeTaskTemp
: : > Task :solr:contrib:analysis-extras:check
: : > Task :solr:contrib:analytics:test
: : :solr:contrib:analytics:test (SUCCESS): 472 test(s)
: :
: : > Task :solr:contrib:analytics:wipeTaskTemp
: : > Task :solr:contrib:analytics:check
: :
: : > Task :solr:contrib:clustering:test
: : :solr:contrib:clustering:test (SUCCESS): 15 test(s)
: :
: : > Task :solr:contrib:clustering:wipeTaskTemp
: : > Task :solr:contrib:clustering:check
: :
: : > Task :solr:contrib:extraction:test
: : :solr:contrib:extraction:test (SUCCESS): 20 test(s)
: :
: : > Task :solr:contrib:extraction:wipeTaskTemp
: : > Task :solr:contrib:extraction:check
: : > Task :solr:contrib:gcs-repository:test
: : :solr:contrib:gcs-repository:test (SUCCESS): 13 test(s), 10 skipped
: :
: : > Task :solr:contrib:gcs-repository:wipeTaskTemp
: : > Task :solr:contrib:gcs-repository:check
: :
: : > Task :solr:contrib:jaegertracer-configurator:test
: : :solr:contrib:jaegertracer-configurator:test (SUCCESS): 1 test(s)
: :
: : > Task :solr:contrib:jaegertracer-configurator:wipeTaskTemp
: : > Task :solr:contrib:jaegertracer-configurator:check
: :
: : > Task :solr:contrib:langid:test
: : :solr:contrib:langid:test (SUCCESS): 43 test(s)
: :
: : > Task :solr:contrib:langid:wipeTaskTemp
: : > Task :solr:contrib:langid:check
: : > Task :solr:contrib:ltr:test
: : :solr:contrib:ltr:test (SUCCESS): 164 test(s)
: :
: : > Task :solr:contrib:ltr:wipeTaskTemp
: : > Task :solr:contrib:ltr:check
: :
: : > Task :solr:contrib:prometheus-exporter:test
: : :solr:contrib:prometheus-exporter:test (SUCCESS): 20 test(s)
: :
: : > Task :solr:contrib:prometheus-exporter:wipeTaskTemp
: : > Task :solr:contrib:prometheus-exporter:check
: : > Task :solr:contrib:s3-repository:test
: : :solr:contrib:s3-repository:test (SUCCESS): 42 test(s)
: :
: : > Task :solr:contrib:s3-repository:wipeTaskTemp
: : > Task :solr:contrib:s3-repository:check
: :
: : > Task :solr:contrib:scripting:test
: : :solr:contrib:scripting:test (SUCCESS): 22 test(s), 1 skipped
: :
: : > Task :solr:contrib:scripting:wipeTaskTemp
: : > Task :solr:contrib:scripting:check
: :
: : FAILURE: Build failed with an exception.
: :
: : * What went wrong:
: : Execution failed for task ':solr:solr-ref-guide:jrubyPrepare'.
: : > Process 'command '/usr/local/asfpackages/java/oraclejdk-11.0.11/bin/java'' finished with non-zero exit value 1
: :
: : * Try:
: : Run with --stacktrace option to get the stack trace. Run with --info or --debug option to get more log output. Run with --scan to get full insights.
: :
: : * Get more help at https://help.gradle.org
: :
: : Deprecated Gradle features were used in this build, making it incompatible with Gradle 8.0.
: :
: : You can use '--warning-mode all' to show the individual deprecation warnings and determine if they come from your own scripts or plugins.
: :
: : See https://docs.gradle.org/7.2/userguide/command_line_interface.html#sec:command_line_warnings
: :
: : BUILD FAILED in 49m 1s
: : 403 actionable tasks: 403 executed
: : Build step 'Invoke Gradle script' changed build result to FAILURE
: : Build step 'Invoke Gradle script' marked build as failure
: : Archiving artifacts
: : Recording test results
: : [Checks API] No suitable checks publisher found.
: : Email was triggered for: Failure - Any
: : Sending email for trigger: Failure - Any
: :
:
: -Hoss
: http://www.lucidworks.com/
-Hoss
Re: [JENKINS] Solr » Solr-Check-main - Build # 1937 - Failure!
Posted by Chris Hostetter <ho...@fucit.org>.
This problem reproduces for me locally as well.
It doesn't seem to be related to any recent changes -- even checking out a
Git SHA from several weeks ago when 'gradle check' passed just fine now
enounters this jruby/gem failure -- making me suspect something in a
remote gem/dep that we fetch is now different?
: Date: Thu, 11 Nov 2021 09:03:55 +0000 (UTC)
: From: Apache Jenkins Server <je...@builds.apache.org>
: Reply-To: dev@solr.apache.org
: To: builds@solr.apache.org
: Subject: [JENKINS] Solr » Solr-Check-main - Build # 1937 - Failure!
:
: Build: https://ci-builds.apache.org/job/Solr/job/Solr-Check-main/1937/
:
: All tests passed
:
: Build Log:
: [...truncated 708 lines...]
: ERROR: Error installing /home/jenkins/.gradle/caches/modules-2/files-2.1/rubygems/http_parser.rb/0.8.0/8aa1092bbc1f10fd9622224babf2b2a98d4d4b22/http_parser.rb-0.8.0.gem:
: ERROR: Failed to build gem native extension.
:
: current directory: /home/jenkins/jenkins-slave/workspace/Solr/Solr-Check-main/solr/solr-ref-guide/build/.gems/gems/http_parser.rb-0.8.0/ext/ruby_http_parser
: /usr/local/asfpackages/java/oraclejdk-11.0.11/bin/java -cp :/home/jenkins/.gradle/caches/modules-2/files-2.1/org.jruby/jruby-complete/9.2.9.0/8e44ce7a1417966d89957bd766a148601e28828b/jruby-complete-9.2.9.0.jar org.jruby.Main -r ./siteconf20211111-3140105-3po9z4.rb extconf.rb
: WARNING: An illegal reflective access operation has occurred
: WARNING: Illegal reflective access by com.headius.backport9.modules.Modules (file:/home/jenkins/.gradle/caches/modules-2/files-2.1/org.jruby/jruby-complete/9.2.9.0/8e44ce7a1417966d89957bd766a148601e28828b/jruby-complete-9.2.9.0.jar) to method sun.nio.ch.NativeThread.signal(long)
: WARNING: Please consider reporting this to the maintainers of com.headius.backport9.modules.Modules
: WARNING: Use --illegal-access=warn to enable warnings of further illegal reflective access operations
: WARNING: All illegal access operations will be denied in a future release
: creating Makefile
:
: current directory: /home/jenkins/jenkins-slave/workspace/Solr/Solr-Check-main/solr/solr-ref-guide/build/.gems/gems/http_parser.rb-0.8.0/ext/ruby_http_parser
: make "DESTDIR=" clean
: Makefile:225: *** multiple target patterns. Stop.
:
: current directory: /home/jenkins/jenkins-slave/workspace/Solr/Solr-Check-main/solr/solr-ref-guide/build/.gems/gems/http_parser.rb-0.8.0/ext/ruby_http_parser
: make "DESTDIR="
: Makefile:225: *** multiple target patterns. Stop.
:
: make failed, exit code 2
:
: Gem files will remain installed in /home/jenkins/jenkins-slave/workspace/Solr/Solr-Check-main/solr/solr-ref-guide/build/.gems/gems/http_parser.rb-0.8.0 for inspection.
: Results logged to /home/jenkins/jenkins-slave/workspace/Solr/Solr-Check-main/solr/solr-ref-guide/build/.gems/extensions/universal-java-11/2.5.0/http_parser.rb-0.8.0/gem_make.out
: Successfully installed eventmachine-1.2.7-java
: Successfully installed public_suffix-4.0.6
: Successfully installed temple-0.8.2
: Successfully installed asciidoctor-2.0.16
: Successfully installed safe_yaml-1.0.5
: Successfully installed rouge-3.26.1
: Successfully installed pathutil-0.16.2
: Successfully installed mercenary-0.3.6
: Successfully installed liquid-4.0.3
: Successfully installed kramdown-2.3.1
: Successfully installed jekyll-watch-2.2.1
: Successfully installed jekyll-sass-converter-1.5.2
: Successfully installed em-websocket-0.5.3
: Successfully installed colorator-1.1.0
: Successfully installed addressable-2.8.0
: Successfully installed concurrent-ruby-1.1.9
: Successfully installed i18n-0.9.5
: Successfully installed tilt-2.0.10
: Successfully installed slim-4.1.0
: Successfully installed jekyll-3.9.1
: Successfully installed jekyll-asciidoc-3.0.0
: 29 gems installed
:
: > Task :solr:solr-ref-guide:jrubyPrepare FAILED
:
: > Task :solr:solr-ref-guide:prepareLocalJavadocLinksSiteSources
: Syncing source files to /home/jenkins/jenkins-slave/workspace/Solr/Solr-Check-main/solr/solr-ref-guide/build/local-jdoc-links-site-content using props:
: htmlOutDir -> ../local-jdoc-links-site
: javadocLink -> https://docs.oracle.com/en/java/javase/11/docs/api/java.base/
: solrGuideDraftStatus -> DRAFT
: solrRootPath -> /home/jenkins/jenkins-slave/workspace/Solr/Solr-Check-main/solr/
: solrDocsVersion -> 9.0
: solrGuideVersionPath -> 9_0
: buildDate -> 2021-11-11
: buildYear -> 2021
: htmlSolrJavadocs -> link:../../../documentation/build/site
: htmlLuceneJavadocs -> link:../../../documentation/build/lucene-javadocs
: ivyCommonsCodec -> 1.13
: ivyDropwizardMetrics -> 4.1.5
: ivyHadoop -> 3.2.0
: ivyLog4j -> 2.14.1
: ivyOpennlpTools -> 1.9.1
: ivyTika -> 1.27
: ivyZookeeper -> 3.7.0
: Building up tree of all known pages
: WARNING: An illegal reflective access operation has occurred
: WARNING: Illegal reflective access by org.jruby.util.SecurityHelper (file:/home/jenkins/.gradle/caches/modules-2/files-2.1/org.jruby/jruby-core/9.2.6.0/653601d48b38528e76840c6eac1ae46e2dae1a74/jruby-core-9.2.6.0.jar) to field java.lang.reflect.Field.modifiers
: WARNING: Please consider reporting this to the maintainers of org.jruby.util.SecurityHelper
: WARNING: Use --illegal-access=warn to enable warnings of further illegal reflective access operations
: WARNING: All illegal access operations will be denied in a future release
: Looping over pages to build nav data
: Creating /home/jenkins/jenkins-slave/workspace/Solr/Solr-Check-main/solr/solr-ref-guide/build/local-jdoc-links-site-content/_data/scrollnav.json
: Creating /home/jenkins/jenkins-slave/workspace/Solr/Solr-Check-main/solr/solr-ref-guide/build/local-jdoc-links-site-content/_data/sidebar.json
:
: > Task :solr:solr-ref-guide:prepareSiteSources
: Syncing source files to /home/jenkins/jenkins-slave/workspace/Solr/Solr-Check-main/solr/solr-ref-guide/build/html-site-content using props:
: htmlOutDir -> ../html-site
: javadocLink -> https://docs.oracle.com/en/java/javase/11/docs/api/java.base/
: solrGuideDraftStatus -> DRAFT
: solrRootPath -> /home/jenkins/jenkins-slave/workspace/Solr/Solr-Check-main/solr/
: solrDocsVersion -> 9.0
: solrGuideVersionPath -> 9_0
: buildDate -> 2021-11-11
: buildYear -> 2021
: htmlSolrJavadocs -> https://solr.apache.org/docs/9_0_0/
: htmlLuceneJavadocs -> https://lucene.apache.org/core/9_0_0-prerelease9
: ivyCommonsCodec -> 1.13
: ivyDropwizardMetrics -> 4.1.5
: ivyHadoop -> 3.2.0
: ivyLog4j -> 2.14.1
: ivyOpennlpTools -> 1.9.1
: ivyTika -> 1.27
: ivyZookeeper -> 3.7.0
: Building up tree of all known pages
: WARNING: An illegal reflective access operation has occurred
: WARNING: Illegal reflective access by org.jruby.util.SecurityHelper (file:/home/jenkins/.gradle/caches/modules-2/files-2.1/org.jruby/jruby-core/9.2.6.0/653601d48b38528e76840c6eac1ae46e2dae1a74/jruby-core-9.2.6.0.jar) to field java.lang.reflect.Field.modifiers
: WARNING: Please consider reporting this to the maintainers of org.jruby.util.SecurityHelper
: WARNING: Use --illegal-access=warn to enable warnings of further illegal reflective access operations
: WARNING: All illegal access operations will be denied in a future release
: Looping over pages to build nav data
: Creating /home/jenkins/jenkins-slave/workspace/Solr/Solr-Check-main/solr/solr-ref-guide/build/html-site-content/_data/scrollnav.json
: Creating /home/jenkins/jenkins-slave/workspace/Solr/Solr-Check-main/solr/solr-ref-guide/build/html-site-content/_data/sidebar.json
:
: > Task :solr:solr-ref-guide:test NO-SOURCE
: > Task :solr:solr-ref-guide:wipeTaskTemp
: > Task :solr:solrj:test
: :solr:solrj:test (SUCCESS): 1705 test(s), 25 skipped
:
: > Task :solr:solrj:wipeTaskTemp
: > Task :solr:solrj:check
:
: > Task :solr:test-framework:test
: :solr:test-framework:test (SUCCESS): 15 test(s)
:
: > Task :solr:test-framework:wipeTaskTemp
: > Task :solr:test-framework:check
: > Task :solr:webapp:test NO-SOURCE
: > Task :solr:webapp:wipeTaskTemp
: > Task :solr:webapp:check
:
: > Task :solr:contrib:analysis-extras:test
: :solr:contrib:analysis-extras:test (SUCCESS): 30 test(s)
:
: > Task :solr:contrib:analysis-extras:wipeTaskTemp
: > Task :solr:contrib:analysis-extras:check
: > Task :solr:contrib:analytics:test
: :solr:contrib:analytics:test (SUCCESS): 472 test(s)
:
: > Task :solr:contrib:analytics:wipeTaskTemp
: > Task :solr:contrib:analytics:check
:
: > Task :solr:contrib:clustering:test
: :solr:contrib:clustering:test (SUCCESS): 15 test(s)
:
: > Task :solr:contrib:clustering:wipeTaskTemp
: > Task :solr:contrib:clustering:check
:
: > Task :solr:contrib:extraction:test
: :solr:contrib:extraction:test (SUCCESS): 20 test(s)
:
: > Task :solr:contrib:extraction:wipeTaskTemp
: > Task :solr:contrib:extraction:check
: > Task :solr:contrib:gcs-repository:test
: :solr:contrib:gcs-repository:test (SUCCESS): 13 test(s), 10 skipped
:
: > Task :solr:contrib:gcs-repository:wipeTaskTemp
: > Task :solr:contrib:gcs-repository:check
:
: > Task :solr:contrib:jaegertracer-configurator:test
: :solr:contrib:jaegertracer-configurator:test (SUCCESS): 1 test(s)
:
: > Task :solr:contrib:jaegertracer-configurator:wipeTaskTemp
: > Task :solr:contrib:jaegertracer-configurator:check
:
: > Task :solr:contrib:langid:test
: :solr:contrib:langid:test (SUCCESS): 43 test(s)
:
: > Task :solr:contrib:langid:wipeTaskTemp
: > Task :solr:contrib:langid:check
: > Task :solr:contrib:ltr:test
: :solr:contrib:ltr:test (SUCCESS): 164 test(s)
:
: > Task :solr:contrib:ltr:wipeTaskTemp
: > Task :solr:contrib:ltr:check
:
: > Task :solr:contrib:prometheus-exporter:test
: :solr:contrib:prometheus-exporter:test (SUCCESS): 20 test(s)
:
: > Task :solr:contrib:prometheus-exporter:wipeTaskTemp
: > Task :solr:contrib:prometheus-exporter:check
: > Task :solr:contrib:s3-repository:test
: :solr:contrib:s3-repository:test (SUCCESS): 42 test(s)
:
: > Task :solr:contrib:s3-repository:wipeTaskTemp
: > Task :solr:contrib:s3-repository:check
:
: > Task :solr:contrib:scripting:test
: :solr:contrib:scripting:test (SUCCESS): 22 test(s), 1 skipped
:
: > Task :solr:contrib:scripting:wipeTaskTemp
: > Task :solr:contrib:scripting:check
:
: FAILURE: Build failed with an exception.
:
: * What went wrong:
: Execution failed for task ':solr:solr-ref-guide:jrubyPrepare'.
: > Process 'command '/usr/local/asfpackages/java/oraclejdk-11.0.11/bin/java'' finished with non-zero exit value 1
:
: * Try:
: Run with --stacktrace option to get the stack trace. Run with --info or --debug option to get more log output. Run with --scan to get full insights.
:
: * Get more help at https://help.gradle.org
:
: Deprecated Gradle features were used in this build, making it incompatible with Gradle 8.0.
:
: You can use '--warning-mode all' to show the individual deprecation warnings and determine if they come from your own scripts or plugins.
:
: See https://docs.gradle.org/7.2/userguide/command_line_interface.html#sec:command_line_warnings
:
: BUILD FAILED in 49m 1s
: 403 actionable tasks: 403 executed
: Build step 'Invoke Gradle script' changed build result to FAILURE
: Build step 'Invoke Gradle script' marked build as failure
: Archiving artifacts
: Recording test results
: [Checks API] No suitable checks publisher found.
: Email was triggered for: Failure - Any
: Sending email for trigger: Failure - Any
:
-Hoss
http://www.lucidworks.com/
Re: [JENKINS] Solr » Solr-Check-main - Build # 1937 - Failure!
Posted by Chris Hostetter <ho...@fucit.org>.
This problem reproduces for me locally as well.
It doesn't seem to be related to any recent changes -- even checking out a
Git SHA from several weeks ago when 'gradle check' passed just fine now
enounters this jruby/gem failure -- making me suspect something in a
remote gem/dep that we fetch is now different?
: Date: Thu, 11 Nov 2021 09:03:55 +0000 (UTC)
: From: Apache Jenkins Server <je...@builds.apache.org>
: Reply-To: dev@solr.apache.org
: To: builds@solr.apache.org
: Subject: [JENKINS] Solr » Solr-Check-main - Build # 1937 - Failure!
:
: Build: https://ci-builds.apache.org/job/Solr/job/Solr-Check-main/1937/
:
: All tests passed
:
: Build Log:
: [...truncated 708 lines...]
: ERROR: Error installing /home/jenkins/.gradle/caches/modules-2/files-2.1/rubygems/http_parser.rb/0.8.0/8aa1092bbc1f10fd9622224babf2b2a98d4d4b22/http_parser.rb-0.8.0.gem:
: ERROR: Failed to build gem native extension.
:
: current directory: /home/jenkins/jenkins-slave/workspace/Solr/Solr-Check-main/solr/solr-ref-guide/build/.gems/gems/http_parser.rb-0.8.0/ext/ruby_http_parser
: /usr/local/asfpackages/java/oraclejdk-11.0.11/bin/java -cp :/home/jenkins/.gradle/caches/modules-2/files-2.1/org.jruby/jruby-complete/9.2.9.0/8e44ce7a1417966d89957bd766a148601e28828b/jruby-complete-9.2.9.0.jar org.jruby.Main -r ./siteconf20211111-3140105-3po9z4.rb extconf.rb
: WARNING: An illegal reflective access operation has occurred
: WARNING: Illegal reflective access by com.headius.backport9.modules.Modules (file:/home/jenkins/.gradle/caches/modules-2/files-2.1/org.jruby/jruby-complete/9.2.9.0/8e44ce7a1417966d89957bd766a148601e28828b/jruby-complete-9.2.9.0.jar) to method sun.nio.ch.NativeThread.signal(long)
: WARNING: Please consider reporting this to the maintainers of com.headius.backport9.modules.Modules
: WARNING: Use --illegal-access=warn to enable warnings of further illegal reflective access operations
: WARNING: All illegal access operations will be denied in a future release
: creating Makefile
:
: current directory: /home/jenkins/jenkins-slave/workspace/Solr/Solr-Check-main/solr/solr-ref-guide/build/.gems/gems/http_parser.rb-0.8.0/ext/ruby_http_parser
: make "DESTDIR=" clean
: Makefile:225: *** multiple target patterns. Stop.
:
: current directory: /home/jenkins/jenkins-slave/workspace/Solr/Solr-Check-main/solr/solr-ref-guide/build/.gems/gems/http_parser.rb-0.8.0/ext/ruby_http_parser
: make "DESTDIR="
: Makefile:225: *** multiple target patterns. Stop.
:
: make failed, exit code 2
:
: Gem files will remain installed in /home/jenkins/jenkins-slave/workspace/Solr/Solr-Check-main/solr/solr-ref-guide/build/.gems/gems/http_parser.rb-0.8.0 for inspection.
: Results logged to /home/jenkins/jenkins-slave/workspace/Solr/Solr-Check-main/solr/solr-ref-guide/build/.gems/extensions/universal-java-11/2.5.0/http_parser.rb-0.8.0/gem_make.out
: Successfully installed eventmachine-1.2.7-java
: Successfully installed public_suffix-4.0.6
: Successfully installed temple-0.8.2
: Successfully installed asciidoctor-2.0.16
: Successfully installed safe_yaml-1.0.5
: Successfully installed rouge-3.26.1
: Successfully installed pathutil-0.16.2
: Successfully installed mercenary-0.3.6
: Successfully installed liquid-4.0.3
: Successfully installed kramdown-2.3.1
: Successfully installed jekyll-watch-2.2.1
: Successfully installed jekyll-sass-converter-1.5.2
: Successfully installed em-websocket-0.5.3
: Successfully installed colorator-1.1.0
: Successfully installed addressable-2.8.0
: Successfully installed concurrent-ruby-1.1.9
: Successfully installed i18n-0.9.5
: Successfully installed tilt-2.0.10
: Successfully installed slim-4.1.0
: Successfully installed jekyll-3.9.1
: Successfully installed jekyll-asciidoc-3.0.0
: 29 gems installed
:
: > Task :solr:solr-ref-guide:jrubyPrepare FAILED
:
: > Task :solr:solr-ref-guide:prepareLocalJavadocLinksSiteSources
: Syncing source files to /home/jenkins/jenkins-slave/workspace/Solr/Solr-Check-main/solr/solr-ref-guide/build/local-jdoc-links-site-content using props:
: htmlOutDir -> ../local-jdoc-links-site
: javadocLink -> https://docs.oracle.com/en/java/javase/11/docs/api/java.base/
: solrGuideDraftStatus -> DRAFT
: solrRootPath -> /home/jenkins/jenkins-slave/workspace/Solr/Solr-Check-main/solr/
: solrDocsVersion -> 9.0
: solrGuideVersionPath -> 9_0
: buildDate -> 2021-11-11
: buildYear -> 2021
: htmlSolrJavadocs -> link:../../../documentation/build/site
: htmlLuceneJavadocs -> link:../../../documentation/build/lucene-javadocs
: ivyCommonsCodec -> 1.13
: ivyDropwizardMetrics -> 4.1.5
: ivyHadoop -> 3.2.0
: ivyLog4j -> 2.14.1
: ivyOpennlpTools -> 1.9.1
: ivyTika -> 1.27
: ivyZookeeper -> 3.7.0
: Building up tree of all known pages
: WARNING: An illegal reflective access operation has occurred
: WARNING: Illegal reflective access by org.jruby.util.SecurityHelper (file:/home/jenkins/.gradle/caches/modules-2/files-2.1/org.jruby/jruby-core/9.2.6.0/653601d48b38528e76840c6eac1ae46e2dae1a74/jruby-core-9.2.6.0.jar) to field java.lang.reflect.Field.modifiers
: WARNING: Please consider reporting this to the maintainers of org.jruby.util.SecurityHelper
: WARNING: Use --illegal-access=warn to enable warnings of further illegal reflective access operations
: WARNING: All illegal access operations will be denied in a future release
: Looping over pages to build nav data
: Creating /home/jenkins/jenkins-slave/workspace/Solr/Solr-Check-main/solr/solr-ref-guide/build/local-jdoc-links-site-content/_data/scrollnav.json
: Creating /home/jenkins/jenkins-slave/workspace/Solr/Solr-Check-main/solr/solr-ref-guide/build/local-jdoc-links-site-content/_data/sidebar.json
:
: > Task :solr:solr-ref-guide:prepareSiteSources
: Syncing source files to /home/jenkins/jenkins-slave/workspace/Solr/Solr-Check-main/solr/solr-ref-guide/build/html-site-content using props:
: htmlOutDir -> ../html-site
: javadocLink -> https://docs.oracle.com/en/java/javase/11/docs/api/java.base/
: solrGuideDraftStatus -> DRAFT
: solrRootPath -> /home/jenkins/jenkins-slave/workspace/Solr/Solr-Check-main/solr/
: solrDocsVersion -> 9.0
: solrGuideVersionPath -> 9_0
: buildDate -> 2021-11-11
: buildYear -> 2021
: htmlSolrJavadocs -> https://solr.apache.org/docs/9_0_0/
: htmlLuceneJavadocs -> https://lucene.apache.org/core/9_0_0-prerelease9
: ivyCommonsCodec -> 1.13
: ivyDropwizardMetrics -> 4.1.5
: ivyHadoop -> 3.2.0
: ivyLog4j -> 2.14.1
: ivyOpennlpTools -> 1.9.1
: ivyTika -> 1.27
: ivyZookeeper -> 3.7.0
: Building up tree of all known pages
: WARNING: An illegal reflective access operation has occurred
: WARNING: Illegal reflective access by org.jruby.util.SecurityHelper (file:/home/jenkins/.gradle/caches/modules-2/files-2.1/org.jruby/jruby-core/9.2.6.0/653601d48b38528e76840c6eac1ae46e2dae1a74/jruby-core-9.2.6.0.jar) to field java.lang.reflect.Field.modifiers
: WARNING: Please consider reporting this to the maintainers of org.jruby.util.SecurityHelper
: WARNING: Use --illegal-access=warn to enable warnings of further illegal reflective access operations
: WARNING: All illegal access operations will be denied in a future release
: Looping over pages to build nav data
: Creating /home/jenkins/jenkins-slave/workspace/Solr/Solr-Check-main/solr/solr-ref-guide/build/html-site-content/_data/scrollnav.json
: Creating /home/jenkins/jenkins-slave/workspace/Solr/Solr-Check-main/solr/solr-ref-guide/build/html-site-content/_data/sidebar.json
:
: > Task :solr:solr-ref-guide:test NO-SOURCE
: > Task :solr:solr-ref-guide:wipeTaskTemp
: > Task :solr:solrj:test
: :solr:solrj:test (SUCCESS): 1705 test(s), 25 skipped
:
: > Task :solr:solrj:wipeTaskTemp
: > Task :solr:solrj:check
:
: > Task :solr:test-framework:test
: :solr:test-framework:test (SUCCESS): 15 test(s)
:
: > Task :solr:test-framework:wipeTaskTemp
: > Task :solr:test-framework:check
: > Task :solr:webapp:test NO-SOURCE
: > Task :solr:webapp:wipeTaskTemp
: > Task :solr:webapp:check
:
: > Task :solr:contrib:analysis-extras:test
: :solr:contrib:analysis-extras:test (SUCCESS): 30 test(s)
:
: > Task :solr:contrib:analysis-extras:wipeTaskTemp
: > Task :solr:contrib:analysis-extras:check
: > Task :solr:contrib:analytics:test
: :solr:contrib:analytics:test (SUCCESS): 472 test(s)
:
: > Task :solr:contrib:analytics:wipeTaskTemp
: > Task :solr:contrib:analytics:check
:
: > Task :solr:contrib:clustering:test
: :solr:contrib:clustering:test (SUCCESS): 15 test(s)
:
: > Task :solr:contrib:clustering:wipeTaskTemp
: > Task :solr:contrib:clustering:check
:
: > Task :solr:contrib:extraction:test
: :solr:contrib:extraction:test (SUCCESS): 20 test(s)
:
: > Task :solr:contrib:extraction:wipeTaskTemp
: > Task :solr:contrib:extraction:check
: > Task :solr:contrib:gcs-repository:test
: :solr:contrib:gcs-repository:test (SUCCESS): 13 test(s), 10 skipped
:
: > Task :solr:contrib:gcs-repository:wipeTaskTemp
: > Task :solr:contrib:gcs-repository:check
:
: > Task :solr:contrib:jaegertracer-configurator:test
: :solr:contrib:jaegertracer-configurator:test (SUCCESS): 1 test(s)
:
: > Task :solr:contrib:jaegertracer-configurator:wipeTaskTemp
: > Task :solr:contrib:jaegertracer-configurator:check
:
: > Task :solr:contrib:langid:test
: :solr:contrib:langid:test (SUCCESS): 43 test(s)
:
: > Task :solr:contrib:langid:wipeTaskTemp
: > Task :solr:contrib:langid:check
: > Task :solr:contrib:ltr:test
: :solr:contrib:ltr:test (SUCCESS): 164 test(s)
:
: > Task :solr:contrib:ltr:wipeTaskTemp
: > Task :solr:contrib:ltr:check
:
: > Task :solr:contrib:prometheus-exporter:test
: :solr:contrib:prometheus-exporter:test (SUCCESS): 20 test(s)
:
: > Task :solr:contrib:prometheus-exporter:wipeTaskTemp
: > Task :solr:contrib:prometheus-exporter:check
: > Task :solr:contrib:s3-repository:test
: :solr:contrib:s3-repository:test (SUCCESS): 42 test(s)
:
: > Task :solr:contrib:s3-repository:wipeTaskTemp
: > Task :solr:contrib:s3-repository:check
:
: > Task :solr:contrib:scripting:test
: :solr:contrib:scripting:test (SUCCESS): 22 test(s), 1 skipped
:
: > Task :solr:contrib:scripting:wipeTaskTemp
: > Task :solr:contrib:scripting:check
:
: FAILURE: Build failed with an exception.
:
: * What went wrong:
: Execution failed for task ':solr:solr-ref-guide:jrubyPrepare'.
: > Process 'command '/usr/local/asfpackages/java/oraclejdk-11.0.11/bin/java'' finished with non-zero exit value 1
:
: * Try:
: Run with --stacktrace option to get the stack trace. Run with --info or --debug option to get more log output. Run with --scan to get full insights.
:
: * Get more help at https://help.gradle.org
:
: Deprecated Gradle features were used in this build, making it incompatible with Gradle 8.0.
:
: You can use '--warning-mode all' to show the individual deprecation warnings and determine if they come from your own scripts or plugins.
:
: See https://docs.gradle.org/7.2/userguide/command_line_interface.html#sec:command_line_warnings
:
: BUILD FAILED in 49m 1s
: 403 actionable tasks: 403 executed
: Build step 'Invoke Gradle script' changed build result to FAILURE
: Build step 'Invoke Gradle script' marked build as failure
: Archiving artifacts
: Recording test results
: [Checks API] No suitable checks publisher found.
: Email was triggered for: Failure - Any
: Sending email for trigger: Failure - Any
:
-Hoss
http://www.lucidworks.com/