You are viewing a plain text version of this content. The canonical link for it is here.
Posted to notifications@maven.apache.org by Apache Jenkins Server <je...@builds.apache.org> on 2020/02/09 03:27:08 UTC
Build unstable in Jenkins: Maven TLP » maven-dependency-plugin » GITHUB_ACTIONS #17
See https://builds.apache.org/job/maven-box/job/maven-dependency-plugin/job/GITHUB_ACTIONS/17/
Changes:
* H30 is having issues
* H23 has issues.
* GitHub emails should not trigger notifier which otherwise breaks the
* Revert "GitHub emails should not trigger notifier which otherwise breaks
* H40 is unstable
* GitHub emails should not trigger notifier which otherwise breaks the
* send email if authors exist
* fixed Scripts not permitted to use staticMethod
* H24 in unstable
32 tests failed.
FAILED: org.apache.maven.plugins.dependency.TestGetMojo.linux-jdk7-m3.2.x_build / Build linux-jdk7-m3.2.x_build / testRemoteRepositories
Error Message:
Couldn't download artifact: org.sonatype.aether.collection.DependencyCollectionException: Failed to collect dependencies for org.apache.maven:maven-model:jar:2.0.9 ()
Stack Trace:
org.apache.maven.plugin.MojoExecutionException: Couldn't download artifact: org.sonatype.aether.collection.DependencyCollectionException: Failed to collect dependencies for org.apache.maven:maven-model:jar:2.0.9 ()
at org.apache.maven.plugins.dependency.TestGetMojo.testRemoteRepositories(TestGetMojo.java:96)
Caused by: org.apache.maven.shared.transfer.dependencies.resolve.internal.Maven30DependencyResolverException: org.sonatype.aether.collection.DependencyCollectionException: Failed to collect dependencies for org.apache.maven:maven-model:jar:2.0.9 ()
at org.apache.maven.plugins.dependency.TestGetMojo.testRemoteRepositories(TestGetMojo.java:96)
Caused by: org.sonatype.aether.collection.DependencyCollectionException: Failed to collect dependencies for org.apache.maven:maven-model:jar:2.0.9 ()
at org.apache.maven.plugins.dependency.TestGetMojo.testRemoteRepositories(TestGetMojo.java:96)
Caused by: org.sonatype.aether.resolution.ArtifactDescriptorException: Failed to read artifact descriptor for org.apache.maven:maven-model:jar:2.0.9
at org.apache.maven.plugins.dependency.TestGetMojo.testRemoteRepositories(TestGetMojo.java:96)
Caused by: org.sonatype.aether.resolution.ArtifactResolutionException: Could not transfer artifact org.apache.maven:maven-model:pom:2.0.9 from central (http://repo1.maven.apache.org/maven2): Error transferring file: repo1.maven.apache.org
at org.apache.maven.plugins.dependency.TestGetMojo.testRemoteRepositories(TestGetMojo.java:96)
Caused by: org.sonatype.aether.transfer.ArtifactTransferException: Could not transfer artifact org.apache.maven:maven-model:pom:2.0.9 from central (http://repo1.maven.apache.org/maven2): Error transferring file: repo1.maven.apache.org
at org.apache.maven.plugins.dependency.TestGetMojo.testRemoteRepositories(TestGetMojo.java:96)
Caused by: org.apache.maven.wagon.TransferFailedException: Error transferring file: repo1.maven.apache.org
Caused by: java.net.UnknownHostException: repo1.maven.apache.org
FAILED: org.apache.maven.plugins.dependency.TestGetMojo.linux-jdk7-m3.2.x_build / Build linux-jdk7-m3.2.x_build / testTransitive
Error Message:
Couldn't download artifact: Failed to read artifact descriptor for org.apache.maven:maven-model:jar:2.0.9
Stack Trace:
org.apache.maven.plugin.MojoExecutionException: Couldn't download artifact: Failed to read artifact descriptor for org.apache.maven:maven-model:jar:2.0.9
at org.apache.maven.plugins.dependency.TestGetMojo.testTransitive(TestGetMojo.java:75)
Caused by: org.apache.maven.shared.transfer.artifact.resolve.ArtifactResolverException: Failed to read artifact descriptor for org.apache.maven:maven-model:jar:2.0.9
at org.apache.maven.plugins.dependency.TestGetMojo.testTransitive(TestGetMojo.java:75)
Caused by: org.sonatype.aether.resolution.ArtifactDescriptorException: Failed to read artifact descriptor for org.apache.maven:maven-model:jar:2.0.9
at org.apache.maven.plugins.dependency.TestGetMojo.testTransitive(TestGetMojo.java:75)
Caused by: org.sonatype.aether.resolution.ArtifactResolutionException: Could not transfer artifact org.apache.maven:maven-model:pom:2.0.9 from central (http://repo1.maven.apache.org/maven2): Error transferring file: repo1.maven.apache.org
at org.apache.maven.plugins.dependency.TestGetMojo.testTransitive(TestGetMojo.java:75)
Caused by: org.sonatype.aether.transfer.ArtifactTransferException: Could not transfer artifact org.apache.maven:maven-model:pom:2.0.9 from central (http://repo1.maven.apache.org/maven2): Error transferring file: repo1.maven.apache.org
at org.apache.maven.plugins.dependency.TestGetMojo.testTransitive(TestGetMojo.java:75)
Caused by: org.apache.maven.wagon.TransferFailedException: Error transferring file: repo1.maven.apache.org
Caused by: java.net.UnknownHostException: repo1.maven.apache.org
FAILED: org.apache.maven.plugins.dependency.TestGetMojo.linux-jdk7-m3.3.x_build / Build linux-jdk7-m3.3.x_build / testRemoteRepositories
Error Message:
Couldn't download artifact: org.sonatype.aether.collection.DependencyCollectionException: Failed to collect dependencies for org.apache.maven:maven-model:jar:2.0.9 ()
Stack Trace:
org.apache.maven.plugin.MojoExecutionException: Couldn't download artifact: org.sonatype.aether.collection.DependencyCollectionException: Failed to collect dependencies for org.apache.maven:maven-model:jar:2.0.9 ()
at org.apache.maven.plugins.dependency.TestGetMojo.testRemoteRepositories(TestGetMojo.java:96)
Caused by: org.apache.maven.shared.transfer.dependencies.resolve.internal.Maven30DependencyResolverException: org.sonatype.aether.collection.DependencyCollectionException: Failed to collect dependencies for org.apache.maven:maven-model:jar:2.0.9 ()
at org.apache.maven.plugins.dependency.TestGetMojo.testRemoteRepositories(TestGetMojo.java:96)
Caused by: org.sonatype.aether.collection.DependencyCollectionException: Failed to collect dependencies for org.apache.maven:maven-model:jar:2.0.9 ()
at org.apache.maven.plugins.dependency.TestGetMojo.testRemoteRepositories(TestGetMojo.java:96)
Caused by: org.sonatype.aether.resolution.ArtifactDescriptorException: Failed to read artifact descriptor for org.apache.maven:maven-model:jar:2.0.9
at org.apache.maven.plugins.dependency.TestGetMojo.testRemoteRepositories(TestGetMojo.java:96)
Caused by: org.sonatype.aether.resolution.ArtifactResolutionException: Could not transfer artifact org.apache.maven:maven-model:pom:2.0.9 from central (http://repo1.maven.apache.org/maven2): Error transferring file: repo1.maven.apache.org
at org.apache.maven.plugins.dependency.TestGetMojo.testRemoteRepositories(TestGetMojo.java:96)
Caused by: org.sonatype.aether.transfer.ArtifactTransferException: Could not transfer artifact org.apache.maven:maven-model:pom:2.0.9 from central (http://repo1.maven.apache.org/maven2): Error transferring file: repo1.maven.apache.org
at org.apache.maven.plugins.dependency.TestGetMojo.testRemoteRepositories(TestGetMojo.java:96)
Caused by: org.apache.maven.wagon.TransferFailedException: Error transferring file: repo1.maven.apache.org
Caused by: java.net.UnknownHostException: repo1.maven.apache.org
FAILED: org.apache.maven.plugins.dependency.TestGetMojo.linux-jdk7-m3.3.x_build / Build linux-jdk7-m3.3.x_build / testTransitive
Error Message:
Couldn't download artifact: Failed to read artifact descriptor for org.apache.maven:maven-model:jar:2.0.9
Stack Trace:
org.apache.maven.plugin.MojoExecutionException: Couldn't download artifact: Failed to read artifact descriptor for org.apache.maven:maven-model:jar:2.0.9
at org.apache.maven.plugins.dependency.TestGetMojo.testTransitive(TestGetMojo.java:75)
Caused by: org.apache.maven.shared.transfer.artifact.resolve.ArtifactResolverException: Failed to read artifact descriptor for org.apache.maven:maven-model:jar:2.0.9
at org.apache.maven.plugins.dependency.TestGetMojo.testTransitive(TestGetMojo.java:75)
Caused by: org.sonatype.aether.resolution.ArtifactDescriptorException: Failed to read artifact descriptor for org.apache.maven:maven-model:jar:2.0.9
at org.apache.maven.plugins.dependency.TestGetMojo.testTransitive(TestGetMojo.java:75)
Caused by: org.sonatype.aether.resolution.ArtifactResolutionException: Could not transfer artifact org.apache.maven:maven-model:pom:2.0.9 from central (http://repo1.maven.apache.org/maven2): Error transferring file: repo1.maven.apache.org
at org.apache.maven.plugins.dependency.TestGetMojo.testTransitive(TestGetMojo.java:75)
Caused by: org.sonatype.aether.transfer.ArtifactTransferException: Could not transfer artifact org.apache.maven:maven-model:pom:2.0.9 from central (http://repo1.maven.apache.org/maven2): Error transferring file: repo1.maven.apache.org
at org.apache.maven.plugins.dependency.TestGetMojo.testTransitive(TestGetMojo.java:75)
Caused by: org.apache.maven.wagon.TransferFailedException: Error transferring file: repo1.maven.apache.org
Caused by: java.net.UnknownHostException: repo1.maven.apache.org
FAILED: org.apache.maven.plugins.dependency.TestGetMojo.linux-jdk7-m3.5.x_build / Build linux-jdk7-m3.5.x_build / testRemoteRepositories
Error Message:
Couldn't download artifact: org.sonatype.aether.collection.DependencyCollectionException: Failed to collect dependencies for org.apache.maven:maven-model:jar:2.0.9 ()
Stack Trace:
org.apache.maven.plugin.MojoExecutionException: Couldn't download artifact: org.sonatype.aether.collection.DependencyCollectionException: Failed to collect dependencies for org.apache.maven:maven-model:jar:2.0.9 ()
at org.apache.maven.plugins.dependency.TestGetMojo.testRemoteRepositories(TestGetMojo.java:96)
Caused by: org.apache.maven.shared.transfer.dependencies.resolve.internal.Maven30DependencyResolverException: org.sonatype.aether.collection.DependencyCollectionException: Failed to collect dependencies for org.apache.maven:maven-model:jar:2.0.9 ()
at org.apache.maven.plugins.dependency.TestGetMojo.testRemoteRepositories(TestGetMojo.java:96)
Caused by: org.sonatype.aether.collection.DependencyCollectionException: Failed to collect dependencies for org.apache.maven:maven-model:jar:2.0.9 ()
at org.apache.maven.plugins.dependency.TestGetMojo.testRemoteRepositories(TestGetMojo.java:96)
Caused by: org.sonatype.aether.resolution.ArtifactDescriptorException: Failed to read artifact descriptor for org.apache.maven:maven-model:jar:2.0.9
at org.apache.maven.plugins.dependency.TestGetMojo.testRemoteRepositories(TestGetMojo.java:96)
Caused by: org.sonatype.aether.resolution.ArtifactResolutionException: Could not transfer artifact org.apache.maven:maven-model:pom:2.0.9 from central (http://repo1.maven.apache.org/maven2): Error transferring file: repo1.maven.apache.org
at org.apache.maven.plugins.dependency.TestGetMojo.testRemoteRepositories(TestGetMojo.java:96)
Caused by: org.sonatype.aether.transfer.ArtifactTransferException: Could not transfer artifact org.apache.maven:maven-model:pom:2.0.9 from central (http://repo1.maven.apache.org/maven2): Error transferring file: repo1.maven.apache.org
at org.apache.maven.plugins.dependency.TestGetMojo.testRemoteRepositories(TestGetMojo.java:96)
Caused by: org.apache.maven.wagon.TransferFailedException: Error transferring file: repo1.maven.apache.org
Caused by: java.net.UnknownHostException: repo1.maven.apache.org
FAILED: org.apache.maven.plugins.dependency.TestGetMojo.linux-jdk7-m3.5.x_build / Build linux-jdk7-m3.5.x_build / testTransitive
Error Message:
Couldn't download artifact: Failed to read artifact descriptor for org.apache.maven:maven-model:jar:2.0.9
Stack Trace:
org.apache.maven.plugin.MojoExecutionException: Couldn't download artifact: Failed to read artifact descriptor for org.apache.maven:maven-model:jar:2.0.9
at org.apache.maven.plugins.dependency.TestGetMojo.testTransitive(TestGetMojo.java:75)
Caused by: org.apache.maven.shared.transfer.artifact.resolve.ArtifactResolverException: Failed to read artifact descriptor for org.apache.maven:maven-model:jar:2.0.9
at org.apache.maven.plugins.dependency.TestGetMojo.testTransitive(TestGetMojo.java:75)
Caused by: org.sonatype.aether.resolution.ArtifactDescriptorException: Failed to read artifact descriptor for org.apache.maven:maven-model:jar:2.0.9
at org.apache.maven.plugins.dependency.TestGetMojo.testTransitive(TestGetMojo.java:75)
Caused by: org.sonatype.aether.resolution.ArtifactResolutionException: Could not transfer artifact org.apache.maven:maven-model:pom:2.0.9 from central (http://repo1.maven.apache.org/maven2): Error transferring file: repo1.maven.apache.org
at org.apache.maven.plugins.dependency.TestGetMojo.testTransitive(TestGetMojo.java:75)
Caused by: org.sonatype.aether.transfer.ArtifactTransferException: Could not transfer artifact org.apache.maven:maven-model:pom:2.0.9 from central (http://repo1.maven.apache.org/maven2): Error transferring file: repo1.maven.apache.org
at org.apache.maven.plugins.dependency.TestGetMojo.testTransitive(TestGetMojo.java:75)
Caused by: org.apache.maven.wagon.TransferFailedException: Error transferring file: repo1.maven.apache.org
Caused by: java.net.UnknownHostException: repo1.maven.apache.org
FAILED: org.apache.maven.plugins.dependency.TestGetMojo.linux-jdk7-m3.6.x_build / Build linux-jdk7-m3.6.x_build / testRemoteRepositories
Error Message:
Couldn't download artifact: org.sonatype.aether.collection.DependencyCollectionException: Failed to collect dependencies for org.apache.maven:maven-model:jar:2.0.9 ()
Stack Trace:
org.apache.maven.plugin.MojoExecutionException: Couldn't download artifact: org.sonatype.aether.collection.DependencyCollectionException: Failed to collect dependencies for org.apache.maven:maven-model:jar:2.0.9 ()
at org.apache.maven.plugins.dependency.TestGetMojo.testRemoteRepositories(TestGetMojo.java:96)
Caused by: org.apache.maven.shared.transfer.dependencies.resolve.internal.Maven30DependencyResolverException: org.sonatype.aether.collection.DependencyCollectionException: Failed to collect dependencies for org.apache.maven:maven-model:jar:2.0.9 ()
at org.apache.maven.plugins.dependency.TestGetMojo.testRemoteRepositories(TestGetMojo.java:96)
Caused by: org.sonatype.aether.collection.DependencyCollectionException: Failed to collect dependencies for org.apache.maven:maven-model:jar:2.0.9 ()
at org.apache.maven.plugins.dependency.TestGetMojo.testRemoteRepositories(TestGetMojo.java:96)
Caused by: org.sonatype.aether.resolution.ArtifactDescriptorException: Failed to read artifact descriptor for org.apache.maven:maven-model:jar:2.0.9
at org.apache.maven.plugins.dependency.TestGetMojo.testRemoteRepositories(TestGetMojo.java:96)
Caused by: org.sonatype.aether.resolution.ArtifactResolutionException: Could not transfer artifact org.apache.maven:maven-model:pom:2.0.9 from central (http://repo1.maven.apache.org/maven2): Error transferring file: repo1.maven.apache.org
at org.apache.maven.plugins.dependency.TestGetMojo.testRemoteRepositories(TestGetMojo.java:96)
Caused by: org.sonatype.aether.transfer.ArtifactTransferException: Could not transfer artifact org.apache.maven:maven-model:pom:2.0.9 from central (http://repo1.maven.apache.org/maven2): Error transferring file: repo1.maven.apache.org
at org.apache.maven.plugins.dependency.TestGetMojo.testRemoteRepositories(TestGetMojo.java:96)
Caused by: org.apache.maven.wagon.TransferFailedException: Error transferring file: repo1.maven.apache.org
Caused by: java.net.UnknownHostException: repo1.maven.apache.org
FAILED: org.apache.maven.plugins.dependency.TestGetMojo.linux-jdk7-m3.6.x_build / Build linux-jdk7-m3.6.x_build / testTransitive
Error Message:
Couldn't download artifact: Failed to read artifact descriptor for org.apache.maven:maven-model:jar:2.0.9
Stack Trace:
org.apache.maven.plugin.MojoExecutionException: Couldn't download artifact: Failed to read artifact descriptor for org.apache.maven:maven-model:jar:2.0.9
at org.apache.maven.plugins.dependency.TestGetMojo.testTransitive(TestGetMojo.java:75)
Caused by: org.apache.maven.shared.transfer.artifact.resolve.ArtifactResolverException: Failed to read artifact descriptor for org.apache.maven:maven-model:jar:2.0.9
at org.apache.maven.plugins.dependency.TestGetMojo.testTransitive(TestGetMojo.java:75)
Caused by: org.sonatype.aether.resolution.ArtifactDescriptorException: Failed to read artifact descriptor for org.apache.maven:maven-model:jar:2.0.9
at org.apache.maven.plugins.dependency.TestGetMojo.testTransitive(TestGetMojo.java:75)
Caused by: org.sonatype.aether.resolution.ArtifactResolutionException: Could not transfer artifact org.apache.maven:maven-model:pom:2.0.9 from central (http://repo1.maven.apache.org/maven2): Error transferring file: repo1.maven.apache.org
at org.apache.maven.plugins.dependency.TestGetMojo.testTransitive(TestGetMojo.java:75)
Caused by: org.sonatype.aether.transfer.ArtifactTransferException: Could not transfer artifact org.apache.maven:maven-model:pom:2.0.9 from central (http://repo1.maven.apache.org/maven2): Error transferring file: repo1.maven.apache.org
at org.apache.maven.plugins.dependency.TestGetMojo.testTransitive(TestGetMojo.java:75)
Caused by: org.apache.maven.wagon.TransferFailedException: Error transferring file: repo1.maven.apache.org
Caused by: java.net.UnknownHostException: repo1.maven.apache.org
FAILED: org.apache.maven.plugins.dependency.TestGetMojo.linux-jdk8-m3.6.x_build / Build linux-jdk8-m3.6.x_build / testRemoteRepositories
Error Message:
Couldn't download artifact: org.sonatype.aether.collection.DependencyCollectionException: Failed to collect dependencies for org.apache.maven:maven-model:jar:2.0.9 ()
Stack Trace:
org.apache.maven.plugin.MojoExecutionException: Couldn't download artifact: org.sonatype.aether.collection.DependencyCollectionException: Failed to collect dependencies for org.apache.maven:maven-model:jar:2.0.9 ()
at org.apache.maven.plugins.dependency.TestGetMojo.testRemoteRepositories(TestGetMojo.java:96)
Caused by: org.apache.maven.shared.transfer.dependencies.resolve.internal.Maven30DependencyResolverException: org.sonatype.aether.collection.DependencyCollectionException: Failed to collect dependencies for org.apache.maven:maven-model:jar:2.0.9 ()
at org.apache.maven.plugins.dependency.TestGetMojo.testRemoteRepositories(TestGetMojo.java:96)
Caused by: org.sonatype.aether.collection.DependencyCollectionException: Failed to collect dependencies for org.apache.maven:maven-model:jar:2.0.9 ()
at org.apache.maven.plugins.dependency.TestGetMojo.testRemoteRepositories(TestGetMojo.java:96)
Caused by: org.sonatype.aether.resolution.ArtifactDescriptorException: Failed to read artifact descriptor for org.apache.maven:maven-model:jar:2.0.9
at org.apache.maven.plugins.dependency.TestGetMojo.testRemoteRepositories(TestGetMojo.java:96)
Caused by: org.sonatype.aether.resolution.ArtifactResolutionException: Could not transfer artifact org.apache.maven:maven-model:pom:2.0.9 from central (http://repo1.maven.apache.org/maven2): Error transferring file: repo1.maven.apache.org
at org.apache.maven.plugins.dependency.TestGetMojo.testRemoteRepositories(TestGetMojo.java:96)
Caused by: org.sonatype.aether.transfer.ArtifactTransferException: Could not transfer artifact org.apache.maven:maven-model:pom:2.0.9 from central (http://repo1.maven.apache.org/maven2): Error transferring file: repo1.maven.apache.org
at org.apache.maven.plugins.dependency.TestGetMojo.testRemoteRepositories(TestGetMojo.java:96)
Caused by: org.apache.maven.wagon.TransferFailedException: Error transferring file: repo1.maven.apache.org
Caused by: java.net.UnknownHostException: repo1.maven.apache.org
FAILED: org.apache.maven.plugins.dependency.TestGetMojo.linux-jdk8-m3.6.x_build / Build linux-jdk8-m3.6.x_build / testTransitive
Error Message:
Couldn't download artifact: Failed to read artifact descriptor for org.apache.maven:maven-model:jar:2.0.9
Stack Trace:
org.apache.maven.plugin.MojoExecutionException: Couldn't download artifact: Failed to read artifact descriptor for org.apache.maven:maven-model:jar:2.0.9
at org.apache.maven.plugins.dependency.TestGetMojo.testTransitive(TestGetMojo.java:75)
Caused by: org.apache.maven.shared.transfer.artifact.resolve.ArtifactResolverException: Failed to read artifact descriptor for org.apache.maven:maven-model:jar:2.0.9
at org.apache.maven.plugins.dependency.TestGetMojo.testTransitive(TestGetMojo.java:75)
Caused by: org.sonatype.aether.resolution.ArtifactDescriptorException: Failed to read artifact descriptor for org.apache.maven:maven-model:jar:2.0.9
at org.apache.maven.plugins.dependency.TestGetMojo.testTransitive(TestGetMojo.java:75)
Caused by: org.sonatype.aether.resolution.ArtifactResolutionException: Could not transfer artifact org.apache.maven:maven-model:pom:2.0.9 from central (http://repo1.maven.apache.org/maven2): Error transferring file: repo1.maven.apache.org
at org.apache.maven.plugins.dependency.TestGetMojo.testTransitive(TestGetMojo.java:75)
Caused by: org.sonatype.aether.transfer.ArtifactTransferException: Could not transfer artifact org.apache.maven:maven-model:pom:2.0.9 from central (http://repo1.maven.apache.org/maven2): Error transferring file: repo1.maven.apache.org
at org.apache.maven.plugins.dependency.TestGetMojo.testTransitive(TestGetMojo.java:75)
Caused by: org.apache.maven.wagon.TransferFailedException: Error transferring file: repo1.maven.apache.org
Caused by: java.net.UnknownHostException: repo1.maven.apache.org
FAILED: org.apache.maven.plugins.dependency.TestGetMojo.linux-jdk13-m3.6.x_build / Build linux-jdk13-m3.6.x_build / testRemoteRepositories
Error Message:
Couldn't download artifact: org.sonatype.aether.collection.DependencyCollectionException: Failed to collect dependencies for org.apache.maven:maven-model:jar:2.0.9 ()
Stack Trace:
org.apache.maven.plugin.MojoExecutionException: Couldn't download artifact: org.sonatype.aether.collection.DependencyCollectionException: Failed to collect dependencies for org.apache.maven:maven-model:jar:2.0.9 ()
at org.apache.maven.plugins.dependency.TestGetMojo.testRemoteRepositories(TestGetMojo.java:96)
Caused by: org.apache.maven.shared.transfer.dependencies.resolve.internal.Maven30DependencyResolverException: org.sonatype.aether.collection.DependencyCollectionException: Failed to collect dependencies for org.apache.maven:maven-model:jar:2.0.9 ()
at org.apache.maven.plugins.dependency.TestGetMojo.testRemoteRepositories(TestGetMojo.java:96)
Caused by: org.sonatype.aether.collection.DependencyCollectionException: Failed to collect dependencies for org.apache.maven:maven-model:jar:2.0.9 ()
at org.apache.maven.plugins.dependency.TestGetMojo.testRemoteRepositories(TestGetMojo.java:96)
Caused by: org.sonatype.aether.resolution.ArtifactDescriptorException: Failed to read artifact descriptor for org.apache.maven:maven-model:jar:2.0.9
at org.apache.maven.plugins.dependency.TestGetMojo.testRemoteRepositories(TestGetMojo.java:96)
Caused by: org.sonatype.aether.resolution.ArtifactResolutionException: Could not transfer artifact org.apache.maven:maven-model:pom:2.0.9 from central (http://repo1.maven.apache.org/maven2): Error transferring file: repo1.maven.apache.org
at org.apache.maven.plugins.dependency.TestGetMojo.testRemoteRepositories(TestGetMojo.java:96)
Caused by: org.sonatype.aether.transfer.ArtifactTransferException: Could not transfer artifact org.apache.maven:maven-model:pom:2.0.9 from central (http://repo1.maven.apache.org/maven2): Error transferring file: repo1.maven.apache.org
at org.apache.maven.plugins.dependency.TestGetMojo.testRemoteRepositories(TestGetMojo.java:96)
Caused by: org.apache.maven.wagon.TransferFailedException: Error transferring file: repo1.maven.apache.org
Caused by: java.net.UnknownHostException: repo1.maven.apache.org
FAILED: org.apache.maven.plugins.dependency.TestGetMojo.linux-jdk13-m3.6.x_build / Build linux-jdk13-m3.6.x_build / testTransitive
Error Message:
Couldn't download artifact: Failed to read artifact descriptor for org.apache.maven:maven-model:jar:2.0.9
Stack Trace:
org.apache.maven.plugin.MojoExecutionException: Couldn't download artifact: Failed to read artifact descriptor for org.apache.maven:maven-model:jar:2.0.9
at org.apache.maven.plugins.dependency.TestGetMojo.testTransitive(TestGetMojo.java:75)
Caused by: org.apache.maven.shared.transfer.artifact.resolve.ArtifactResolverException: Failed to read artifact descriptor for org.apache.maven:maven-model:jar:2.0.9
at org.apache.maven.plugins.dependency.TestGetMojo.testTransitive(TestGetMojo.java:75)
Caused by: org.sonatype.aether.resolution.ArtifactDescriptorException: Failed to read artifact descriptor for org.apache.maven:maven-model:jar:2.0.9
at org.apache.maven.plugins.dependency.TestGetMojo.testTransitive(TestGetMojo.java:75)
Caused by: org.sonatype.aether.resolution.ArtifactResolutionException: Could not transfer artifact org.apache.maven:maven-model:pom:2.0.9 from central (http://repo1.maven.apache.org/maven2): Error transferring file: repo1.maven.apache.org
at org.apache.maven.plugins.dependency.TestGetMojo.testTransitive(TestGetMojo.java:75)
Caused by: org.sonatype.aether.transfer.ArtifactTransferException: Could not transfer artifact org.apache.maven:maven-model:pom:2.0.9 from central (http://repo1.maven.apache.org/maven2): Error transferring file: repo1.maven.apache.org
at org.apache.maven.plugins.dependency.TestGetMojo.testTransitive(TestGetMojo.java:75)
Caused by: org.apache.maven.wagon.TransferFailedException: Error transferring file: repo1.maven.apache.org
Caused by: java.net.UnknownHostException: repo1.maven.apache.org
FAILED: org.apache.maven.plugins.dependency.TestGetMojo.linux-jdk11-m3.6.x_build / Build linux-jdk11-m3.6.x_build / testRemoteRepositories
Error Message:
Couldn't download artifact: org.sonatype.aether.collection.DependencyCollectionException: Failed to collect dependencies for org.apache.maven:maven-model:jar:2.0.9 ()
Stack Trace:
org.apache.maven.plugin.MojoExecutionException: Couldn't download artifact: org.sonatype.aether.collection.DependencyCollectionException: Failed to collect dependencies for org.apache.maven:maven-model:jar:2.0.9 ()
at org.apache.maven.plugins.dependency.TestGetMojo.testRemoteRepositories(TestGetMojo.java:96)
Caused by: org.apache.maven.shared.transfer.dependencies.resolve.internal.Maven30DependencyResolverException: org.sonatype.aether.collection.DependencyCollectionException: Failed to collect dependencies for org.apache.maven:maven-model:jar:2.0.9 ()
at org.apache.maven.plugins.dependency.TestGetMojo.testRemoteRepositories(TestGetMojo.java:96)
Caused by: org.sonatype.aether.collection.DependencyCollectionException: Failed to collect dependencies for org.apache.maven:maven-model:jar:2.0.9 ()
at org.apache.maven.plugins.dependency.TestGetMojo.testRemoteRepositories(TestGetMojo.java:96)
Caused by: org.sonatype.aether.resolution.ArtifactDescriptorException: Failed to read artifact descriptor for org.apache.maven:maven-model:jar:2.0.9
at org.apache.maven.plugins.dependency.TestGetMojo.testRemoteRepositories(TestGetMojo.java:96)
Caused by: org.sonatype.aether.resolution.ArtifactResolutionException: Could not transfer artifact org.apache.maven:maven-model:pom:2.0.9 from central (http://repo1.maven.apache.org/maven2): Error transferring file: repo1.maven.apache.org
at org.apache.maven.plugins.dependency.TestGetMojo.testRemoteRepositories(TestGetMojo.java:96)
Caused by: org.sonatype.aether.transfer.ArtifactTransferException: Could not transfer artifact org.apache.maven:maven-model:pom:2.0.9 from central (http://repo1.maven.apache.org/maven2): Error transferring file: repo1.maven.apache.org
at org.apache.maven.plugins.dependency.TestGetMojo.testRemoteRepositories(TestGetMojo.java:96)
Caused by: org.apache.maven.wagon.TransferFailedException: Error transferring file: repo1.maven.apache.org
Caused by: java.net.UnknownHostException: repo1.maven.apache.org
FAILED: org.apache.maven.plugins.dependency.TestGetMojo.linux-jdk11-m3.6.x_build / Build linux-jdk11-m3.6.x_build / testTransitive
Error Message:
Couldn't download artifact: Failed to read artifact descriptor for org.apache.maven:maven-model:jar:2.0.9
Stack Trace:
org.apache.maven.plugin.MojoExecutionException: Couldn't download artifact: Failed to read artifact descriptor for org.apache.maven:maven-model:jar:2.0.9
at org.apache.maven.plugins.dependency.TestGetMojo.testTransitive(TestGetMojo.java:75)
Caused by: org.apache.maven.shared.transfer.artifact.resolve.ArtifactResolverException: Failed to read artifact descriptor for org.apache.maven:maven-model:jar:2.0.9
at org.apache.maven.plugins.dependency.TestGetMojo.testTransitive(TestGetMojo.java:75)
Caused by: org.sonatype.aether.resolution.ArtifactDescriptorException: Failed to read artifact descriptor for org.apache.maven:maven-model:jar:2.0.9
at org.apache.maven.plugins.dependency.TestGetMojo.testTransitive(TestGetMojo.java:75)
Caused by: org.sonatype.aether.resolution.ArtifactResolutionException: Could not transfer artifact org.apache.maven:maven-model:pom:2.0.9 from central (http://repo1.maven.apache.org/maven2): Error transferring file: repo1.maven.apache.org
at org.apache.maven.plugins.dependency.TestGetMojo.testTransitive(TestGetMojo.java:75)
Caused by: org.sonatype.aether.transfer.ArtifactTransferException: Could not transfer artifact org.apache.maven:maven-model:pom:2.0.9 from central (http://repo1.maven.apache.org/maven2): Error transferring file: repo1.maven.apache.org
at org.apache.maven.plugins.dependency.TestGetMojo.testTransitive(TestGetMojo.java:75)
Caused by: org.apache.maven.wagon.TransferFailedException: Error transferring file: repo1.maven.apache.org
Caused by: java.net.UnknownHostException: repo1.maven.apache.org
FAILED: org.apache.maven.plugins.dependency.TestGetMojo.linux-jdk14-m3.6.x_build / Build linux-jdk14-m3.6.x_build / testRemoteRepositories
Error Message:
Couldn't download artifact: org.sonatype.aether.collection.DependencyCollectionException: Failed to collect dependencies for org.apache.maven:maven-model:jar:2.0.9 ()
Stack Trace:
org.apache.maven.plugin.MojoExecutionException: Couldn't download artifact: org.sonatype.aether.collection.DependencyCollectionException: Failed to collect dependencies for org.apache.maven:maven-model:jar:2.0.9 ()
at org.apache.maven.plugins.dependency.TestGetMojo.testRemoteRepositories(TestGetMojo.java:96)
Caused by: org.apache.maven.shared.transfer.dependencies.resolve.internal.Maven30DependencyResolverException: org.sonatype.aether.collection.DependencyCollectionException: Failed to collect dependencies for org.apache.maven:maven-model:jar:2.0.9 ()
at org.apache.maven.plugins.dependency.TestGetMojo.testRemoteRepositories(TestGetMojo.java:96)
Caused by: org.sonatype.aether.collection.DependencyCollectionException: Failed to collect dependencies for org.apache.maven:maven-model:jar:2.0.9 ()
at org.apache.maven.plugins.dependency.TestGetMojo.testRemoteRepositories(TestGetMojo.java:96)
Caused by: org.sonatype.aether.resolution.ArtifactDescriptorException: Failed to read artifact descriptor for org.apache.maven:maven-model:jar:2.0.9
at org.apache.maven.plugins.dependency.TestGetMojo.testRemoteRepositories(TestGetMojo.java:96)
Caused by: org.sonatype.aether.resolution.ArtifactResolutionException: Could not transfer artifact org.apache.maven:maven-model:pom:2.0.9 from central (http://repo1.maven.apache.org/maven2): Error transferring file: repo1.maven.apache.org
at org.apache.maven.plugins.dependency.TestGetMojo.testRemoteRepositories(TestGetMojo.java:96)
Caused by: org.sonatype.aether.transfer.ArtifactTransferException: Could not transfer artifact org.apache.maven:maven-model:pom:2.0.9 from central (http://repo1.maven.apache.org/maven2): Error transferring file: repo1.maven.apache.org
at org.apache.maven.plugins.dependency.TestGetMojo.testRemoteRepositories(TestGetMojo.java:96)
Caused by: org.apache.maven.wagon.TransferFailedException: Error transferring file: repo1.maven.apache.org
Caused by: java.net.UnknownHostException: repo1.maven.apache.org
FAILED: org.apache.maven.plugins.dependency.TestGetMojo.linux-jdk14-m3.6.x_build / Build linux-jdk14-m3.6.x_build / testTransitive
Error Message:
Couldn't download artifact: Failed to read artifact descriptor for org.apache.maven:maven-model:jar:2.0.9
Stack Trace:
org.apache.maven.plugin.MojoExecutionException: Couldn't download artifact: Failed to read artifact descriptor for org.apache.maven:maven-model:jar:2.0.9
at org.apache.maven.plugins.dependency.TestGetMojo.testTransitive(TestGetMojo.java:75)
Caused by: org.apache.maven.shared.transfer.artifact.resolve.ArtifactResolverException: Failed to read artifact descriptor for org.apache.maven:maven-model:jar:2.0.9
at org.apache.maven.plugins.dependency.TestGetMojo.testTransitive(TestGetMojo.java:75)
Caused by: org.sonatype.aether.resolution.ArtifactDescriptorException: Failed to read artifact descriptor for org.apache.maven:maven-model:jar:2.0.9
at org.apache.maven.plugins.dependency.TestGetMojo.testTransitive(TestGetMojo.java:75)
Caused by: org.sonatype.aether.resolution.ArtifactResolutionException: Could not transfer artifact org.apache.maven:maven-model:pom:2.0.9 from central (http://repo1.maven.apache.org/maven2): Error transferring file: repo1.maven.apache.org
at org.apache.maven.plugins.dependency.TestGetMojo.testTransitive(TestGetMojo.java:75)
Caused by: org.sonatype.aether.transfer.ArtifactTransferException: Could not transfer artifact org.apache.maven:maven-model:pom:2.0.9 from central (http://repo1.maven.apache.org/maven2): Error transferring file: repo1.maven.apache.org
at org.apache.maven.plugins.dependency.TestGetMojo.testTransitive(TestGetMojo.java:75)
Caused by: org.apache.maven.wagon.TransferFailedException: Error transferring file: repo1.maven.apache.org
Caused by: java.net.UnknownHostException: repo1.maven.apache.org
FAILED: org.apache.maven.plugins.dependency.TestGetMojo.windows-jdk7-m3.2.x_build / Build windows-jdk7-m3.2.x_build / testRemoteRepositories
Error Message:
Couldn't download artifact: org.sonatype.aether.collection.DependencyCollectionException: Failed to collect dependencies for org.apache.maven:maven-model:jar:2.0.9 ()
Stack Trace:
org.apache.maven.plugin.MojoExecutionException: Couldn't download artifact: org.sonatype.aether.collection.DependencyCollectionException: Failed to collect dependencies for org.apache.maven:maven-model:jar:2.0.9 ()
at org.apache.maven.plugins.dependency.TestGetMojo.testRemoteRepositories(TestGetMojo.java:96)
Caused by: org.apache.maven.shared.transfer.dependencies.resolve.internal.Maven30DependencyResolverException: org.sonatype.aether.collection.DependencyCollectionException: Failed to collect dependencies for org.apache.maven:maven-model:jar:2.0.9 ()
at org.apache.maven.plugins.dependency.TestGetMojo.testRemoteRepositories(TestGetMojo.java:96)
Caused by: org.sonatype.aether.collection.DependencyCollectionException: Failed to collect dependencies for org.apache.maven:maven-model:jar:2.0.9 ()
at org.apache.maven.plugins.dependency.TestGetMojo.testRemoteRepositories(TestGetMojo.java:96)
Caused by: org.sonatype.aether.resolution.ArtifactDescriptorException: Failed to read artifact descriptor for org.apache.maven:maven-model:jar:2.0.9
at org.apache.maven.plugins.dependency.TestGetMojo.testRemoteRepositories(TestGetMojo.java:96)
Caused by: org.sonatype.aether.resolution.ArtifactResolutionException: Could not transfer artifact org.apache.maven:maven-model:pom:2.0.9 from central (http://repo1.maven.apache.org/maven2): Error transferring file: repo1.maven.apache.org
at org.apache.maven.plugins.dependency.TestGetMojo.testRemoteRepositories(TestGetMojo.java:96)
Caused by: org.sonatype.aether.transfer.ArtifactTransferException: Could not transfer artifact org.apache.maven:maven-model:pom:2.0.9 from central (http://repo1.maven.apache.org/maven2): Error transferring file: repo1.maven.apache.org
at org.apache.maven.plugins.dependency.TestGetMojo.testRemoteRepositories(TestGetMojo.java:96)
Caused by: org.apache.maven.wagon.TransferFailedException: Error transferring file: repo1.maven.apache.org
Caused by: java.net.UnknownHostException: repo1.maven.apache.org
FAILED: org.apache.maven.plugins.dependency.TestGetMojo.windows-jdk7-m3.2.x_build / Build windows-jdk7-m3.2.x_build / testTransitive
Error Message:
Couldn't download artifact: Failed to read artifact descriptor for org.apache.maven:maven-model:jar:2.0.9
Stack Trace:
org.apache.maven.plugin.MojoExecutionException: Couldn't download artifact: Failed to read artifact descriptor for org.apache.maven:maven-model:jar:2.0.9
at org.apache.maven.plugins.dependency.TestGetMojo.testTransitive(TestGetMojo.java:75)
Caused by: org.apache.maven.shared.transfer.artifact.resolve.ArtifactResolverException: Failed to read artifact descriptor for org.apache.maven:maven-model:jar:2.0.9
at org.apache.maven.plugins.dependency.TestGetMojo.testTransitive(TestGetMojo.java:75)
Caused by: org.sonatype.aether.resolution.ArtifactDescriptorException: Failed to read artifact descriptor for org.apache.maven:maven-model:jar:2.0.9
at org.apache.maven.plugins.dependency.TestGetMojo.testTransitive(TestGetMojo.java:75)
Caused by: org.sonatype.aether.resolution.ArtifactResolutionException: Could not transfer artifact org.apache.maven:maven-model:pom:2.0.9 from central (http://repo1.maven.apache.org/maven2): Error transferring file: repo1.maven.apache.org
at org.apache.maven.plugins.dependency.TestGetMojo.testTransitive(TestGetMojo.java:75)
Caused by: org.sonatype.aether.transfer.ArtifactTransferException: Could not transfer artifact org.apache.maven:maven-model:pom:2.0.9 from central (http://repo1.maven.apache.org/maven2): Error transferring file: repo1.maven.apache.org
at org.apache.maven.plugins.dependency.TestGetMojo.testTransitive(TestGetMojo.java:75)
Caused by: org.apache.maven.wagon.TransferFailedException: Error transferring file: repo1.maven.apache.org
Caused by: java.net.UnknownHostException: repo1.maven.apache.org
FAILED: org.apache.maven.plugins.dependency.TestGetMojo.windows-jdk7-m3.3.x_build / Build windows-jdk7-m3.3.x_build / testRemoteRepositories
Error Message:
Couldn't download artifact: org.sonatype.aether.collection.DependencyCollectionException: Failed to collect dependencies for org.apache.maven:maven-model:jar:2.0.9 ()
Stack Trace:
org.apache.maven.plugin.MojoExecutionException: Couldn't download artifact: org.sonatype.aether.collection.DependencyCollectionException: Failed to collect dependencies for org.apache.maven:maven-model:jar:2.0.9 ()
at org.apache.maven.plugins.dependency.TestGetMojo.testRemoteRepositories(TestGetMojo.java:96)
Caused by: org.apache.maven.shared.transfer.dependencies.resolve.internal.Maven30DependencyResolverException: org.sonatype.aether.collection.DependencyCollectionException: Failed to collect dependencies for org.apache.maven:maven-model:jar:2.0.9 ()
at org.apache.maven.plugins.dependency.TestGetMojo.testRemoteRepositories(TestGetMojo.java:96)
Caused by: org.sonatype.aether.collection.DependencyCollectionException: Failed to collect dependencies for org.apache.maven:maven-model:jar:2.0.9 ()
at org.apache.maven.plugins.dependency.TestGetMojo.testRemoteRepositories(TestGetMojo.java:96)
Caused by: org.sonatype.aether.resolution.ArtifactDescriptorException: Failed to read artifact descriptor for org.apache.maven:maven-model:jar:2.0.9
at org.apache.maven.plugins.dependency.TestGetMojo.testRemoteRepositories(TestGetMojo.java:96)
Caused by: org.sonatype.aether.resolution.ArtifactResolutionException: Could not transfer artifact org.apache.maven:maven-model:pom:2.0.9 from central (http://repo1.maven.apache.org/maven2): Error transferring file: repo1.maven.apache.org
at org.apache.maven.plugins.dependency.TestGetMojo.testRemoteRepositories(TestGetMojo.java:96)
Caused by: org.sonatype.aether.transfer.ArtifactTransferException: Could not transfer artifact org.apache.maven:maven-model:pom:2.0.9 from central (http://repo1.maven.apache.org/maven2): Error transferring file: repo1.maven.apache.org
at org.apache.maven.plugins.dependency.TestGetMojo.testRemoteRepositories(TestGetMojo.java:96)
Caused by: org.apache.maven.wagon.TransferFailedException: Error transferring file: repo1.maven.apache.org
Caused by: java.net.UnknownHostException: repo1.maven.apache.org
FAILED: org.apache.maven.plugins.dependency.TestGetMojo.windows-jdk7-m3.3.x_build / Build windows-jdk7-m3.3.x_build / testTransitive
Error Message:
Couldn't download artifact: Failed to read artifact descriptor for org.apache.maven:maven-model:jar:2.0.9
Stack Trace:
org.apache.maven.plugin.MojoExecutionException: Couldn't download artifact: Failed to read artifact descriptor for org.apache.maven:maven-model:jar:2.0.9
at org.apache.maven.plugins.dependency.TestGetMojo.testTransitive(TestGetMojo.java:75)
Caused by: org.apache.maven.shared.transfer.artifact.resolve.ArtifactResolverException: Failed to read artifact descriptor for org.apache.maven:maven-model:jar:2.0.9
at org.apache.maven.plugins.dependency.TestGetMojo.testTransitive(TestGetMojo.java:75)
Caused by: org.sonatype.aether.resolution.ArtifactDescriptorException: Failed to read artifact descriptor for org.apache.maven:maven-model:jar:2.0.9
at org.apache.maven.plugins.dependency.TestGetMojo.testTransitive(TestGetMojo.java:75)
Caused by: org.sonatype.aether.resolution.ArtifactResolutionException: Could not transfer artifact org.apache.maven:maven-model:pom:2.0.9 from central (http://repo1.maven.apache.org/maven2): Error transferring file: repo1.maven.apache.org
at org.apache.maven.plugins.dependency.TestGetMojo.testTransitive(TestGetMojo.java:75)
Caused by: org.sonatype.aether.transfer.ArtifactTransferException: Could not transfer artifact org.apache.maven:maven-model:pom:2.0.9 from central (http://repo1.maven.apache.org/maven2): Error transferring file: repo1.maven.apache.org
at org.apache.maven.plugins.dependency.TestGetMojo.testTransitive(TestGetMojo.java:75)
Caused by: org.apache.maven.wagon.TransferFailedException: Error transferring file: repo1.maven.apache.org
Caused by: java.net.UnknownHostException: repo1.maven.apache.org
FAILED: org.apache.maven.plugins.dependency.TestGetMojo.windows-jdk7-m3.6.x_build / Build windows-jdk7-m3.6.x_build / testRemoteRepositories
Error Message:
Couldn't download artifact: org.sonatype.aether.collection.DependencyCollectionException: Failed to collect dependencies for org.apache.maven:maven-model:jar:2.0.9 ()
Stack Trace:
org.apache.maven.plugin.MojoExecutionException: Couldn't download artifact: org.sonatype.aether.collection.DependencyCollectionException: Failed to collect dependencies for org.apache.maven:maven-model:jar:2.0.9 ()
at org.apache.maven.plugins.dependency.TestGetMojo.testRemoteRepositories(TestGetMojo.java:96)
Caused by: org.apache.maven.shared.transfer.dependencies.resolve.internal.Maven30DependencyResolverException: org.sonatype.aether.collection.DependencyCollectionException: Failed to collect dependencies for org.apache.maven:maven-model:jar:2.0.9 ()
at org.apache.maven.plugins.dependency.TestGetMojo.testRemoteRepositories(TestGetMojo.java:96)
Caused by: org.sonatype.aether.collection.DependencyCollectionException: Failed to collect dependencies for org.apache.maven:maven-model:jar:2.0.9 ()
at org.apache.maven.plugins.dependency.TestGetMojo.testRemoteRepositories(TestGetMojo.java:96)
Caused by: org.sonatype.aether.resolution.ArtifactDescriptorException: Failed to read artifact descriptor for org.apache.maven:maven-model:jar:2.0.9
at org.apache.maven.plugins.dependency.TestGetMojo.testRemoteRepositories(TestGetMojo.java:96)
Caused by: org.sonatype.aether.resolution.ArtifactResolutionException: Could not transfer artifact org.apache.maven:maven-model:pom:2.0.9 from central (http://repo1.maven.apache.org/maven2): Error transferring file: repo1.maven.apache.org
at org.apache.maven.plugins.dependency.TestGetMojo.testRemoteRepositories(TestGetMojo.java:96)
Caused by: org.sonatype.aether.transfer.ArtifactTransferException: Could not transfer artifact org.apache.maven:maven-model:pom:2.0.9 from central (http://repo1.maven.apache.org/maven2): Error transferring file: repo1.maven.apache.org
at org.apache.maven.plugins.dependency.TestGetMojo.testRemoteRepositories(TestGetMojo.java:96)
Caused by: org.apache.maven.wagon.TransferFailedException: Error transferring file: repo1.maven.apache.org
Caused by: java.net.UnknownHostException: repo1.maven.apache.org
FAILED: org.apache.maven.plugins.dependency.TestGetMojo.windows-jdk7-m3.6.x_build / Build windows-jdk7-m3.6.x_build / testTransitive
Error Message:
Couldn't download artifact: Failed to read artifact descriptor for org.apache.maven:maven-model:jar:2.0.9
Stack Trace:
org.apache.maven.plugin.MojoExecutionException: Couldn't download artifact: Failed to read artifact descriptor for org.apache.maven:maven-model:jar:2.0.9
at org.apache.maven.plugins.dependency.TestGetMojo.testTransitive(TestGetMojo.java:75)
Caused by: org.apache.maven.shared.transfer.artifact.resolve.ArtifactResolverException: Failed to read artifact descriptor for org.apache.maven:maven-model:jar:2.0.9
at org.apache.maven.plugins.dependency.TestGetMojo.testTransitive(TestGetMojo.java:75)
Caused by: org.sonatype.aether.resolution.ArtifactDescriptorException: Failed to read artifact descriptor for org.apache.maven:maven-model:jar:2.0.9
at org.apache.maven.plugins.dependency.TestGetMojo.testTransitive(TestGetMojo.java:75)
Caused by: org.sonatype.aether.resolution.ArtifactResolutionException: Could not transfer artifact org.apache.maven:maven-model:pom:2.0.9 from central (http://repo1.maven.apache.org/maven2): Error transferring file: repo1.maven.apache.org
at org.apache.maven.plugins.dependency.TestGetMojo.testTransitive(TestGetMojo.java:75)
Caused by: org.sonatype.aether.transfer.ArtifactTransferException: Could not transfer artifact org.apache.maven:maven-model:pom:2.0.9 from central (http://repo1.maven.apache.org/maven2): Error transferring file: repo1.maven.apache.org
at org.apache.maven.plugins.dependency.TestGetMojo.testTransitive(TestGetMojo.java:75)
Caused by: org.apache.maven.wagon.TransferFailedException: Error transferring file: repo1.maven.apache.org
Caused by: java.net.UnknownHostException: repo1.maven.apache.org
FAILED: org.apache.maven.plugins.dependency.TestGetMojo.windows-jdk8-m3.6.x_build / Build windows-jdk8-m3.6.x_build / testRemoteRepositories
Error Message:
Couldn't download artifact: org.sonatype.aether.collection.DependencyCollectionException: Failed to collect dependencies for org.apache.maven:maven-model:jar:2.0.9 ()
Stack Trace:
org.apache.maven.plugin.MojoExecutionException: Couldn't download artifact: org.sonatype.aether.collection.DependencyCollectionException: Failed to collect dependencies for org.apache.maven:maven-model:jar:2.0.9 ()
at org.apache.maven.plugins.dependency.TestGetMojo.testRemoteRepositories(TestGetMojo.java:96)
Caused by: org.apache.maven.shared.transfer.dependencies.resolve.internal.Maven30DependencyResolverException: org.sonatype.aether.collection.DependencyCollectionException: Failed to collect dependencies for org.apache.maven:maven-model:jar:2.0.9 ()
at org.apache.maven.plugins.dependency.TestGetMojo.testRemoteRepositories(TestGetMojo.java:96)
Caused by: org.sonatype.aether.collection.DependencyCollectionException: Failed to collect dependencies for org.apache.maven:maven-model:jar:2.0.9 ()
at org.apache.maven.plugins.dependency.TestGetMojo.testRemoteRepositories(TestGetMojo.java:96)
Caused by: org.sonatype.aether.resolution.ArtifactDescriptorException: Failed to read artifact descriptor for org.apache.maven:maven-model:jar:2.0.9
at org.apache.maven.plugins.dependency.TestGetMojo.testRemoteRepositories(TestGetMojo.java:96)
Caused by: org.sonatype.aether.resolution.ArtifactResolutionException: Could not transfer artifact org.apache.maven:maven-model:pom:2.0.9 from central (http://repo1.maven.apache.org/maven2): Error transferring file: repo1.maven.apache.org
at org.apache.maven.plugins.dependency.TestGetMojo.testRemoteRepositories(TestGetMojo.java:96)
Caused by: org.sonatype.aether.transfer.ArtifactTransferException: Could not transfer artifact org.apache.maven:maven-model:pom:2.0.9 from central (http://repo1.maven.apache.org/maven2): Error transferring file: repo1.maven.apache.org
at org.apache.maven.plugins.dependency.TestGetMojo.testRemoteRepositories(TestGetMojo.java:96)
Caused by: org.apache.maven.wagon.TransferFailedException: Error transferring file: repo1.maven.apache.org
Caused by: java.net.UnknownHostException: repo1.maven.apache.org
FAILED: org.apache.maven.plugins.dependency.TestGetMojo.windows-jdk8-m3.6.x_build / Build windows-jdk8-m3.6.x_build / testTransitive
Error Message:
Couldn't download artifact: Failed to read artifact descriptor for org.apache.maven:maven-model:jar:2.0.9
Stack Trace:
org.apache.maven.plugin.MojoExecutionException: Couldn't download artifact: Failed to read artifact descriptor for org.apache.maven:maven-model:jar:2.0.9
at org.apache.maven.plugins.dependency.TestGetMojo.testTransitive(TestGetMojo.java:75)
Caused by: org.apache.maven.shared.transfer.artifact.resolve.ArtifactResolverException: Failed to read artifact descriptor for org.apache.maven:maven-model:jar:2.0.9
at org.apache.maven.plugins.dependency.TestGetMojo.testTransitive(TestGetMojo.java:75)
Caused by: org.sonatype.aether.resolution.ArtifactDescriptorException: Failed to read artifact descriptor for org.apache.maven:maven-model:jar:2.0.9
at org.apache.maven.plugins.dependency.TestGetMojo.testTransitive(TestGetMojo.java:75)
Caused by: org.sonatype.aether.resolution.ArtifactResolutionException: Could not transfer artifact org.apache.maven:maven-model:pom:2.0.9 from central (http://repo1.maven.apache.org/maven2): Error transferring file: repo1.maven.apache.org
at org.apache.maven.plugins.dependency.TestGetMojo.testTransitive(TestGetMojo.java:75)
Caused by: org.sonatype.aether.transfer.ArtifactTransferException: Could not transfer artifact org.apache.maven:maven-model:pom:2.0.9 from central (http://repo1.maven.apache.org/maven2): Error transferring file: repo1.maven.apache.org
at org.apache.maven.plugins.dependency.TestGetMojo.testTransitive(TestGetMojo.java:75)
Caused by: org.apache.maven.wagon.TransferFailedException: Error transferring file: repo1.maven.apache.org
Caused by: java.net.UnknownHostException: repo1.maven.apache.org
FAILED: org.apache.maven.plugins.dependency.TestGetMojo.windows-jdk7-m3.5.x_build / Build windows-jdk7-m3.5.x_build / testRemoteRepositories
Error Message:
Couldn't download artifact: org.sonatype.aether.collection.DependencyCollectionException: Failed to collect dependencies for org.apache.maven:maven-model:jar:2.0.9 ()
Stack Trace:
org.apache.maven.plugin.MojoExecutionException: Couldn't download artifact: org.sonatype.aether.collection.DependencyCollectionException: Failed to collect dependencies for org.apache.maven:maven-model:jar:2.0.9 ()
at org.apache.maven.plugins.dependency.TestGetMojo.testRemoteRepositories(TestGetMojo.java:96)
Caused by: org.apache.maven.shared.transfer.dependencies.resolve.internal.Maven30DependencyResolverException: org.sonatype.aether.collection.DependencyCollectionException: Failed to collect dependencies for org.apache.maven:maven-model:jar:2.0.9 ()
at org.apache.maven.plugins.dependency.TestGetMojo.testRemoteRepositories(TestGetMojo.java:96)
Caused by: org.sonatype.aether.collection.DependencyCollectionException: Failed to collect dependencies for org.apache.maven:maven-model:jar:2.0.9 ()
at org.apache.maven.plugins.dependency.TestGetMojo.testRemoteRepositories(TestGetMojo.java:96)
Caused by: org.sonatype.aether.resolution.ArtifactDescriptorException: Failed to read artifact descriptor for org.apache.maven:maven-model:jar:2.0.9
at org.apache.maven.plugins.dependency.TestGetMojo.testRemoteRepositories(TestGetMojo.java:96)
Caused by: org.sonatype.aether.resolution.ArtifactResolutionException: Could not transfer artifact org.apache.maven:maven-model:pom:2.0.9 from central (http://repo1.maven.apache.org/maven2): Error transferring file: repo1.maven.apache.org
at org.apache.maven.plugins.dependency.TestGetMojo.testRemoteRepositories(TestGetMojo.java:96)
Caused by: org.sonatype.aether.transfer.ArtifactTransferException: Could not transfer artifact org.apache.maven:maven-model:pom:2.0.9 from central (http://repo1.maven.apache.org/maven2): Error transferring file: repo1.maven.apache.org
at org.apache.maven.plugins.dependency.TestGetMojo.testRemoteRepositories(TestGetMojo.java:96)
Caused by: org.apache.maven.wagon.TransferFailedException: Error transferring file: repo1.maven.apache.org
Caused by: java.net.UnknownHostException: repo1.maven.apache.org
FAILED: org.apache.maven.plugins.dependency.TestGetMojo.windows-jdk7-m3.5.x_build / Build windows-jdk7-m3.5.x_build / testTransitive
Error Message:
Couldn't download artifact: Failed to read artifact descriptor for org.apache.maven:maven-model:jar:2.0.9
Stack Trace:
org.apache.maven.plugin.MojoExecutionException: Couldn't download artifact: Failed to read artifact descriptor for org.apache.maven:maven-model:jar:2.0.9
at org.apache.maven.plugins.dependency.TestGetMojo.testTransitive(TestGetMojo.java:75)
Caused by: org.apache.maven.shared.transfer.artifact.resolve.ArtifactResolverException: Failed to read artifact descriptor for org.apache.maven:maven-model:jar:2.0.9
at org.apache.maven.plugins.dependency.TestGetMojo.testTransitive(TestGetMojo.java:75)
Caused by: org.sonatype.aether.resolution.ArtifactDescriptorException: Failed to read artifact descriptor for org.apache.maven:maven-model:jar:2.0.9
at org.apache.maven.plugins.dependency.TestGetMojo.testTransitive(TestGetMojo.java:75)
Caused by: org.sonatype.aether.resolution.ArtifactResolutionException: Could not transfer artifact org.apache.maven:maven-model:pom:2.0.9 from central (http://repo1.maven.apache.org/maven2): Error transferring file: repo1.maven.apache.org
at org.apache.maven.plugins.dependency.TestGetMojo.testTransitive(TestGetMojo.java:75)
Caused by: org.sonatype.aether.transfer.ArtifactTransferException: Could not transfer artifact org.apache.maven:maven-model:pom:2.0.9 from central (http://repo1.maven.apache.org/maven2): Error transferring file: repo1.maven.apache.org
at org.apache.maven.plugins.dependency.TestGetMojo.testTransitive(TestGetMojo.java:75)
Caused by: org.apache.maven.wagon.TransferFailedException: Error transferring file: repo1.maven.apache.org
Caused by: java.net.UnknownHostException: repo1.maven.apache.org
FAILED: org.apache.maven.plugins.dependency.TestGetMojo.windows-jdk11-m3.6.x_build / Build windows-jdk11-m3.6.x_build / testRemoteRepositories
Error Message:
Couldn't download artifact: org.sonatype.aether.collection.DependencyCollectionException: Failed to collect dependencies for org.apache.maven:maven-model:jar:2.0.9 ()
Stack Trace:
org.apache.maven.plugin.MojoExecutionException: Couldn't download artifact: org.sonatype.aether.collection.DependencyCollectionException: Failed to collect dependencies for org.apache.maven:maven-model:jar:2.0.9 ()
at org.apache.maven.plugins.dependency.TestGetMojo.testRemoteRepositories(TestGetMojo.java:96)
Caused by: org.apache.maven.shared.transfer.dependencies.resolve.internal.Maven30DependencyResolverException: org.sonatype.aether.collection.DependencyCollectionException: Failed to collect dependencies for org.apache.maven:maven-model:jar:2.0.9 ()
at org.apache.maven.plugins.dependency.TestGetMojo.testRemoteRepositories(TestGetMojo.java:96)
Caused by: org.sonatype.aether.collection.DependencyCollectionException: Failed to collect dependencies for org.apache.maven:maven-model:jar:2.0.9 ()
at org.apache.maven.plugins.dependency.TestGetMojo.testRemoteRepositories(TestGetMojo.java:96)
Caused by: org.sonatype.aether.resolution.ArtifactDescriptorException: Failed to read artifact descriptor for org.apache.maven:maven-model:jar:2.0.9
at org.apache.maven.plugins.dependency.TestGetMojo.testRemoteRepositories(TestGetMojo.java:96)
Caused by: org.sonatype.aether.resolution.ArtifactResolutionException: Could not transfer artifact org.apache.maven:maven-model:pom:2.0.9 from central (http://repo1.maven.apache.org/maven2): Error transferring file: repo1.maven.apache.org
at org.apache.maven.plugins.dependency.TestGetMojo.testRemoteRepositories(TestGetMojo.java:96)
Caused by: org.sonatype.aether.transfer.ArtifactTransferException: Could not transfer artifact org.apache.maven:maven-model:pom:2.0.9 from central (http://repo1.maven.apache.org/maven2): Error transferring file: repo1.maven.apache.org
at org.apache.maven.plugins.dependency.TestGetMojo.testRemoteRepositories(TestGetMojo.java:96)
Caused by: org.apache.maven.wagon.TransferFailedException: Error transferring file: repo1.maven.apache.org
Caused by: java.net.UnknownHostException: repo1.maven.apache.org
FAILED: org.apache.maven.plugins.dependency.TestGetMojo.windows-jdk11-m3.6.x_build / Build windows-jdk11-m3.6.x_build / testTransitive
Error Message:
Couldn't download artifact: Failed to read artifact descriptor for org.apache.maven:maven-model:jar:2.0.9
Stack Trace:
org.apache.maven.plugin.MojoExecutionException: Couldn't download artifact: Failed to read artifact descriptor for org.apache.maven:maven-model:jar:2.0.9
at org.apache.maven.plugins.dependency.TestGetMojo.testTransitive(TestGetMojo.java:75)
Caused by: org.apache.maven.shared.transfer.artifact.resolve.ArtifactResolverException: Failed to read artifact descriptor for org.apache.maven:maven-model:jar:2.0.9
at org.apache.maven.plugins.dependency.TestGetMojo.testTransitive(TestGetMojo.java:75)
Caused by: org.sonatype.aether.resolution.ArtifactDescriptorException: Failed to read artifact descriptor for org.apache.maven:maven-model:jar:2.0.9
at org.apache.maven.plugins.dependency.TestGetMojo.testTransitive(TestGetMojo.java:75)
Caused by: org.sonatype.aether.resolution.ArtifactResolutionException: Could not transfer artifact org.apache.maven:maven-model:pom:2.0.9 from central (http://repo1.maven.apache.org/maven2): Error transferring file: repo1.maven.apache.org
at org.apache.maven.plugins.dependency.TestGetMojo.testTransitive(TestGetMojo.java:75)
Caused by: org.sonatype.aether.transfer.ArtifactTransferException: Could not transfer artifact org.apache.maven:maven-model:pom:2.0.9 from central (http://repo1.maven.apache.org/maven2): Error transferring file: repo1.maven.apache.org
at org.apache.maven.plugins.dependency.TestGetMojo.testTransitive(TestGetMojo.java:75)
Caused by: org.apache.maven.wagon.TransferFailedException: Error transferring file: repo1.maven.apache.org
Caused by: java.net.UnknownHostException: repo1.maven.apache.org
FAILED: org.apache.maven.plugins.dependency.TestGetMojo.windows-jdk13-m3.6.x_build / Build windows-jdk13-m3.6.x_build / testRemoteRepositories
Error Message:
Couldn't download artifact: org.sonatype.aether.collection.DependencyCollectionException: Failed to collect dependencies for org.apache.maven:maven-model:jar:2.0.9 ()
Stack Trace:
org.apache.maven.plugin.MojoExecutionException: Couldn't download artifact: org.sonatype.aether.collection.DependencyCollectionException: Failed to collect dependencies for org.apache.maven:maven-model:jar:2.0.9 ()
at org.apache.maven.plugins.dependency.TestGetMojo.testRemoteRepositories(TestGetMojo.java:96)
Caused by: org.apache.maven.shared.transfer.dependencies.resolve.internal.Maven30DependencyResolverException: org.sonatype.aether.collection.DependencyCollectionException: Failed to collect dependencies for org.apache.maven:maven-model:jar:2.0.9 ()
at org.apache.maven.plugins.dependency.TestGetMojo.testRemoteRepositories(TestGetMojo.java:96)
Caused by: org.sonatype.aether.collection.DependencyCollectionException: Failed to collect dependencies for org.apache.maven:maven-model:jar:2.0.9 ()
at org.apache.maven.plugins.dependency.TestGetMojo.testRemoteRepositories(TestGetMojo.java:96)
Caused by: org.sonatype.aether.resolution.ArtifactDescriptorException: Failed to read artifact descriptor for org.apache.maven:maven-model:jar:2.0.9
at org.apache.maven.plugins.dependency.TestGetMojo.testRemoteRepositories(TestGetMojo.java:96)
Caused by: org.sonatype.aether.resolution.ArtifactResolutionException: Could not transfer artifact org.apache.maven:maven-model:pom:2.0.9 from central (http://repo1.maven.apache.org/maven2): Error transferring file: repo1.maven.apache.org
at org.apache.maven.plugins.dependency.TestGetMojo.testRemoteRepositories(TestGetMojo.java:96)
Caused by: org.sonatype.aether.transfer.ArtifactTransferException: Could not transfer artifact org.apache.maven:maven-model:pom:2.0.9 from central (http://repo1.maven.apache.org/maven2): Error transferring file: repo1.maven.apache.org
at org.apache.maven.plugins.dependency.TestGetMojo.testRemoteRepositories(TestGetMojo.java:96)
Caused by: org.apache.maven.wagon.TransferFailedException: Error transferring file: repo1.maven.apache.org
Caused by: java.net.UnknownHostException: repo1.maven.apache.org
FAILED: org.apache.maven.plugins.dependency.TestGetMojo.windows-jdk13-m3.6.x_build / Build windows-jdk13-m3.6.x_build / testTransitive
Error Message:
Couldn't download artifact: Failed to read artifact descriptor for org.apache.maven:maven-model:jar:2.0.9
Stack Trace:
org.apache.maven.plugin.MojoExecutionException: Couldn't download artifact: Failed to read artifact descriptor for org.apache.maven:maven-model:jar:2.0.9
at org.apache.maven.plugins.dependency.TestGetMojo.testTransitive(TestGetMojo.java:75)
Caused by: org.apache.maven.shared.transfer.artifact.resolve.ArtifactResolverException: Failed to read artifact descriptor for org.apache.maven:maven-model:jar:2.0.9
at org.apache.maven.plugins.dependency.TestGetMojo.testTransitive(TestGetMojo.java:75)
Caused by: org.sonatype.aether.resolution.ArtifactDescriptorException: Failed to read artifact descriptor for org.apache.maven:maven-model:jar:2.0.9
at org.apache.maven.plugins.dependency.TestGetMojo.testTransitive(TestGetMojo.java:75)
Caused by: org.sonatype.aether.resolution.ArtifactResolutionException: Could not transfer artifact org.apache.maven:maven-model:pom:2.0.9 from central (http://repo1.maven.apache.org/maven2): Error transferring file: repo1.maven.apache.org
at org.apache.maven.plugins.dependency.TestGetMojo.testTransitive(TestGetMojo.java:75)
Caused by: org.sonatype.aether.transfer.ArtifactTransferException: Could not transfer artifact org.apache.maven:maven-model:pom:2.0.9 from central (http://repo1.maven.apache.org/maven2): Error transferring file: repo1.maven.apache.org
at org.apache.maven.plugins.dependency.TestGetMojo.testTransitive(TestGetMojo.java:75)
Caused by: org.apache.maven.wagon.TransferFailedException: Error transferring file: repo1.maven.apache.org
Caused by: java.net.UnknownHostException: repo1.maven.apache.org
FAILED: org.apache.maven.plugins.dependency.TestGetMojo.windows-jdk14-m3.6.x_build / Build windows-jdk14-m3.6.x_build / testRemoteRepositories
Error Message:
Couldn't download artifact: org.sonatype.aether.collection.DependencyCollectionException: Failed to collect dependencies for org.apache.maven:maven-model:jar:2.0.9 ()
Stack Trace:
org.apache.maven.plugin.MojoExecutionException: Couldn't download artifact: org.sonatype.aether.collection.DependencyCollectionException: Failed to collect dependencies for org.apache.maven:maven-model:jar:2.0.9 ()
at org.apache.maven.plugins.dependency.TestGetMojo.testRemoteRepositories(TestGetMojo.java:96)
Caused by: org.apache.maven.shared.transfer.dependencies.resolve.internal.Maven30DependencyResolverException: org.sonatype.aether.collection.DependencyCollectionException: Failed to collect dependencies for org.apache.maven:maven-model:jar:2.0.9 ()
at org.apache.maven.plugins.dependency.TestGetMojo.testRemoteRepositories(TestGetMojo.java:96)
Caused by: org.sonatype.aether.collection.DependencyCollectionException: Failed to collect dependencies for org.apache.maven:maven-model:jar:2.0.9 ()
at org.apache.maven.plugins.dependency.TestGetMojo.testRemoteRepositories(TestGetMojo.java:96)
Caused by: org.sonatype.aether.resolution.ArtifactDescriptorException: Failed to read artifact descriptor for org.apache.maven:maven-model:jar:2.0.9
at org.apache.maven.plugins.dependency.TestGetMojo.testRemoteRepositories(TestGetMojo.java:96)
Caused by: org.sonatype.aether.resolution.ArtifactResolutionException: Could not transfer artifact org.apache.maven:maven-model:pom:2.0.9 from central (http://repo1.maven.apache.org/maven2): Error transferring file: repo1.maven.apache.org
at org.apache.maven.plugins.dependency.TestGetMojo.testRemoteRepositories(TestGetMojo.java:96)
Caused by: org.sonatype.aether.transfer.ArtifactTransferException: Could not transfer artifact org.apache.maven:maven-model:pom:2.0.9 from central (http://repo1.maven.apache.org/maven2): Error transferring file: repo1.maven.apache.org
at org.apache.maven.plugins.dependency.TestGetMojo.testRemoteRepositories(TestGetMojo.java:96)
Caused by: org.apache.maven.wagon.TransferFailedException: Error transferring file: repo1.maven.apache.org
Caused by: java.net.UnknownHostException: repo1.maven.apache.org
FAILED: org.apache.maven.plugins.dependency.TestGetMojo.windows-jdk14-m3.6.x_build / Build windows-jdk14-m3.6.x_build / testTransitive
Error Message:
Couldn't download artifact: Failed to read artifact descriptor for org.apache.maven:maven-model:jar:2.0.9
Stack Trace:
org.apache.maven.plugin.MojoExecutionException: Couldn't download artifact: Failed to read artifact descriptor for org.apache.maven:maven-model:jar:2.0.9
at org.apache.maven.plugins.dependency.TestGetMojo.testTransitive(TestGetMojo.java:75)
Caused by: org.apache.maven.shared.transfer.artifact.resolve.ArtifactResolverException: Failed to read artifact descriptor for org.apache.maven:maven-model:jar:2.0.9
at org.apache.maven.plugins.dependency.TestGetMojo.testTransitive(TestGetMojo.java:75)
Caused by: org.sonatype.aether.resolution.ArtifactDescriptorException: Failed to read artifact descriptor for org.apache.maven:maven-model:jar:2.0.9
at org.apache.maven.plugins.dependency.TestGetMojo.testTransitive(TestGetMojo.java:75)
Caused by: org.sonatype.aether.resolution.ArtifactResolutionException: Could not transfer artifact org.apache.maven:maven-model:pom:2.0.9 from central (http://repo1.maven.apache.org/maven2): Error transferring file: repo1.maven.apache.org
at org.apache.maven.plugins.dependency.TestGetMojo.testTransitive(TestGetMojo.java:75)
Caused by: org.sonatype.aether.transfer.ArtifactTransferException: Could not transfer artifact org.apache.maven:maven-model:pom:2.0.9 from central (http://repo1.maven.apache.org/maven2): Error transferring file: repo1.maven.apache.org
at org.apache.maven.plugins.dependency.TestGetMojo.testTransitive(TestGetMojo.java:75)
Caused by: org.apache.maven.wagon.TransferFailedException: Error transferring file: repo1.maven.apache.org
Caused by: java.net.UnknownHostException: repo1.maven.apache.org
Build log:
[...truncated 11492 lines...]
[INFO] ------------------------------------------------------------------------
[INFO] [jenkins-event-spy] Generated F:\jenkins\jenkins-slave\workspace\dependency-plugin_GITHUB_ACTIONS@3@2@tmp\withMavenbe68278b\maven-spy-20200208-191453-7278479378462539835859.log
[Pipeline] }
[Pipeline] // dir
[Pipeline] }
[withMaven] artifactsPublisher - Archive artifact windows-jdk13-m3.6.x_build\pom.xml under org\apache\maven\plugins\maven-dependency-plugin\3.1.2-SNAPSHOT\maven-dependency-plugin-3.1.2-SNAPSHOT.pom
[withMaven] artifactsPublisher - Archive artifact windows-jdk13-m3.6.x_build\target\maven-dependency-plugin-3.1.2-SNAPSHOT.jar under org\apache\maven\plugins\maven-dependency-plugin\3.1.2-SNAPSHOT\maven-dependency-plugin-3.1.2-SNAPSHOT.jar
[withMaven] junitPublisher - Archive test results for Maven artifact org.apache.maven.plugins:maven-dependency-plugin:maven-plugin:3.1.2-SNAPSHOT generated by maven-surefire-plugin:test (default-test): windows-jdk13-m3.6.x_build\target\surefire-reports\*.xml
Recording test results
[withMaven] openTasksPublisher - Scan Tasks for Maven artifact org.apache.maven.plugins:maven-dependency-plugin:maven-plugin:3.1.2-SNAPSHOT in source directory windows-jdk13-m3.6.x_build\src\main\java
[TASKS] Scanning folder 'f:\jenkins\jenkins-slave\workspace\dependency-plugin_GITHUB_ACTIONS@3@2' for files matching the pattern 'windows-jdk13-m3.6.x_build\src\main\java\**\*' - excludes: null
[TASKS] Found 48 files to scan for tasks
[TASKS] Found 4 open tasks.
Skipping warnings blame since pipelines do not have an SCM link.%n
[TASKS] Computing warning deltas based on reference build #16
[withMaven] invokerPublisher - Archive invoker results for Maven artifact MavenArtifact{org.apache.maven.plugins:maven-dependency-plugin:maven-plugin:3.1.2-SNAPSHOT(version: 3.1.2-SNAPSHOT, snapshot:false) } generated by PluginInvocation{org.apache.maven.plugins:maven-invoker-plugin:3.1.0@integration-test integration-test}: windows-jdk13-m3.6.x_build\target\invoker-reports\*.xml
[INFO] run post-build script verify.bsh
[INFO] build-classpath\pom.xml .......................... SUCCESS (4.8 s)
[INFO] Building: build-classpath-output-file-and-property\pom.xml
[INFO] run post-build script verify.bsh
[INFO] build-classpath-output-file-and-property\pom.xml . SUCCESS (8.8 s)
[INFO] Building: collect\pom.xml
[INFO] collect\pom.xml .................................. SUCCESS (4.7 s)
[INFO] Building: copy\pom.xml
[withMaven] Publishers: Generated Artifacts Publisher: 115 ms, Junit Publisher: 937 ms, Open Task Scanner Publisher: 119 ms, Invoker Publisher: 20441 ms, Pipeline Graph Publisher: 1 ms
[Pipeline] // withMaven
[Pipeline] cleanWs
[WS-CLEANUP] Deleting project workspace...
[WS-CLEANUP] Deferred wipeout is used...
[WS-CLEANUP] done
[Pipeline] }
[Pipeline] // stage
[Pipeline] }
[Pipeline] // ws
[Pipeline] }
[Pipeline] // node
[Pipeline] }
[INFO] run post-build script verify.bsh
[INFO] copy\pom.xml ..................................... SUCCESS (4.9 s)
[INFO] Building: copy-and-unpack-with-alternate-local-repo\pom.xml
[INFO] run post-build script verify.bsh
[INFO] copy-and-unpack-with-alternate-local-repo\pom.xml SUCCESS (6.9 s)
[INFO] Building: copy-cli\pom.xml
[INFO] run post-build script verify.bsh
[INFO] copy-cli\pom.xml ................................. SUCCESS (4.3 s)
[INFO] Building: copy-dependencies\pom.xml
[INFO] run post-build script verify.bsh
[INFO] copy-dependencies\pom.xml ........................ SUCCESS (6.1 s)
[INFO] Building: copy-from-reactor\pom.xml
[INFO] run post-build script verify.bsh
[INFO] copy-from-reactor\pom.xml ........................ SUCCESS (6.6 s)
[INFO] Building: copy-from-remote-repository\pom.xml
[INFO] run pre-build script setup.bsh
[INFO] run post-build script verify.bsh
[INFO] copy-from-remote-repository\pom.xml .............. SUCCESS (6.4 s)
[INFO] Building: dependency-properties\pom.xml
[INFO] run post-build script verify.bsh
[INFO] dependency-properties\pom.xml .................... SUCCESS (5.2 s)
[INFO] Building: filterunpack\pom.xml
[INFO] run post-build script verify.groovy
WARNING: An illegal reflective access operation has occurred
WARNING: Illegal reflective access by org.codehaus.groovy.reflection.CachedClass (file:/f:/jenkins/jenkins-slave/workspace/.maven_repositories/0/org/codehaus/groovy/groovy-all/2.4.8/groovy-all-2.4.8.jar) to method java.lang.Object.finalize()
WARNING: Please consider reporting this to the maintainers of org.codehaus.groovy.reflection.CachedClass
WARNING: Use --illegal-access=warn to enable warnings of further illegal reflective access operations
WARNING: All illegal access operations will be denied in a future release
[INFO] filterunpack\pom.xml ............................. SUCCESS (5.4 s)
[INFO] Building: get-artifact\pom.xml
[INFO] run pre-build script setup.bsh
[INFO] run post-build script verify.bsh
[INFO] get-artifact\pom.xml ............................. SUCCESS (4.7 s)
[INFO] Building: get-artifact-maven-plugin\pom.xml
[INFO] run pre-build script setup.bsh
[INFO] run post-build script verify.bsh
[INFO] get-artifact-maven-plugin\pom.xml ................ SUCCESS (4.4 s)
[INFO] Building: get-artifact-no-transitive\pom.xml
[INFO] run pre-build script setup.bsh
[INFO] run post-build script verify.bsh
[INFO] get-artifact-no-transitive\pom.xml ............... SUCCESS (4.7 s)
[INFO] Building: get-gav\pom.xml
[INFO] run pre-build script setup.bsh
[INFO] run post-build script verify.bsh
[INFO] get-gav\pom.xml .................................. SUCCESS (3.9 s)
[INFO] Building: go-offline\pom.xml
[INFO] go-offline\pom.xml ............................... SUCCESS (8.2 s)
[INFO] Building: list-repositories\pom.xml
[INFO] list-repositories\pom.xml ........................ SUCCESS (4.1 s)
[INFO] Building: mdep-439-analyze-java8\pom.xml
[INFO] mdep-439-analyze-java8\pom.xml ................... SUCCESS (6.6 s)
[INFO] Building: mdep-450-project-with-ancestor\pom.xml
[INFO] run post-build script verify.groovy
[INFO] mdep-450-project-with-ancestor\pom.xml ........... SUCCESS (4.3 s)
[INFO] Building: mdep-450-project-without-ancestor\pom.xml
[INFO] run post-build script verify.groovy
[INFO] mdep-450-project-without-ancestor\pom.xml ........ SUCCESS (4.0 s)
[INFO] Building: mdep-506-dependency-without-version-in-depmgt\pom.xml
[INFO] mdep-506-dependency-without-version-in-depmgt\pom.xml SUCCESS (6.8 s)
[INFO] Building: mdep-571-resolve-java9\pom.xml
[INFO] run post-build script verify.groovy
[INFO] mdep-571-resolve-java9\pom.xml ................... SUCCESS (4.2 s)
[INFO] Building: mdep-572-unpack-tar-long-file\pom.xml
[INFO] run post-build script verify.bsh
[INFO] mdep-572-unpack-tar-long-file\pom.xml ............ SUCCESS (7.0 s)
[INFO] Building: mdep-578_display-reason-invalid-module\pom.xml
[INFO] run post-build script verify.groovy
[INFO] mdep-578_display-reason-invalid-module\pom.xml ... SUCCESS (4.6 s)
[INFO] Building: mdep-580_display-manifest-automodules\pom.xml
[INFO] run post-build script verify.groovy
[INFO] mdep-580_display-manifest-automodules\pom.xml .... SUCCESS (5.2 s)
[INFO] Building: mdep-586-unpacking-resources\pom.xml
[INFO] run post-build script verify.groovy
[INFO] mdep-586-unpacking-resources\pom.xml ............. SUCCESS (4.6 s)
[INFO] Building: mdep-599-analyze-java9\pom.xml
[INFO] mdep-599-analyze-java9\pom.xml ................... SUCCESS (8.8 s)
[INFO] Building: purge-local-repository\pom.xml
[INFO] run pre-build script setup.bsh
[INFO] run post-build script verify.groovy
[INFO] purge-local-repository\pom.xml ................... SUCCESS (5.0 s)
[INFO] Building: purge-local-repository-bad-dep\pom.xml
[INFO] run post-build script verify.groovy
[INFO] purge-local-repository-bad-dep\pom.xml ........... SUCCESS (4.5 s)
[INFO] Building: purge-local-repository-include\pom.xml
[INFO] run post-build script verify.groovy
[INFO] purge-local-repository-include\pom.xml ........... SUCCESS (4.4 s)
[INFO] Building: purge-local-repository-multi-module\pom.xml
[INFO] run pre-build script setup.bsh
[INFO] run post-build script verify.groovy
[INFO] purge-local-repository-multi-module\pom.xml ...... SUCCESS (4.5 s)
[INFO] Building: purge-local-repository-multi-module-execution\pom.xml
[INFO] run pre-build script setup.bsh
[INFO] run post-build script verify.bsh
[INFO] purge-local-repository-multi-module-execution\pom.xml SUCCESS (7.2 s)
[INFO] Building: purge-local-repository-non-transitive\pom.xml
[INFO] run post-build script verify.bsh
[INFO] purge-local-repository-non-transitive\pom.xml .... SUCCESS (4.5 s)
[INFO] Building: purge-local-repository-reresolve\pom.xml
[INFO] run post-build script verify.bsh
[INFO] purge-local-repository-reresolve\pom.xml ......... SUCCESS (4.9 s)
[INFO] Building: purge-local-repository-snapshots-only\pom.xml
[INFO] run pre-build script setup.bsh
[INFO] run post-build script verify.bsh
[INFO] purge-local-repository-snapshots-only\pom.xml .... SUCCESS (5.6 s)
[INFO] Building: purge-local-repository-version-range\pom.xml
[INFO] run post-build script verify.bsh
[INFO] purge-local-repository-version-range\pom.xml ..... SUCCESS (4.7 s)
[INFO] Building: resolve\pom.xml
[INFO] resolve\pom.xml .................................. SUCCESS (4.6 s)
[INFO] Building: resolve-plugins\pom.xml
[INFO] resolve-plugins\pom.xml .......................... SUCCESS (5.4 s)
[INFO] Building: resolve-plugins-exclude-reactor\pom.xml
[INFO] run post-build script verify.groovy
[INFO] resolve-plugins-exclude-reactor\pom.xml .......... SUCCESS (6.5 s)
[INFO] Building: resolve-plugins-with-exclude\pom.xml
[INFO] run post-build script verify.groovy
[INFO] resolve-plugins-with-exclude\pom.xml ............. SUCCESS (5.3 s)
[INFO] Building: sources\pom.xml
[INFO] sources\pom.xml .................................. SUCCESS (5.8 s)
[INFO] Building: tree\pom.xml
[INFO] tree\pom.xml ..................................... SKIPPED due to Maven version
[INFO] Building: tree-includes\pom.xml
[INFO] run post-build script verify.bsh
[INFO] tree-includes\pom.xml ............................ SUCCESS (4.7 s)
[INFO] Building: tree-multimodule\pom.xml
[INFO] run post-build script verify.bsh
[INFO] tree-multimodule\pom.xml ......................... SUCCESS (6.0 s)
[INFO] Building: unpack\pom.xml
[INFO] run post-build script verify.bsh
[INFO] unpack\pom.xml ................................... SUCCESS (5.9 s)
[INFO] Building: unpack-cli\pom.xml
[INFO] run post-build script verify.bsh
[INFO] unpack-cli\pom.xml ............................... SUCCESS (5.3 s)
[INFO] Building: unpack-custom-ear\pom.xml
[INFO] run post-build script verify.groovy
[INFO] unpack-custom-ear\pom.xml ........................ SUCCESS (5.2 s)
[INFO] Building: unpack-dependencies\pom.xml
[INFO] run post-build script verify.groovy
[INFO] unpack-dependencies\pom.xml ...................... SUCCESS (8.2 s)
[INFO] Building: unpack-dependencies-with-filemappers\pom.xml
[INFO] run post-build script verify.groovy
[INFO] unpack-dependencies-with-filemappers\pom.xml ..... SUCCESS (7.4 s)
[INFO] Building: unpack-from-remote-repository\pom.xml
[INFO] run pre-build script setup.bsh
[INFO] run post-build script verify.bsh
[INFO] unpack-from-remote-repository\pom.xml ............ SUCCESS (6.7 s)
[INFO] Building: used-dependencies\pom.xml
[INFO] used-dependencies\pom.xml ........................ SUCCESS (5.9 s)
[INFO] Building: purge-local-repository-without-pom
[INFO] run pre-build script setup.bsh
[INFO] run post-build script verify.groovy
[INFO] purge-local-repository-without-pom ............... SUCCESS (4.2 s)
[INFO]
[INFO] --- mrm-maven-plugin:1.2.0:stop (default) @ maven-dependency-plugin ---
[INFO] Stopping Mock Repository Manager on http://localhost:60178
[INFO] Stopped SocketConnector@0.0.0.0:60178
[INFO] Mock Repository Manager http://localhost:60178 is stopped.
[INFO]
[INFO] --- maven-checkstyle-plugin:3.0.0:check (checkstyle-check) @ maven-dependency-plugin ---
[INFO] There is 1 error reported by Checkstyle 6.18 with config/maven_checks.xml ruleset.
[INFO] Ignored 1 error, 0 violation remaining.
[INFO]
[INFO] --- maven-invoker-plugin:3.1.0:verify (integration-test) @ maven-dependency-plugin ---
[INFO] -------------------------------------------------
[INFO] Build Summary:
[INFO] Passed: 59, Failed: 0, Errors: 0, Skipped: 1
[INFO] -------------------------------------------------
[INFO] ------------------------------------------------------------------------
[INFO] BUILD SUCCESS
[INFO] ------------------------------------------------------------------------
[INFO] Total time: 07:08 min
[INFO] Finished at: 2020-02-08T19:26:46-08:00
[INFO] ------------------------------------------------------------------------
[INFO] [jenkins-event-spy] Generated F:\jenkins\jenkins-slave\workspace\dependency-plugin_GITHUB_ACTIONS@2@tmp\withMavenbb686f64\maven-spy-20200208-191936-851541837989525568322.log
[Pipeline] }
[Pipeline] // dir
[Pipeline] }
[withMaven] artifactsPublisher - Archive artifact windows-jdk14-m3.6.x_build\pom.xml under org\apache\maven\plugins\maven-dependency-plugin\3.1.2-SNAPSHOT\maven-dependency-plugin-3.1.2-SNAPSHOT.pom
[withMaven] artifactsPublisher - Archive artifact windows-jdk14-m3.6.x_build\target\maven-dependency-plugin-3.1.2-SNAPSHOT.jar under org\apache\maven\plugins\maven-dependency-plugin\3.1.2-SNAPSHOT\maven-dependency-plugin-3.1.2-SNAPSHOT.jar
[withMaven] junitPublisher - Archive test results for Maven artifact org.apache.maven.plugins:maven-dependency-plugin:maven-plugin:3.1.2-SNAPSHOT generated by maven-surefire-plugin:test (default-test): windows-jdk14-m3.6.x_build\target\surefire-reports\*.xml
Recording test results
[withMaven] openTasksPublisher - Scan Tasks for Maven artifact org.apache.maven.plugins:maven-dependency-plugin:maven-plugin:3.1.2-SNAPSHOT in source directory windows-jdk14-m3.6.x_build\src\main\java
[TASKS] Scanning folder 'f:\jenkins\jenkins-slave\workspace\dependency-plugin_GITHUB_ACTIONS@2' for files matching the pattern 'windows-jdk14-m3.6.x_build\src\main\java\**\*' - excludes: null
[TASKS] Found 48 files to scan for tasks
[TASKS] Found 4 open tasks.
Skipping warnings blame since pipelines do not have an SCM link.%n
[TASKS] Computing warning deltas based on reference build #16
[withMaven] invokerPublisher - Archive invoker results for Maven artifact MavenArtifact{org.apache.maven.plugins:maven-dependency-plugin:maven-plugin:3.1.2-SNAPSHOT(version: 3.1.2-SNAPSHOT, snapshot:false) } generated by PluginInvocation{org.apache.maven.plugins:maven-invoker-plugin:3.1.0@integration-test integration-test}: windows-jdk14-m3.6.x_build\target\invoker-reports\*.xml
[withMaven] Publishers: Generated Artifacts Publisher: 108 ms, Junit Publisher: 861 ms, Open Task Scanner Publisher: 108 ms, Dependencies Fingerprint Publisher: 1 ms, Invoker Publisher: 19505 ms, Pipeline Graph Publisher: 1 ms
[Pipeline] // withMaven
[Pipeline] cleanWs
[WS-CLEANUP] Deleting project workspace...
[WS-CLEANUP] Deferred wipeout is used...
[WS-CLEANUP] done
[Pipeline] }
[Pipeline] // stage
[Pipeline] }
[Pipeline] // ws
[Pipeline] }
[Pipeline] // node
[Pipeline] }
[Pipeline] // parallel
[Pipeline] stage
[Pipeline] { (Notifications)
[Pipeline] echo
Build result: UNSTABLE
[Pipeline] jiraIssueSelector
[Pipeline] echo
The authors of changes [rfscholte, khmarbaise, tibordigana].
[Pipeline] echo
Sending email ...
[Pipeline] emailext
Build succeeded in Jenkins: Maven TLP » maven-dependency-plugin » GITHUB_ACTIONS #18
Posted by Apache Jenkins Server <je...@builds.apache.org>.
See https://builds.apache.org/job/maven-box/job/maven-dependency-plugin/job/GITHUB_ACTIONS/18/
Changes:
* add Maven 3.1.1
All tests passed