You are viewing a plain text version of this content. The canonical link for it is here.
Posted to notifications@jclouds.apache.org by Apache Jenkins Server <je...@builds.apache.org> on 2025/01/03 18:57:19 UTC

Build failed in Jenkins: JClouds » jclouds-labs-aws #90

See <https://ci-builds.apache.org/job/JClouds/job/jclouds-labs-aws/90/display/redirect>

Changes:


------------------------------------------
Started by an SCM change
Running as SYSTEM
[EnvInject] - Loading node environment variables.
Building remotely on builds26 (ubuntu) in workspace <https://ci-builds.apache.org/job/JClouds/job/jclouds-labs-aws/ws/>
The recommended git tool is: NONE
No credentials specified
Cloning the remote Git repository
Cloning repository https://gitbox.apache.org/repos/asf/jclouds-labs-aws.git
 > git init <https://ci-builds.apache.org/job/JClouds/job/jclouds-labs-aws/ws/> # timeout=10
Fetching upstream changes from https://gitbox.apache.org/repos/asf/jclouds-labs-aws.git
 > git --version # timeout=10
 > git --version # 'git version 2.34.1'
 > git fetch --tags --force --progress -- https://gitbox.apache.org/repos/asf/jclouds-labs-aws.git +refs/heads/*:refs/remotes/origin/* # timeout=10
 > git config remote.origin.url https://gitbox.apache.org/repos/asf/jclouds-labs-aws.git # timeout=10
 > git config --add remote.origin.fetch +refs/heads/*:refs/remotes/origin/* # timeout=10
Avoid second fetch
 > git rev-parse refs/remotes/origin/master^{commit} # timeout=10
Checking out Revision e57e8b7879344fdb9816a1d8c73ae06f2f056a89 (refs/remotes/origin/master)
 > git config core.sparsecheckout # timeout=10
 > git checkout -f e57e8b7879344fdb9816a1d8c73ae06f2f056a89 # timeout=10
Commit message: "Next development version 2.6.0-SNAPSHOT"
First time build. Skipping changelog.
Parsing POMs
Failed to transfer Could not find metadata org.apache.jclouds:jclouds-project:2.6.0-SNAPSHOT/maven-metadata.xml in apache-snapshots (https://repository.apache.org/content/repositories/snapshots)
Failed to transfer Could not find artifact org.apache.jclouds:jclouds-project:pom:2.6.0-SNAPSHOT in apache-snapshots (https://repository.apache.org/content/repositories/snapshots)
ERROR: Failed to parse POMs
hudson.remoting.ProxyException: hudson.maven.MavenModuleSetBuild$MavenExecutionException: org.apache.maven.project.ProjectBuildingException: Some problems were encountered while processing the POMs:
[FATAL] Non-resolvable parent POM for org.apache.jclouds.labs:jclouds-labs-aws:2.6.0-SNAPSHOT: Could not find artifact org.apache.jclouds:jclouds-project:pom:2.6.0-SNAPSHOT in apache-snapshots (https://repository.apache.org/content/repositories/snapshots) and 'parent.relativePath' points at wrong local POM @ line 22, column 11

	at PluginClassLoader for maven-plugin//hudson.maven.MavenModuleSetBuild$PomParser.invoke(MavenModuleSetBuild.java:1391)
	at PluginClassLoader for maven-plugin//hudson.maven.MavenModuleSetBuild$PomParser.invoke(MavenModuleSetBuild.java:1124)
	at hudson.FilePath$FileCallableWrapper.call(FilePath.java:3614)
	at hudson.remoting.UserRequest.perform(UserRequest.java:225)
	at hudson.remoting.UserRequest.perform(UserRequest.java:50)
	at hudson.remoting.Request$2.run(Request.java:391)
	at hudson.remoting.InterceptingExecutorService.lambda$wrap$0(InterceptingExecutorService.java:81)
	at java.base/java.util.concurrent.FutureTask.run(FutureTask.java:264)
	at java.base/java.util.concurrent.ThreadPoolExecutor.runWorker(ThreadPoolExecutor.java:1136)
	at java.base/java.util.concurrent.ThreadPoolExecutor$Worker.run(ThreadPoolExecutor.java:635)
	at java.base/java.lang.Thread.run(Thread.java:840)
	Suppressed: hudson.remoting.Channel$CallSiteStackTrace: Remote call to builds26
		at hudson.remoting.Channel.attachCallSiteStackTrace(Channel.java:1923)
		at hudson.remoting.UserRequest$ExceptionResponse.retrieve(UserRequest.java:384)
		at hudson.remoting.Channel.call(Channel.java:1112)
		at hudson.FilePath.act(FilePath.java:1228)
		at hudson.FilePath.act(FilePath.java:1217)
		at PluginClassLoader for maven-plugin//hudson.maven.MavenModuleSetBuild$MavenModuleSetBuildExecution.parsePoms(MavenModuleSetBuild.java:985)
		at PluginClassLoader for maven-plugin//hudson.maven.MavenModuleSetBuild$MavenModuleSetBuildExecution.doRun(MavenModuleSetBuild.java:689)
		at hudson.model.AbstractBuild$AbstractBuildExecution.run(AbstractBuild.java:527)
		at hudson.model.Run.execute(Run.java:1833)
		at PluginClassLoader for maven-plugin//hudson.maven.MavenModuleSetBuild.run(MavenModuleSetBuild.java:543)
		at hudson.model.ResourceController.execute(ResourceController.java:101)
		at hudson.model.Executor.run(Executor.java:446)
Caused by: hudson.remoting.ProxyException: org.apache.maven.project.ProjectBuildingException: Some problems were encountered while processing the POMs:
[FATAL] Non-resolvable parent POM for org.apache.jclouds.labs:jclouds-labs-aws:2.6.0-SNAPSHOT: Could not find artifact org.apache.jclouds:jclouds-project:pom:2.6.0-SNAPSHOT in apache-snapshots (https://repository.apache.org/content/repositories/snapshots) and 'parent.relativePath' points at wrong local POM @ line 22, column 11

	at PluginClassLoader for maven-plugin//org.apache.maven.project.DefaultProjectBuilder.build(DefaultProjectBuilder.java:397)
	at PluginClassLoader for maven-plugin//hudson.maven.MavenEmbedder.buildProjects(MavenEmbedder.java:370)
	at PluginClassLoader for maven-plugin//hudson.maven.MavenEmbedder.readProjects(MavenEmbedder.java:340)
	at PluginClassLoader for maven-plugin//hudson.maven.MavenModuleSetBuild$PomParser.invoke(MavenModuleSetBuild.java:1330)
	... 10 more