You are viewing a plain text version of this content. The canonical link for it is here.
Posted to dev@lucene.apache.org by Policeman Jenkins Server <je...@thetaphi.de> on 2013/12/13 12:30:04 UTC
[JENKINS] Lucene-Solr-4.x-Windows (64bit/jdk1.7.0_60-ea-b01) -
Build # 3486 - Failure!
Build: http://jenkins.thetaphi.de/job/Lucene-Solr-4.x-Windows/3486/
Java: 64bit/jdk1.7.0_60-ea-b01 -XX:+UseCompressedOops -XX:+UseSerialGC
1 tests failed.
FAILED: junit.framework.TestSuite.org.apache.solr.search.QueryEqualityTest
Error Message:
testParserCoverage was run w/o any other method explicitly testing val parser: concat
Stack Trace:
java.lang.AssertionError: testParserCoverage was run w/o any other method explicitly testing val parser: concat
at __randomizedtesting.SeedInfo.seed([4213C3E2C0ABCE50]:0)
at org.junit.Assert.fail(Assert.java:93)
at org.junit.Assert.assertTrue(Assert.java:43)
at org.apache.solr.search.QueryEqualityTest.afterClassParserCoverageTest(QueryEqualityTest.java:65)
at sun.reflect.NativeMethodAccessorImpl.invoke0(Native Method)
at sun.reflect.NativeMethodAccessorImpl.invoke(NativeMethodAccessorImpl.java:57)
at sun.reflect.DelegatingMethodAccessorImpl.invoke(DelegatingMethodAccessorImpl.java:43)
at java.lang.reflect.Method.invoke(Method.java:606)
at com.carrotsearch.randomizedtesting.RandomizedRunner.invoke(RandomizedRunner.java:1559)
at com.carrotsearch.randomizedtesting.RandomizedRunner.access$600(RandomizedRunner.java:79)
at com.carrotsearch.randomizedtesting.RandomizedRunner$5.evaluate(RandomizedRunner.java:700)
at com.carrotsearch.randomizedtesting.rules.StatementAdapter.evaluate(StatementAdapter.java:36)
at com.carrotsearch.randomizedtesting.rules.SystemPropertiesRestoreRule$1.evaluate(SystemPropertiesRestoreRule.java:53)
at org.apache.lucene.util.AbstractBeforeAfterRule$1.evaluate(AbstractBeforeAfterRule.java:46)
at org.apache.lucene.util.TestRuleStoreClassName$1.evaluate(TestRuleStoreClassName.java:42)
at com.carrotsearch.randomizedtesting.rules.SystemPropertiesInvariantRule$1.evaluate(SystemPropertiesInvariantRule.java:55)
at com.carrotsearch.randomizedtesting.rules.NoShadowingOrOverridesOnMethodsRule$1.evaluate(NoShadowingOrOverridesOnMethodsRule.java:39)
at com.carrotsearch.randomizedtesting.rules.NoShadowingOrOverridesOnMethodsRule$1.evaluate(NoShadowingOrOverridesOnMethodsRule.java:39)
at com.carrotsearch.randomizedtesting.rules.StatementAdapter.evaluate(StatementAdapter.java:36)
at org.apache.lucene.util.TestRuleAssertionsRequired$1.evaluate(TestRuleAssertionsRequired.java:43)
at org.apache.lucene.util.TestRuleMarkFailure$1.evaluate(TestRuleMarkFailure.java:48)
at org.apache.lucene.util.TestRuleIgnoreAfterMaxFailures$1.evaluate(TestRuleIgnoreAfterMaxFailures.java:70)
at org.apache.lucene.util.TestRuleIgnoreTestSuites$1.evaluate(TestRuleIgnoreTestSuites.java:55)
at com.carrotsearch.randomizedtesting.rules.StatementAdapter.evaluate(StatementAdapter.java:36)
at com.carrotsearch.randomizedtesting.ThreadLeakControl$StatementRunner.run(ThreadLeakControl.java:358)
at java.lang.Thread.run(Thread.java:744)
Build Log:
[...truncated 10780 lines...]
[junit4] Suite: org.apache.solr.search.QueryEqualityTest
[junit4] 2> 2673900 T7174 oas.SolrTestCaseJ4.initCore ####initCore
[junit4] 2> Creating dataDir: C:\Users\JenkinsSlave\workspace\Lucene-Solr-4.x-Windows\solr\build\solr-core\test\J0\.\solrtest-QueryEqualityTest-1386933602999
[junit4] 2> 2673904 T7174 oasc.SolrResourceLoader.<init> new SolrResourceLoader for directory: 'C:\Users\JenkinsSlave\workspace\Lucene-Solr-4.x-Windows\solr\build\solr-core\test-files\solr\collection1\'
[junit4] 2> 2673904 T7174 oasc.SolrResourceLoader.replaceClassLoader Adding 'file:/C:/Users/JenkinsSlave/workspace/Lucene-Solr-4.x-Windows/solr/build/solr-core/test-files/solr/collection1/lib/classes/' to classloader
[junit4] 2> 2673904 T7174 oasc.SolrResourceLoader.replaceClassLoader Adding 'file:/C:/Users/JenkinsSlave/workspace/Lucene-Solr-4.x-Windows/solr/build/solr-core/test-files/solr/collection1/lib/README' to classloader
[junit4] 2> 2673995 T7174 oasc.SolrConfig.<init> Using Lucene MatchVersion: LUCENE_47
[junit4] 2> 2674051 T7174 oasc.SolrConfig.<init> Loaded SolrConfig: solrconfig.xml
[junit4] 2> 2674051 T7174 oass.IndexSchema.readSchema Reading Solr Schema from schema15.xml
[junit4] 2> 2674063 T7174 oass.IndexSchema.readSchema [null] Schema name=test
[junit4] 2> 2674494 T7174 oass.IndexSchema.readSchema default search field in schema is text
[junit4] 2> 2674496 T7174 oass.IndexSchema.readSchema unique key field: id
[junit4] 2> 2674498 T7174 oass.FileExchangeRateProvider.reload Reloading exchange rates from file currency.xml
[junit4] 2> 2674503 T7174 oass.FileExchangeRateProvider.reload Reloading exchange rates from file currency.xml
[junit4] 2> 2674520 T7174 oasc.SolrResourceLoader.locateSolrHome JNDI not configured for solr (NoInitialContextEx)
[junit4] 2> 2674520 T7174 oasc.SolrResourceLoader.locateSolrHome using system property solr.solr.home: C:\Users\JenkinsSlave\workspace\Lucene-Solr-4.x-Windows\solr\build\solr-core\test-files\solr
[junit4] 2> 2674520 T7174 oasc.SolrResourceLoader.<init> new SolrResourceLoader for directory: 'C:\Users\JenkinsSlave\workspace\Lucene-Solr-4.x-Windows\solr\build\solr-core\test-files\solr\'
[junit4] 2> 2674543 T7174 oasc.SolrResourceLoader.locateSolrHome JNDI not configured for solr (NoInitialContextEx)
[junit4] 2> 2674543 T7174 oasc.SolrResourceLoader.locateSolrHome using system property solr.solr.home: C:\Users\JenkinsSlave\workspace\Lucene-Solr-4.x-Windows\solr\build\solr-core\test-files\solr
[junit4] 2> 2674543 T7174 oasc.SolrResourceLoader.<init> new SolrResourceLoader for deduced Solr Home: 'C:\Users\JenkinsSlave\workspace\Lucene-Solr-4.x-Windows\solr\build\solr-core\test-files\solr\'
[junit4] 2> 2674607 T7174 oasc.CoreContainer.<init> New CoreContainer 220085110
[junit4] 2> 2674607 T7174 oasc.CoreContainer.load Loading cores into CoreContainer [instanceDir=C:\Users\JenkinsSlave\workspace\Lucene-Solr-4.x-Windows\solr\build\solr-core\test-files\solr\]
[junit4] 2> 2674609 T7174 oashc.HttpShardHandlerFactory.getParameter Setting socketTimeout to: 0
[junit4] 2> 2674609 T7174 oashc.HttpShardHandlerFactory.getParameter Setting urlScheme to: http://
[junit4] 2> 2674609 T7174 oashc.HttpShardHandlerFactory.getParameter Setting connTimeout to: 0
[junit4] 2> 2674609 T7174 oashc.HttpShardHandlerFactory.getParameter Setting maxConnectionsPerHost to: 20
[junit4] 2> 2674609 T7174 oashc.HttpShardHandlerFactory.getParameter Setting corePoolSize to: 0
[junit4] 2> 2674609 T7174 oashc.HttpShardHandlerFactory.getParameter Setting maximumPoolSize to: 2147483647
[junit4] 2> 2674609 T7174 oashc.HttpShardHandlerFactory.getParameter Setting maxThreadIdleTime to: 5
[junit4] 2> 2674609 T7174 oashc.HttpShardHandlerFactory.getParameter Setting sizeOfQueue to: -1
[junit4] 2> 2674611 T7174 oashc.HttpShardHandlerFactory.getParameter Setting fairnessPolicy to: false
[junit4] 2> 2674619 T7174 oasl.LogWatcher.createWatcher SLF4J impl is org.slf4j.impl.Log4jLoggerFactory
[junit4] 2> 2674619 T7174 oasl.LogWatcher.newRegisteredLogWatcher Registering Log Listener [Log4j (org.slf4j.impl.Log4jLoggerFactory)]
[junit4] 2> 2674619 T7174 oasc.CoreContainer.load Host Name:
[junit4] 2> 2674626 T7175 oasc.CoreContainer.create Creating SolrCore 'collection1' using instanceDir: C:\Users\JenkinsSlave\workspace\Lucene-Solr-4.x-Windows\solr\build\solr-core\test-files\solr\collection1
[junit4] 2> 2674626 T7175 oasc.SolrResourceLoader.<init> new SolrResourceLoader for directory: 'C:\Users\JenkinsSlave\workspace\Lucene-Solr-4.x-Windows\solr\build\solr-core\test-files\solr\collection1\'
[junit4] 2> 2674627 T7175 oasc.SolrResourceLoader.replaceClassLoader Adding 'file:/C:/Users/JenkinsSlave/workspace/Lucene-Solr-4.x-Windows/solr/build/solr-core/test-files/solr/collection1/lib/classes/' to classloader
[junit4] 2> 2674627 T7175 oasc.SolrResourceLoader.replaceClassLoader Adding 'file:/C:/Users/JenkinsSlave/workspace/Lucene-Solr-4.x-Windows/solr/build/solr-core/test-files/solr/collection1/lib/README' to classloader
[junit4] 2> 2674702 T7175 oasc.SolrConfig.<init> Using Lucene MatchVersion: LUCENE_47
[junit4] 2> 2674762 T7175 oasc.SolrConfig.<init> Loaded SolrConfig: solrconfig.xml
[junit4] 2> 2674763 T7175 oass.IndexSchema.readSchema Reading Solr Schema from schema15.xml
[junit4] 2> 2674775 T7175 oass.IndexSchema.readSchema [collection1] Schema name=test
[junit4] 2> 2675196 T7175 oass.IndexSchema.readSchema default search field in schema is text
[junit4] 2> 2675199 T7175 oass.IndexSchema.readSchema unique key field: id
[junit4] 2> 2675200 T7175 oass.FileExchangeRateProvider.reload Reloading exchange rates from file currency.xml
[junit4] 2> 2675205 T7175 oass.FileExchangeRateProvider.reload Reloading exchange rates from file currency.xml
[junit4] 2> 2675221 T7175 oasc.SolrCore.initDirectoryFactory org.apache.solr.core.MockDirectoryFactory
[junit4] 2> 2675222 T7175 oasc.SolrCore.<init> [collection1] Opening new SolrCore at C:\Users\JenkinsSlave\workspace\Lucene-Solr-4.x-Windows\solr\build\solr-core\test-files\solr\collection1\, dataDir=C:\Users\JenkinsSlave\workspace\Lucene-Solr-4.x-Windows\solr\build\solr-core\test\J0\.\solrtest-QueryEqualityTest-1386933602999\
[junit4] 2> 2675222 T7175 oasc.JmxMonitoredMap.<init> JMX monitoring is enabled. Adding Solr mbeans to JMX Server: com.sun.jmx.mbeanserver.JmxMBeanServer@31c6bce9
[junit4] 2> 2675223 T7175 oasc.CachingDirectoryFactory.get return new directory for C:\Users\JenkinsSlave\workspace\Lucene-Solr-4.x-Windows\solr\build\solr-core\test\J0\.\solrtest-QueryEqualityTest-1386933602999\
[junit4] 2> 2675223 T7175 oasc.SolrCore.getNewIndexDir New index directory detected: old=null new=C:\Users\JenkinsSlave\workspace\Lucene-Solr-4.x-Windows\solr\build\solr-core\test\J0\.\solrtest-QueryEqualityTest-1386933602999\index/
[junit4] 2> 2675223 T7175 oasc.SolrCore.initIndex WARN [collection1] Solr index directory 'C:\Users\JenkinsSlave\workspace\Lucene-Solr-4.x-Windows\solr\build\solr-core\test\J0\.\solrtest-QueryEqualityTest-1386933602999\index' doesn't exist. Creating new index...
[junit4] 2> 2675226 T7175 oasc.CachingDirectoryFactory.get return new directory for C:\Users\JenkinsSlave\workspace\Lucene-Solr-4.x-Windows\solr\build\solr-core\test\J0\.\solrtest-QueryEqualityTest-1386933602999\index
[junit4] 2> 2675226 T7175 oasu.RandomMergePolicy.<init> RandomMergePolicy wrapping class org.apache.lucene.index.TieredMergePolicy: [TieredMergePolicy: maxMergeAtOnce=21, maxMergeAtOnceExplicit=48, maxMergedSegmentMB=14.708984375, floorSegmentMB=0.75390625, forceMergeDeletesPctAllowed=8.714525711425745, segmentsPerTier=23.0, maxCFSSegmentSizeMB=8.796093022207999E12, noCFSRatio=1.0
[junit4] 2> 2675230 T7175 oasc.SolrDeletionPolicy.onCommit SolrDeletionPolicy.onCommit: commits: num=1
[junit4] 2> commit{dir=RateLimitedDirectoryWrapper(MockDirectoryWrapper(org.apache.lucene.store.SimpleFSDirectory@C:\Users\JenkinsSlave\workspace\Lucene-Solr-4.x-Windows\solr\build\solr-core\test\J0\index3814638158tmp lockFactory=org.apache.lucene.store.SingleInstanceLockFactory@27e3fdf6)),segFN=segments_1,generation=1}
[junit4] 2> 2675230 T7175 oasc.SolrDeletionPolicy.updateCommits newest commit generation = 1
[junit4] 2> 2675231 T7175 oasc.SolrCore.initWriters created xml: solr.XMLResponseWriter
[junit4] 2> 2675234 T7175 oasup.UpdateRequestProcessorChain.init creating updateRequestProcessorChain "dedupe"
[junit4] 2> 2675234 T7175 oasup.UpdateRequestProcessorChain.init inserting DistributedUpdateProcessorFactory into updateRequestProcessorChain "dedupe"
[junit4] 2> 2675234 T7175 oasup.UpdateRequestProcessorChain.init creating updateRequestProcessorChain "dedupe-allfields"
[junit4] 2> 2675235 T7175 oasup.UpdateRequestProcessorChain.init inserting DistributedUpdateProcessorFactory into updateRequestProcessorChain "dedupe-allfields"
[junit4] 2> 2675236 T7175 oasup.UpdateRequestProcessorChain.init creating updateRequestProcessorChain "stored_sig"
[junit4] 2> 2675236 T7175 oasup.UpdateRequestProcessorChain.init inserting DistributedUpdateProcessorFactory into updateRequestProcessorChain "stored_sig"
[junit4] 2> 2675236 T7175 oasup.UpdateRequestProcessorChain.init creating updateRequestProcessorChain "uniq-fields"
[junit4] 2> 2675236 T7175 oasup.UniqFieldsUpdateProcessorFactory.init WARN Use of the 'fields' init param in UniqFieldsUpdateProcessorFactory is deprecated, please use 'fieldName' (or another FieldMutatingUpdateProcessorFactory selector option) instead
[junit4] 2> 2675236 T7175 oasup.UniqFieldsUpdateProcessorFactory.init Replacing 'fields' init param with (individual) 'fieldName' params
[junit4] 2> 2675237 T7175 oasup.UpdateRequestProcessorChain.init inserting DistributedUpdateProcessorFactory into updateRequestProcessorChain "uniq-fields"
[junit4] 2> 2675237 T7175 oasup.UpdateRequestProcessorChain.init creating updateRequestProcessorChain "distrib-dup-test-chain-explicit"
[junit4] 2> 2675238 T7175 oasup.UpdateRequestProcessorChain.init creating updateRequestProcessorChain "distrib-dup-test-chain-implicit"
[junit4] 2> 2675238 T7175 oasup.UpdateRequestProcessorChain.init inserting DistributedUpdateProcessorFactory into updateRequestProcessorChain "distrib-dup-test-chain-implicit"
[junit4] 2> 2675238 T7175 oasc.SolrCore.loadUpdateProcessorChains no updateRequestProcessorChain defined as default, creating implicit default
[junit4] 2> 2675238 T7175 oasc.RequestHandlers.initHandlersFromConfig adding lazy requestHandler: solr.ReplicationHandler
[junit4] 2> 2675238 T7175 oasc.RequestHandlers.initHandlersFromConfig created /replication: solr.ReplicationHandler
[junit4] 2> 2675241 T7175 oasc.RequestHandlers.initHandlersFromConfig created standard: solr.StandardRequestHandler
[junit4] 2> 2675241 T7175 oasc.RequestHandlers.initHandlersFromConfig created /get: solr.RealTimeGetHandler
[junit4] 2> 2675242 T7175 oasc.RequestHandlers.initHandlersFromConfig created dismax: solr.SearchHandler
[junit4] 2> 2675242 T7175 oasc.RequestHandlers.initHandlersFromConfig created mock: org.apache.solr.core.MockQuerySenderListenerReqHandler
[junit4] 2> 2675243 T7175 oasc.RequestHandlers.initHandlersFromConfig created /admin/: org.apache.solr.handler.admin.AdminHandlers
[junit4] 2> 2675243 T7175 oasc.RequestHandlers.initHandlersFromConfig created /admin/file: solr.admin.ShowFileRequestHandler
[junit4] 2> 2675244 T7175 oasc.RequestHandlers.initHandlersFromConfig created defaults: solr.StandardRequestHandler
[junit4] 2> 2675244 T7175 oasc.RequestHandlers.initHandlersFromConfig adding lazy requestHandler: solr.StandardRequestHandler
[junit4] 2> 2675244 T7175 oasc.RequestHandlers.initHandlersFromConfig created lazy: solr.StandardRequestHandler
[junit4] 2> 2675245 T7175 oasc.RequestHandlers.initHandlersFromConfig created /update: solr.UpdateRequestHandler
[junit4] 2> 2675245 T7175 oasc.RequestHandlers.initHandlersFromConfig created /terms: org.apache.solr.handler.component.SearchHandler
[junit4] 2> 2675246 T7175 oasc.RequestHandlers.initHandlersFromConfig created spellCheckCompRH: org.apache.solr.handler.component.SearchHandler
[junit4] 2> 2675246 T7175 oasc.RequestHandlers.initHandlersFromConfig created spellCheckCompRH_Direct: org.apache.solr.handler.component.SearchHandler
[junit4] 2> 2675246 T7175 oasc.RequestHandlers.initHandlersFromConfig created spellCheckWithWordbreak: org.apache.solr.handler.component.SearchHandler
[junit4] 2> 2675247 T7175 oasc.RequestHandlers.initHandlersFromConfig created spellCheckWithWordbreak_Direct: org.apache.solr.handler.component.SearchHandler
[junit4] 2> 2675247 T7175 oasc.RequestHandlers.initHandlersFromConfig created spellCheckCompRH1: org.apache.solr.handler.component.SearchHandler
[junit4] 2> 2675248 T7175 oasc.RequestHandlers.initHandlersFromConfig created mltrh: org.apache.solr.handler.component.SearchHandler
[junit4] 2> 2675248 T7175 oasc.RequestHandlers.initHandlersFromConfig created tvrh: org.apache.solr.handler.component.SearchHandler
[junit4] 2> 2675249 T7175 oasc.RequestHandlers.initHandlersFromConfig created /mlt: solr.MoreLikeThisHandler
[junit4] 2> 2675249 T7175 oasc.RequestHandlers.initHandlersFromConfig created /debug/dump: solr.DumpRequestHandler
[junit4] 2> 2675259 T7175 oashl.XMLLoader.init xsltCacheLifetimeSeconds=60
[junit4] 2> 2675260 T7175 oasc.SolrCore.initDeprecatedSupport WARN solrconfig.xml uses deprecated <admin/gettableFiles>, Please update your config to use the ShowFileRequestHandler.
[junit4] 2> 2675263 T7175 oasu.CommitTracker.<init> Hard AutoCommit: disabled
[junit4] 2> 2675264 T7175 oasu.CommitTracker.<init> Soft AutoCommit: disabled
[junit4] 2> 2675264 T7175 oasu.RandomMergePolicy.<init> RandomMergePolicy wrapping class org.apache.lucene.index.TieredMergePolicy: [TieredMergePolicy: maxMergeAtOnce=11, maxMergeAtOnceExplicit=31, maxMergedSegmentMB=88.943359375, floorSegmentMB=2.1435546875, forceMergeDeletesPctAllowed=27.55949248967443, segmentsPerTier=35.0, maxCFSSegmentSizeMB=8.796093022207999E12, noCFSRatio=1.0
[junit4] 2> 2675266 T7175 oasc.SolrDeletionPolicy.onInit SolrDeletionPolicy.onInit: commits: num=1
[junit4] 2> commit{dir=RateLimitedDirectoryWrapper(MockDirectoryWrapper(org.apache.lucene.store.SimpleFSDirectory@C:\Users\JenkinsSlave\workspace\Lucene-Solr-4.x-Windows\solr\build\solr-core\test\J0\index3814638158tmp lockFactory=org.apache.lucene.store.SingleInstanceLockFactory@27e3fdf6)),segFN=segments_1,generation=1}
[junit4] 2> 2675266 T7175 oasc.SolrDeletionPolicy.updateCommits newest commit generation = 1
[junit4] 2> 2675267 T7175 oass.SolrIndexSearcher.<init> Opening Searcher@1e89022a main
[junit4] 2> 2675267 T7175 oashc.SpellCheckComponent.inform Initializing spell checkers
[junit4] 2> 2675278 T7175 oass.DirectSolrSpellChecker.init init: {name=direct,classname=DirectSolrSpellChecker,field=lowerfilt,minQueryLength=3}
[junit4] 2> 2675337 T7176 oasc.SolrCore.registerSearcher [collection1] Registered new searcher Searcher@1e89022a main{StandardDirectoryReader(segments_1:1:nrt)}
[junit4] 2> 2675342 T7175 oasc.CoreContainer.registerCore registering core: collection1
[junit4] 2> 2675352 T7174 oas.SolrTestCaseJ4.initCore ####initCore end
[junit4] 2> 2675358 T7174 oas.SolrTestCaseJ4.setUp ###Starting testFuncField
[junit4] 2> 2675359 T7174 oas.SolrTestCaseJ4.tearDown ###Ending testFuncField
[junit4] 2> 2675363 T7174 oas.SolrTestCaseJ4.setUp ###Starting testQuerySwitch
[junit4] 2> 2675365 T7174 oas.SolrTestCaseJ4.tearDown ###Ending testQuerySwitch
[junit4] 2> 2675370 T7174 oas.SolrTestCaseJ4.setUp ###Starting testFuncQuery
[junit4] 2> 2675371 T7174 oas.SolrTestCaseJ4.tearDown ###Ending testFuncQuery
[junit4] 2> 2675376 T7174 oas.SolrTestCaseJ4.setUp ###Starting testQueryLucene
[junit4] 2> 2675377 T7174 oas.SolrTestCaseJ4.tearDown ###Ending testQueryLucene
[junit4] 2> 2675382 T7174 oas.SolrTestCaseJ4.setUp ###Starting testFuncMod
[junit4] 2> 2675383 T7174 oas.SolrTestCaseJ4.tearDown ###Ending testFuncMod
[junit4] 2> 2675403 T7174 oas.SolrTestCaseJ4.setUp ###Starting testFuncTerms
[junit4] 2> 2675407 T7174 oas.SolrTestCaseJ4.tearDown ###Ending testFuncTerms
[junit4] 2> 2675411 T7174 oas.SolrTestCaseJ4.setUp ###Starting testFuncGhhsin
[junit4] 2> 2675411 T7174 oas.SolrTestCaseJ4.tearDown ###Ending testFuncGhhsin
[junit4] 2> 2675417 T7174 oas.SolrTestCaseJ4.setUp ###Starting testFuncNumdocs
[junit4] 2> 2675418 T7174 oas.SolrTestCaseJ4.tearDown ###Ending testFuncNumdocs
[junit4] 2> 2675422 T7174 oas.SolrTestCaseJ4.setUp ###Starting testFuncDoubleValueMathFuncs
[junit4] 2> 2675422 T7174 oas.SolrTestCaseJ4.tearDown ###Ending testFuncDoubleValueMathFuncs
[junit4] 2> 2675426 T7174 oas.SolrTestCaseJ4.setUp ###Starting testFuncOrd
[junit4] 2> 2675428 T7174 oas.SolrTestCaseJ4.tearDown ###Ending testFuncOrd
[junit4] 2> 2675431 T7174 oas.SolrTestCaseJ4.setUp ###Starting testFuncBoost
[junit4] 2> 2675433 T7174 oas.SolrTestCaseJ4.tearDown ###Ending testFuncBoost
[junit4] 2> 2675437 T7174 oas.SolrTestCaseJ4.setUp ###Starting testFuncLiteral
[junit4] 2> 2675437 T7174 oas.SolrTestCaseJ4.tearDown ###Ending testFuncLiteral
[junit4] 2> 2675443 T7174 oas.SolrTestCaseJ4.setUp ###Starting testFuncBools
[junit4] 2> 2675444 T7174 oas.SolrTestCaseJ4.tearDown ###Ending testFuncBools
[junit4] 2> 2675448 T7174 oas.SolrTestCaseJ4.setUp ###Starting testFuncDist
[junit4] 2> 2675448 T7174 oas.SolrTestCaseJ4.tearDown ###Ending testFuncDist
[junit4] 2> 2675453 T7174 oas.SolrTestCaseJ4.setUp ###Starting testFuncLinear
[junit4] 2> 2675459 T7174 oas.SolrTestCaseJ4.tearDown ###Ending testFuncLinear
[junit4] 2> 2675464 T7174 oas.SolrTestCaseJ4.setUp ###Starting testQueryMaxScore
[junit4] 2> 2675465 T7174 oas.SolrTestCaseJ4.tearDown ###Ending testQueryMaxScore
[junit4] 2> 2675471 T7174 oas.SolrTestCaseJ4.setUp ###Starting testFuncSttf
[junit4] 2> 2675472 T7174 oas.SolrTestCaseJ4.tearDown ###Ending testFuncSttf
[junit4] 2> 2675476 T7174 oas.SolrTestCaseJ4.setUp ###Starting testFuncIf
[junit4] 2> 2675477 T7174 oas.SolrTestCaseJ4.tearDown ###Ending testFuncIf
[junit4] 2> 2675481 T7174 oas.SolrTestCaseJ4.setUp ###Starting testParserCoverage
[junit4] 2> 2675481 T7174 oas.SolrTestCaseJ4.tearDown ###Ending testParserCoverage
[junit4] 2> 2675487 T7174 oas.SolrTestCaseJ4.setUp ###Starting testFuncMap
[junit4] 2> 2675488 T7174 oas.SolrTestCaseJ4.tearDown ###Ending testFuncMap
[junit4] 2> 2675492 T7174 oas.SolrTestCaseJ4.setUp ###Starting testQueryFunc
[junit4] 2> 2675493 T7174 oas.SolrTestCaseJ4.tearDown ###Ending testQueryFunc
[junit4] 2> 2675497 T7174 oas.SolrTestCaseJ4.setUp ###Starting testQueryNested
[junit4] 2> 2675497 T7174 oas.SolrTestCaseJ4.tearDown ###Ending testQueryNested
[junit4] 2> 2675502 T7174 oas.SolrTestCaseJ4.setUp ###Starting testFuncHsin
[junit4] 2> 2675508 T7174 oas.SolrTestCaseJ4.tearDown ###Ending testFuncHsin
[junit4] 2> 2675513 T7174 oas.SolrTestCaseJ4.setUp ###Starting testFuncTop
[junit4] 2> 2675513 T7174 oas.SolrTestCaseJ4.tearDown ###Ending testFuncTop
[junit4] 2> 2675519 T7174 oas.SolrTestCaseJ4.setUp ###Starting testFuncMaxdoc
[junit4] 2> 2675519 T7174 oas.SolrTestCaseJ4.tearDown ###Ending testFuncMaxdoc
[junit4] 2> 2675524 T7174 oas.SolrTestCaseJ4.setUp ###Starting testFuncMin
[junit4] 2> 2675524 T7174 oas.SolrTestCaseJ4.tearDown ###Ending testFuncMin
[junit4] 2> 2675529 T7174 oas.SolrTestCaseJ4.setUp ###Starting testFuncRecip
[junit4] 2> 2675530 T7174 oas.SolrTestCaseJ4.tearDown ###Ending testFuncRecip
[junit4] 2> 2675534 T7174 oas.SolrTestCaseJ4.setUp ###Starting testQueryJoin
[junit4] 2> 2675534 T7174 oas.SolrTestCaseJ4.tearDown ###Ending testQueryJoin
[junit4] 2> 2675539 T7174 oas.SolrTestCaseJ4.setUp ###Starting testQueryBbox
[junit4] 2> 2675541 T7174 oas.SolrTestCaseJ4.tearDown ###Ending testQueryBbox
[junit4] 2> 2675547 T7174 oas.SolrTestCaseJ4.setUp ###Starting testTestFuncs
[junit4] 2> 2675551 T7174 oas.SolrTestCaseJ4.tearDown ###Ending testTestFuncs
[junit4] 2> 2675556 T7174 oas.SolrTestCaseJ4.setUp ###Starting testQueryCollapse
[junit4] 2> 2675556 T7174 oas.SolrTestCaseJ4.tearDown ###Ending testQueryCollapse
[junit4] 2> 2675562 T7174 oas.SolrTestCaseJ4.setUp ###Starting testFuncDiv
[junit4] 2> 2675563 T7174 oas.SolrTestCaseJ4.tearDown ###Ending testFuncDiv
[junit4] 2> 2675568 T7174 oas.SolrTestCaseJ4.setUp ###Starting testQuerySurround
[junit4] 2> 2675575 T7174 oas.SolrTestCaseJ4.tearDown ###Ending testQuerySurround
[junit4] 2> 2675580 T7174 oas.SolrTestCaseJ4.setUp ###Starting testQueryTerm
[junit4] 2> 2675580 T7174 oas.SolrTestCaseJ4.tearDown ###Ending testQueryTerm
[junit4] 2> 2675587 T7174 oas.SolrTestCaseJ4.setUp ###Starting testFuncExists
[junit4] 2> 2675588 T7174 oas.SolrTestCaseJ4.tearDown ###Ending testFuncExists
[junit4] 2> 2675593 T7174 oas.SolrTestCaseJ4.setUp ###Starting testFuncDoubleValueBools
[junit4] 2> 2675594 T7174 oas.SolrTestCaseJ4.tearDown ###Ending testFuncDoubleValueBools
[junit4] 2> 2675599 T7174 oas.SolrTestCaseJ4.setUp ###Starting testQueryFrange
[junit4] 2> 2675599 T7174 oas.SolrTestCaseJ4.tearDown ###Ending testQueryFrange
[junit4] 2> 2675604 T7174 oas.SolrTestCaseJ4.setUp ###Starting testFuncSum
[junit4] 2> 2675605 T7174 oas.SolrTestCaseJ4.tearDown ###Ending testFuncSum
[junit4] 2> 2675610 T7174 oas.SolrTestCaseJ4.setUp ###Starting testFuncProduct
[junit4] 2> 2675611 T7174 oas.SolrTestCaseJ4.tearDown ###Ending testFuncProduct
[junit4] 2> 2675616 T7174 oas.SolrTestCaseJ4.setUp ###Starting testFuncSqedist
[junit4] 2> 2675616 T7174 oas.SolrTestCaseJ4.tearDown ###Ending testFuncSqedist
[junit4] 2> 2675621 T7174 oas.SolrTestCaseJ4.setUp ###Starting testFuncJoindf
[junit4] 2> 2675625 T7174 oas.SolrTestCaseJ4.tearDown ###Ending testFuncJoindf
[junit4] 2> 2675632 T7174 oas.SolrTestCaseJ4.setUp ###Starting testFuncMathConsts
[junit4] 2> 2675632 T7174 oas.SolrTestCaseJ4.tearDown ###Ending testFuncMathConsts
[junit4] 2> 2675636 T7174 oas.SolrTestCaseJ4.setUp ###Starting testQuerySimple
[junit4] 2> 2675641 T7174 oas.SolrTestCaseJ4.tearDown ###Ending testQuerySimple
[junit4] 2> 2675646 T7174 oas.SolrTestCaseJ4.setUp ###Starting testFuncNot
[junit4] 2> 2675647 T7174 oas.SolrTestCaseJ4.tearDown ###Ending testFuncNot
[junit4] 2> 2675652 T7174 oas.SolrTestCaseJ4.setUp ###Starting testFuncMs
[junit4] 2> 2675653 T7174 oas.SolrTestCaseJ4.tearDown ###Ending testFuncMs
[junit4] 2> 2675657 T7174 oas.SolrTestCaseJ4.setUp ###Starting testQueryGeofilt
[junit4] 2> 2675660 T7174 oas.SolrTestCaseJ4.tearDown ###Ending testQueryGeofilt
[junit4] 2> 2675665 T7174 oas.SolrTestCaseJ4.setUp ###Starting testFuncNorm
[junit4] 2> 2675665 T7174 oas.SolrTestCaseJ4.tearDown ###Ending testFuncNorm
[junit4] 2> 2675670 T7174 oas.SolrTestCaseJ4.setUp ###Starting testQueryLucenePlusSort
[junit4] 2> 2675671 T7174 oas.SolrTestCaseJ4.tearDown ###Ending testQueryLucenePlusSort
[junit4] 2> 2675676 T7174 oas.SolrTestCaseJ4.setUp ###Starting testField
[junit4] 2> 2675677 T7174 oas.SolrTestCaseJ4.tearDown ###Ending testField
[junit4] 2> 2675681 T7174 oas.SolrTestCaseJ4.setUp ###Starting testQueryDismax
[junit4] 2> 2675687 T7174 oas.SolrTestCaseJ4.tearDown ###Ending testQueryDismax
[junit4] 2> 2675692 T7174 oas.SolrTestCaseJ4.setUp ###Starting testDateMathParsingEquality
[junit4] 2> 2675693 T7174 oas.SolrTestCaseJ4.tearDown ###Ending testDateMathParsingEquality
[junit4] 2> 2675698 T7174 oas.SolrTestCaseJ4.setUp ###Starting testFuncMax
[junit4] 2> 2675698 T7174 oas.SolrTestCaseJ4.tearDown ###Ending testFuncMax
[junit4] 2> 2675704 T7174 oas.SolrTestCaseJ4.setUp ###Starting testFuncGeohash
[junit4] 2> 2675709 T7174 oas.SolrTestCaseJ4.tearDown ###Ending testFuncGeohash
[junit4] 2> 2675713 T7174 oas.SolrTestCaseJ4.setUp ###Starting testFuncStrdist
[junit4] 2> 2675714 T7174 oas.SolrTestCaseJ4.tearDown ###Ending testFuncStrdist
[junit4] 2> 2675719 T7174 oas.SolrTestCaseJ4.setUp ###Starting testBlockJoin
[junit4] 2> 2675720 T7174 oas.SolrTestCaseJ4.tearDown ###Ending testBlockJoin
[junit4] 2> 2675724 T7174 oas.SolrTestCaseJ4.setUp ###Starting testQueryPrefix
[junit4] 2> 2675724 T7174 oas.SolrTestCaseJ4.tearDown ###Ending testQueryPrefix
[junit4] 2> 2675729 T7174 oas.SolrTestCaseJ4.setUp ###Starting testFuncScale
[junit4] 2> 2675729 T7174 oas.SolrTestCaseJ4.tearDown ###Ending testFuncScale
[junit4] 2> 2675734 T7174 oas.SolrTestCaseJ4.setUp ###Starting testFuncVector
[junit4] 2> 2675736 T7174 oas.SolrTestCaseJ4.tearDown ###Ending testFuncVector
[junit4] 2> 2675740 T7174 oas.SolrTestCaseJ4.setUp ###Starting testFuncSub
[junit4] 2> 2675741 T7174 oas.SolrTestCaseJ4.tearDown ###Ending testFuncSub
[junit4] 2> 2675745 T7174 oas.SolrTestCaseJ4.setUp ###Starting testFuncDef
[junit4] 2> 2675747 T7174 oas.SolrTestCaseJ4.tearDown ###Ending testFuncDef
[junit4] 2> 2675751 T7174 oas.SolrTestCaseJ4.setUp ###Starting testQueryRaw
[junit4] 2> 2675751 T7174 oas.SolrTestCaseJ4.tearDown ###Ending testQueryRaw
[junit4] 2> 2675756 T7174 oas.SolrTestCaseJ4.setUp ###Starting testFuncGeodist
[junit4] 2> 2675757 T7174 oas.SolrTestCaseJ4.tearDown ###Ending testFuncGeodist
[junit4] 2> 2675762 T7174 oas.SolrTestCaseJ4.setUp ###Starting testFuncTestfunc
[junit4] 2> 2675763 T7174 oas.SolrTestCaseJ4.tearDown ###Ending testFuncTestfunc
[junit4] 2> 2675768 T7174 oas.SolrTestCaseJ4.setUp ###Starting testFuncCurrency
[junit4] 2> 2675768 T7174 oas.SolrTestCaseJ4.tearDown ###Ending testFuncCurrency
[junit4] 2> 2675773 T7174 oas.SolrTestCaseJ4.setUp ###Starting testQueryBoost
[junit4] 2> 2675773 T7174 oas.SolrTestCaseJ4.tearDown ###Ending testQueryBoost
[junit4] 2> 2675782 T7174 oas.SolrTestCaseJ4.setUp ###Starting testFuncSingleValueMathFuncs
[junit4] 2> 2675786 T7174 oas.SolrTestCaseJ4.tearDown ###Ending testFuncSingleValueMathFuncs
[junit4] 2> 2675796 T7174 oas.SolrTestCaseJ4.setUp ###Starting testFuncRord
[junit4] 2> 2675797 T7174 oas.SolrTestCaseJ4.tearDown ###Ending testFuncRord
[junit4] 2> 2675798 T7174 oas.SolrTestCaseJ4.deleteCore ###deleteCore
[junit4] 2> 2675798 T7174 oasc.CoreContainer.shutdown Shutting down CoreContainer instance=220085110
[junit4] 2> 2675799 T7174 oasc.SolrCore.close [collection1] CLOSING SolrCore org.apache.solr.core.SolrCore@7d7e03fb
[junit4] 2> 2675812 T7174 oasu.DirectUpdateHandler2.close closing DirectUpdateHandler2{commits=0,autocommits=0,soft autocommits=0,optimizes=0,rollbacks=0,expungeDeletes=0,docsPending=0,adds=0,deletesById=0,deletesByQuery=0,errors=0,cumulative_adds=0,cumulative_deletesById=0,cumulative_deletesByQuery=0,cumulative_errors=0,transaction_logs_total_size=0,transaction_logs_total_number=0}
[junit4] 2> 2675812 T7174 oasu.SolrCoreState.decrefSolrCoreState Closing SolrCoreState
[junit4] 2> 2675812 T7174 oasu.DefaultSolrCoreState.closeIndexWriter SolrCoreState ref count has reached 0 - closing IndexWriter
[junit4] 2> 2675812 T7174 oasu.DefaultSolrCoreState.closeIndexWriter closing IndexWriter with IndexWriterCloser
[junit4] 2> 2675815 T7174 oasc.SolrCore.closeSearcher [collection1] Closing main searcher on request.
[junit4] 2> 2675815 T7174 oasc.CachingDirectoryFactory.close Closing MockDirectoryFactory - 2 directories currently being tracked
[junit4] 2> 2675815 T7174 oasc.CachingDirectoryFactory.closeCacheValue looking to close C:\Users\JenkinsSlave\workspace\Lucene-Solr-4.x-Windows\solr\build\solr-core\test\J0\.\solrtest-QueryEqualityTest-1386933602999\index [CachedDir<<refCount=0;path=C:\Users\JenkinsSlave\workspace\Lucene-Solr-4.x-Windows\solr\build\solr-core\test\J0\.\solrtest-QueryEqualityTest-1386933602999\index;done=false>>]
[junit4] 2> 2675815 T7174 oasc.CachingDirectoryFactory.close Closing directory: C:\Users\JenkinsSlave\workspace\Lucene-Solr-4.x-Windows\solr\build\solr-core\test\J0\.\solrtest-QueryEqualityTest-1386933602999\index
[junit4] 2> 2675815 T7174 oasc.CachingDirectoryFactory.closeCacheValue looking to close C:\Users\JenkinsSlave\workspace\Lucene-Solr-4.x-Windows\solr\build\solr-core\test\J0\.\solrtest-QueryEqualityTest-1386933602999\ [CachedDir<<refCount=0;path=C:\Users\JenkinsSlave\workspace\Lucene-Solr-4.x-Windows\solr\build\solr-core\test\J0\.\solrtest-QueryEqualityTest-1386933602999\;done=false>>]
[junit4] 2> 2675815 T7174 oasc.CachingDirectoryFactory.close Closing directory: C:\Users\JenkinsSlave\workspace\Lucene-Solr-4.x-Windows\solr\build\solr-core\test\J0\.\solrtest-QueryEqualityTest-1386933602999\
[junit4] 2> NOTE: test params are: codec=Lucene46: {}, docValues:{}, sim=DefaultSimilarity, locale=ar, timezone=America/Iqaluit
[junit4] 2> NOTE: Windows 7 6.1 amd64/Oracle Corporation 1.7.0_60-ea (64-bit)/cpus=2,threads=1,free=80916736,total=246378496
[junit4] 2> NOTE: All tests run in this JVM: [TestRangeQuery, NoCacheHeaderTest, QueryResultKeyTest, TestDocSet, ChangedSchemaMergeTest, TestReloadAndDeleteDocs, PolyFieldTest, BinaryUpdateRequestHandlerTest, TestQueryTypes, TestCollationFieldDocValues, TestWordDelimiterFilterFactory, AddSchemaFieldsUpdateProcessorFactoryTest, TestDFRSimilarityFactory, TestQueryUtils, ResourceLoaderTest, TestBM25SimilarityFactory, TestOmitPositions, TermVectorComponentTest, JSONWriterTest, AnalysisAfterCoreReloadTest, TestFieldCollectionResource, TestSolrXMLSerializer, FastVectorHighlighterTest, ClusterStateUpdateTest, TestCloudManagedSchema, HdfsBasicDistributedZk2Test, RegexBoostProcessorTest, CoreMergeIndexesAdminHandlerTest, ShardRoutingTest, DirectSolrSpellCheckerTest, TestCollationKeyRangeQueries, PreAnalyzedUpdateProcessorTest, SliceStateUpdateTest, InfoHandlerTest, NotRequiredUniqueKeyTest, URLClassifyProcessorTest, IndexSchemaRuntimeFieldTest, SolrInfoMBeanTest, ExternalFileFieldSortTest, TestLRUCache, TestRandomDVFaceting, TestRTGBase, MigrateRouteKeyTest, TestSolrXmlPersistence, DateMathParserTest, CurrencyFieldXmlFileTest, TestSchemaResource, UnloadDistributedZkTest, StressHdfsTest, SpellPossibilityIteratorTest, TestCoreDiscovery, SchemaVersionSpecificBehaviorTest, BJQParserTest, MoreLikeThisHandlerTest, BlockDirectoryTest, ZkControllerTest, RequestHandlersTest, TestLuceneMatchVersion, TestBadConfig, TestHighFrequencyDictionaryFactory, TestSolrQueryParser, TestFieldTypeResource, TestDynamicFieldResource, SuggesterTSTTest, MultiTermTest, TestQuerySenderListener, TestBinaryResponseWriter, AliasIntegrationTest, AlternateDirectoryTest, StatelessScriptUpdateProcessorFactoryTest, HdfsChaosMonkeySafeLeaderTest, TestLFUCache, TestMergePolicyConfig, TermVectorComponentDistributedTest, UpdateRequestProcessorFactoryTest, TestValueSourceCache, BasicZkTest, LoggingHandlerTest, SimpleFacetsTest, ParsingFieldUpdateProcessorsTest, TestShardHandlerFactory, TestPostingsSolrHighlighter, SliceStateTest, DOMUtilTest, TestReload, TestDistributedSearch, TestPartialUpdateDeduplication, PrimitiveFieldTypeTest, TestReversedWildcardFilterFactory, FieldMutatingUpdateProcessorTest, TestStressUserVersions, SyncSliceTest, TestSchemaNameResource, TestStressRecovery, TestRemoteStreaming, OutputWriterTest, TestSurroundQueryParser, CircularListTest, UpdateParamsTest, TestFieldTypeCollectionResource, SoftAutoCommitTest, TestUtils, TestSolrIndexConfig, TestElisionMultitermQuery, TestSort, TestJmxIntegration, AutoCommitTest, DirectUpdateHandlerTest, TestSolrQueryParserDefaultOperatorResource, SolrCmdDistributorTest, ChaosMonkeySafeLeaderTest, LukeRequestHandlerTest, SolrTestCaseJ4Test, UUIDFieldTest, TestRandomMergePolicy, BasicFunctionalityTest, ConvertedLegacyTest, DateFieldTest, TestAnalyzeInfixSuggestions, TestFoldingMultitermQuery, TestTrie, CoreContainerCoreInitFailuresTest, ShowFileRequestHandlerTest, TestCodecSupport, TestFastLRUCache, BlockCacheTest, DocValuesMultiTest, TestRecoveryHdfs, ShardSplitTest, PreAnalyzedFieldTest, TestCharFilters, MinimalSchemaTest, QueryParsingTest, TestSerializedLuceneMatchVersion, SynonymTokenizerTest, TestStressLucene, AddBlockUpdateTest, TermsComponentTest, TestJmxMonitoredMap, LeaderElectionIntegrationTest, StandardRequestHandlerTest, AssignTest, ReturnFieldsTest, SuggesterFSTTest, WordBreakSolrSpellCheckerTest, TestUpdate, DeleteReplicaTest, RequiredFieldsTest, SolrCoreCheckLockOnStartupTest, SampleTest, HdfsBasicDistributedZkTest, TestHashPartitioner, TestDistributedGrouping, TestAddFieldRealTimeGet, OverseerCollectionProcessorTest, FullSolrCloudDistribCmdsTest, TestSweetSpotSimilarityFactory, TestManagedSchema, TestPerFieldSimilarity, SpellingQueryConverterTest, TestFastOutputStream, TestClassNameShortening, DebugComponentTest, TestNonNRTOpen, TestCustomSort, SignatureUpdateProcessorFactoryTest, ZkNodePropsTest, TestIBSimilarityFactory, BasicDistributedZkTest, BasicDistributedZk2Test, CollectionsAPIDistributedZkTest, OpenCloseCoreStressTest, OverseerTest, RecoveryZkTest, TestReplicationHandler, TestRandomFaceting, LeaderElectionTest, ZkSolrClientTest, TestZkChroot, ZkCLITest, ShardRoutingCustomTest, TestFaceting, TestRecovery, DistributedSpellCheckComponentTest, TestRealTimeGet, TestStressReorder, TestJoin, TestMultiCoreConfBootstrap, TestStressVersions, HardAutoCommitTest, DistributedTermsComponentTest, TestCoreContainer, TestSolr4Spatial, SolrCoreTest, StatsComponentTest, SpellCheckComponentTest, TestGroupingSearch, QueryElevationComponentTest, PeerSyncTest, BadIndexSchemaTest, TestFiltering, TestFunctionQuery, TestLazyCores, TestIndexSearcher, HighlighterTest, CurrencyFieldOpenExchangeTest, DistributedQueryElevationComponentTest, SolrIndexSplitterTest, SimplePostToolTest, TestExtendedDismaxParser, SpellCheckCollatorTest, CoreAdminHandlerTest, SolrRequestParserTest, DocValuesTest, SuggesterTest, SpatialFilterTest, SuggesterWFSTTest, TestCSVLoader, TestPseudoReturnFields, TestAtomicUpdateErrorCases, QueryEqualityTest]
[junit4] 2> NOTE: reproduce with: ant test -Dtestcase=QueryEqualityTest -Dtests.seed=4213C3E2C0ABCE50 -Dtests.slow=true -Dtests.locale=ar -Dtests.timezone=America/Iqaluit -Dtests.file.encoding=ISO-8859-1
[junit4] ERROR 0.00s | QueryEqualityTest (suite) <<<
[junit4] > Throwable #1: java.lang.AssertionError: testParserCoverage was run w/o any other method explicitly testing val parser: concat
[junit4] > at __randomizedtesting.SeedInfo.seed([4213C3E2C0ABCE50]:0)
[junit4] > at org.apache.solr.search.QueryEqualityTest.afterClassParserCoverageTest(QueryEqualityTest.java:65)
[junit4] > at java.lang.Thread.run(Thread.java:744)
[junit4] Completed in 2.01s, 67 tests, 1 failure <<< FAILURES!
[...truncated 376 lines...]
BUILD FAILED
C:\Users\JenkinsSlave\workspace\Lucene-Solr-4.x-Windows\build.xml:459: The following error occurred while executing this line:
C:\Users\JenkinsSlave\workspace\Lucene-Solr-4.x-Windows\build.xml:439: The following error occurred while executing this line:
C:\Users\JenkinsSlave\workspace\Lucene-Solr-4.x-Windows\build.xml:39: The following error occurred while executing this line:
C:\Users\JenkinsSlave\workspace\Lucene-Solr-4.x-Windows\extra-targets.xml:37: The following error occurred while executing this line:
C:\Users\JenkinsSlave\workspace\Lucene-Solr-4.x-Windows\solr\build.xml:189: The following error occurred while executing this line:
C:\Users\JenkinsSlave\workspace\Lucene-Solr-4.x-Windows\solr\common-build.xml:491: The following error occurred while executing this line:
C:\Users\JenkinsSlave\workspace\Lucene-Solr-4.x-Windows\lucene\common-build.xml:1307: The following error occurred while executing this line:
C:\Users\JenkinsSlave\workspace\Lucene-Solr-4.x-Windows\lucene\common-build.xml:940: There were test failures: 347 suites, 1517 tests, 1 suite-level error, 39 ignored (11 assumptions)
Total time: 81 minutes 35 seconds
Build step 'Invoke Ant' marked build as failure
Description set: Java: 64bit/jdk1.7.0_60-ea-b01 -XX:+UseCompressedOops -XX:+UseSerialGC
Archiving artifacts
Recording test results
Email was triggered for: Failure
Sending email for trigger: Failure