You are viewing a plain text version of this content. The canonical link for it is here.
Posted to commits@jena.apache.org by Apache Jenkins Server <je...@builds.apache.org> on 2019/07/14 18:06:05 UTC
Build failed in Jenkins: Jena_JDK14 #1
See <https://builds.apache.org/job/Jena_JDK14/1/display/redirect>
------------------------------------------
[...truncated 222.56 KB...]
at org.elasticsearch.cli.Command.main(Command.java:90)
at org.elasticsearch.bootstrap.Elasticsearch.main(Elasticsearch.java:93)
at org.elasticsearch.bootstrap.Elasticsearch.main(Elasticsearch.java:86)
3) No implementation for org.elasticsearch.repositories.Repository$Factory annotated with @org.elasticsearch.common.inject.multibindings.Element(setName=,uniqueId=1) was bound.
at _unknown_
3 errors
at org.elasticsearch.bootstrap.Elasticsearch.init(Elasticsearch.java:140) ~[elasticsearch-6.4.2.jar:6.4.2]
at org.elasticsearch.bootstrap.Elasticsearch.execute(Elasticsearch.java:127) ~[elasticsearch-6.4.2.jar:6.4.2]
at org.elasticsearch.cli.EnvironmentAwareCommand.execute(EnvironmentAwareCommand.java:86) ~[elasticsearch-6.4.2.jar:6.4.2]
at org.elasticsearch.cli.Command.mainWithoutErrorHandling(Command.java:124) ~[elasticsearch-cli-6.4.2.jar:6.4.2]
at org.elasticsearch.cli.Command.main(Command.java:90) ~[elasticsearch-cli-6.4.2.jar:6.4.2]
at org.elasticsearch.bootstrap.Elasticsearch.main(Elasticsearch.java:93) ~[elasticsearch-6.4.2.jar:6.4.2]
at org.elasticsearch.bootstrap.Elasticsearch.main(Elasticsearch.java:86) ~[elasticsearch-6.4.2.jar:6.4.2]
Caused by: org.elasticsearch.common.inject.CreationException: Guice creation errors:
1) An exception was caught and reported. Message: access denied ("java.lang.RuntimePermission" "accessClassInPackage.jdk.internal.vm.annotation")
at _unknown_
Caused by: java.security.AccessControlException: access denied ("java.lang.RuntimePermission" "accessClassInPackage.jdk.internal.vm.annotation")
at java.base/java.security.AccessControlContext.checkPermission(AccessControlContext.java:472)
at java.base/java.security.AccessController.checkPermission(AccessController.java:1034)
at java.base/java.lang.SecurityManager.checkPermission(SecurityManager.java:408)
at java.base/java.lang.SecurityManager.checkPackageAccess(SecurityManager.java:1324)
at java.base/jdk.internal.loader.ClassLoaders$AppClassLoader.loadClass(ClassLoaders.java:174)
at java.base/java.lang.ClassLoader.loadClass(ClassLoader.java:521)
at java.base/java.lang.Class.forName0(Native Method)
at java.base/java.lang.Class.forName(Class.java:416)
at java.base/sun.reflect.generics.factory.CoreReflectionFactory.makeNamedType(CoreReflectionFactory.java:114)
at java.base/sun.reflect.generics.visitor.Reifier.visitClassTypeSignature(Reifier.java:125)
at java.base/sun.reflect.generics.tree.ClassTypeSignature.accept(ClassTypeSignature.java:49)
at java.base/sun.reflect.annotation.AnnotationParser.parseSig(AnnotationParser.java:440)
at java.base/sun.reflect.annotation.AnnotationParser.parseAnnotation2(AnnotationParser.java:242)
at java.base/sun.reflect.annotation.AnnotationParser.parseAnnotations2(AnnotationParser.java:121)
at java.base/sun.reflect.annotation.AnnotationParser.parseAnnotations(AnnotationParser.java:73)
at java.base/java.lang.reflect.Executable.declaredAnnotations(Executable.java:614)
at java.base/java.lang.reflect.Executable.declaredAnnotations(Executable.java:612)
at java.base/java.lang.reflect.Executable.getAnnotation(Executable.java:582)
at java.base/java.lang.reflect.Method.getAnnotation(Method.java:696)
at org.elasticsearch.common.inject.spi.InjectionPoint.addInjectorsForMembers(InjectionPoint.java:370)
at org.elasticsearch.common.inject.spi.InjectionPoint.addInjectionPoints(InjectionPoint.java:359)
at org.elasticsearch.common.inject.spi.InjectionPoint.forInstanceMethodsAndFields(InjectionPoint.java:302)
at org.elasticsearch.common.inject.spi.InjectionPoint.forInstanceMethodsAndFields(InjectionPoint.java:323)
at org.elasticsearch.common.inject.internal.BindingBuilder.toInstance(BindingBuilder.java:90)
at org.elasticsearch.repositories.RepositoriesModule.lambda$configure$1(RepositoriesModule.java:68)
at java.base/java.util.HashMap.forEach(HashMap.java:1338)
at java.base/java.util.Collections$UnmodifiableMap.forEach(Collections.java:1503)
at org.elasticsearch.repositories.RepositoriesModule.configure(RepositoriesModule.java:68)
at org.elasticsearch.common.inject.AbstractModule.configure(AbstractModule.java:59)
at org.elasticsearch.common.inject.spi.Elements$RecordingBinder.install(Elements.java:221)
at org.elasticsearch.common.inject.spi.Elements.getElements(Elements.java:96)
at org.elasticsearch.common.inject.InjectorShell$Builder.build(InjectorShell.java:142)
at org.elasticsearch.common.inject.InjectorBuilder.build(InjectorBuilder.java:89)
at org.elasticsearch.common.inject.Guice.createInjector(Guice.java:96)
at org.elasticsearch.common.inject.Guice.createInjector(Guice.java:70)
at org.elasticsearch.common.inject.ModulesBuilder.createInjector(ModulesBuilder.java:42)
at org.elasticsearch.node.Node.<init>(Node.java:546)
at org.elasticsearch.node.Node.<init>(Node.java:256)
at org.elasticsearch.bootstrap.Bootstrap$5.<init>(Bootstrap.java:213)
at org.elasticsearch.bootstrap.Bootstrap.setup(Bootstrap.java:213)
at org.elasticsearch.bootstrap.Bootstrap.init(Bootstrap.java:326)
at org.elasticsearch.bootstrap.Elasticsearch.init(Elasticsearch.java:136)
at org.elasticsearch.bootstrap.Elasticsearch.execute(Elasticsearch.java:127)
at org.elasticsearch.cli.EnvironmentAwareCommand.execute(EnvironmentAwareCommand.java:86)
at org.elasticsearch.cli.Command.mainWithoutErrorHandling(Command.java:124)
at org.elasticsearch.cli.Command.main(Command.java:90)
at org.elasticsearch.bootstrap.Elasticsearch.main(Elasticsearch.java:93)
at org.elasticsearch.bootstrap.Elasticsearch.main(Elasticsearch.java:86)
2) An exception was caught and reported. Message: access denied ("java.lang.RuntimePermission" "accessClassInPackage.jdk.internal.vm.annotation")
at _unknown_
Caused by: java.security.AccessControlException: access denied ("java.lang.RuntimePermission" "accessClassInPackage.jdk.internal.vm.annotation")
at java.base/java.security.AccessControlContext.checkPermission(AccessControlContext.java:472)
at java.base/java.security.AccessController.checkPermission(AccessController.java:1034)
at java.base/java.lang.SecurityManager.checkPermission(SecurityManager.java:408)
at java.base/java.lang.SecurityManager.checkPackageAccess(SecurityManager.java:1324)
at java.base/jdk.internal.loader.ClassLoaders$AppClassLoader.loadClass(ClassLoaders.java:174)
at java.base/java.lang.ClassLoader.loadClass(ClassLoader.java:521)
at java.base/java.lang.Class.forName0(Native Method)
at java.base/java.lang.Class.forName(Class.java:416)
at java.base/sun.reflect.generics.factory.CoreReflectionFactory.makeNamedType(CoreReflectionFactory.java:114)
at java.base/sun.reflect.generics.visitor.Reifier.visitClassTypeSignature(Reifier.java:125)
at java.base/sun.reflect.generics.tree.ClassTypeSignature.accept(ClassTypeSignature.java:49)
at java.base/sun.reflect.annotation.AnnotationParser.parseSig(AnnotationParser.java:440)
at java.base/sun.reflect.annotation.AnnotationParser.parseAnnotation2(AnnotationParser.java:242)
at java.base/sun.reflect.annotation.AnnotationParser.parseAnnotations2(AnnotationParser.java:121)
at java.base/sun.reflect.annotation.AnnotationParser.parseAnnotations(AnnotationParser.java:73)
at java.base/java.lang.reflect.Executable.declaredAnnotations(Executable.java:614)
at java.base/java.lang.reflect.Executable.declaredAnnotations(Executable.java:612)
at java.base/java.lang.reflect.Executable.getAnnotation(Executable.java:582)
at java.base/java.lang.reflect.Method.getAnnotation(Method.java:696)
at org.elasticsearch.common.inject.internal.ProviderMethodsModule.getProviderMethods(ProviderMethodsModule.java:87)
at org.elasticsearch.common.inject.internal.ProviderMethodsModule.configure(ProviderMethodsModule.java:78)
at org.elasticsearch.common.inject.spi.Elements$RecordingBinder.install(Elements.java:221)
at org.elasticsearch.common.inject.spi.Elements$RecordingBinder.install(Elements.java:233)
at org.elasticsearch.common.inject.spi.Elements.getElements(Elements.java:96)
at org.elasticsearch.common.inject.InjectorShell$Builder.build(InjectorShell.java:142)
at org.elasticsearch.common.inject.InjectorBuilder.build(InjectorBuilder.java:89)
at org.elasticsearch.common.inject.Guice.createInjector(Guice.java:96)
at org.elasticsearch.common.inject.Guice.createInjector(Guice.java:70)
at org.elasticsearch.common.inject.ModulesBuilder.createInjector(ModulesBuilder.java:42)
at org.elasticsearch.node.Node.<init>(Node.java:546)
at org.elasticsearch.node.Node.<init>(Node.java:256)
at org.elasticsearch.bootstrap.Bootstrap$5.<init>(Bootstrap.java:213)
at org.elasticsearch.bootstrap.Bootstrap.setup(Bootstrap.java:213)
at org.elasticsearch.bootstrap.Bootstrap.init(Bootstrap.java:326)
at org.elasticsearch.bootstrap.Elasticsearch.init(Elasticsearch.java:136)
at org.elasticsearch.bootstrap.Elasticsearch.execute(Elasticsearch.java:127)
at org.elasticsearch.cli.EnvironmentAwareCommand.execute(EnvironmentAwareCommand.java:86)
at org.elasticsearch.cli.Command.mainWithoutErrorHandling(Command.java:124)
at org.elasticsearch.cli.Command.main(Command.java:90)
at org.elasticsearch.bootstrap.Elasticsearch.main(Elasticsearch.java:93)
at org.elasticsearch.bootstrap.Elasticsearch.main(Elasticsearch.java:86)
3) No implementation for org.elasticsearch.repositories.Repository$Factory annotated with @org.elasticsearch.common.inject.multibindings.Element(setName=,uniqueId=1) was bound.
at _unknown_
3 errors
at org.elasticsearch.common.inject.internal.Errors.throwCreationExceptionIfErrorsExist(Errors.java:361) ~[elasticsearch-6.4.2.jar:6.4.2]
at org.elasticsearch.common.inject.InjectorBuilder.initializeStatically(InjectorBuilder.java:136) ~[elasticsearch-6.4.2.jar:6.4.2]
at org.elasticsearch.common.inject.InjectorBuilder.build(InjectorBuilder.java:92) ~[elasticsearch-6.4.2.jar:6.4.2]
at org.elasticsearch.common.inject.Guice.createInjector(Guice.java:96) ~[elasticsearch-6.4.2.jar:6.4.2]
at org.elasticsearch.common.inject.Guice.createInjector(Guice.java:70) ~[elasticsearch-6.4.2.jar:6.4.2]
at org.elasticsearch.common.inject.ModulesBuilder.createInjector(ModulesBuilder.java:42) ~[elasticsearch-6.4.2.jar:6.4.2]
at org.elasticsearch.node.Node.<init>(Node.java:546) ~[elasticsearch-6.4.2.jar:6.4.2]
at org.elasticsearch.node.Node.<init>(Node.java:256) ~[elasticsearch-6.4.2.jar:6.4.2]
at org.elasticsearch.bootstrap.Bootstrap$5.<init>(Bootstrap.java:213) ~[elasticsearch-6.4.2.jar:6.4.2]
at org.elasticsearch.bootstrap.Bootstrap.setup(Bootstrap.java:213) ~[elasticsearch-6.4.2.jar:6.4.2]
at org.elasticsearch.bootstrap.Bootstrap.init(Bootstrap.java:326) ~[elasticsearch-6.4.2.jar:6.4.2]
at org.elasticsearch.bootstrap.Elasticsearch.init(Elasticsearch.java:136) ~[elasticsearch-6.4.2.jar:6.4.2]
... 6 more
[JENKINS] Archiving disabled
[JENKINS] Archiving disabled
[JENKINS] Archiving disabled
[JENKINS] Archiving disabled
[JENKINS] Archiving disabled
[JENKINS] Archiving disabled
[JENKINS] Archiving disabled
[JENKINS] Archiving disabled
[JENKINS] Archiving disabled
[JENKINS] Archiving disabled
[JENKINS] Archiving disabled
[JENKINS] Archiving disabled
[JENKINS] Archiving disabled
[JENKINS] Archiving disabled
[JENKINS] Archiving disabled
[JENKINS] Archiving disabled
[JENKINS] Archiving disabled
[JENKINS] Archiving disabled
[JENKINS] Archiving disabled
[JENKINS] Archiving disabled
[JENKINS] Archiving disabled
[JENKINS] Archiving disabled
[JENKINS] Archiving disabled
[JENKINS] Archiving disabled
[JENKINS] Archiving disabled
[JENKINS] Archiving disabled
[JENKINS] Archiving disabled
[JENKINS] Archiving disabled
[JENKINS] Archiving disabled
[JENKINS] Archiving disabled
[JENKINS] Archiving disabled
[JENKINS] Archiving disabled
[JENKINS] Archiving disabled
[JENKINS] Archiving disabled
[JENKINS] Archiving disabled
[JENKINS] Archiving disabled
[JENKINS] Archiving disabled
[JENKINS] Archiving disabled
[JENKINS] Archiving disabled
[JENKINS] Archiving disabled
[JENKINS] Archiving disabled
[JENKINS] Archiving disabled
[JENKINS] Archiving disabled
[JENKINS] Archiving disabled
[JENKINS] Archiving disabled
[JENKINS] Archiving disabled
[JENKINS] Archiving disabled
[JENKINS] Archiving disabled
[INFO] ------------------------------------------------------------------------
[INFO] Reactor Summary for Apache Jena 3.13.0-SNAPSHOT:
[INFO]
[INFO] Apache Jena ........................................ SUCCESS [ 9.702 s]
[INFO] Apache Jena - Shadowed external libraries .......... SUCCESS [ 9.425 s]
[INFO] Apache Jena - IRI .................................. SUCCESS [ 23.837 s]
[INFO] Apache Jena - Base Common Environment .............. SUCCESS [01:22 min]
[INFO] Apache Jena - Core ................................. SUCCESS [01:22 min]
[INFO] Apache Jena - ARQ (SPARQL 1.1 Query Engine) ........ SUCCESS [01:36 min]
[INFO] Apache Jena - RDF Connection ....................... SUCCESS [ 20.667 s]
[INFO] Apache Jena - TDB1 (Native Triple Store) ........... SUCCESS [02:34 min]
[INFO] Apache Jena - Database Operation Environment ....... SUCCESS [ 2.136 s]
[INFO] Apache Jena - DBOE Base ............................ SUCCESS [ 6.478 s]
[INFO] Apache Jena - DBOE Transactions .................... SUCCESS [ 5.599 s]
[INFO] Apache Jena - DBOE Indexes ......................... SUCCESS [ 3.696 s]
[INFO] Apache Jena - DBOE Index test suite ................ SUCCESS [ 3.740 s]
[INFO] Apache Jena - DBOE Transactional Datastructures .... SUCCESS [ 10.596 s]
[INFO] Apache Jena - DBOE Storage ......................... SUCCESS [ 5.946 s]
[INFO] Apache Jena - TDB2 ................................. SUCCESS [02:27 min]
[INFO] Apache Jena - Libraries POM ........................ SUCCESS [ 1.813 s]
[INFO] Apache Jena - Command line tools ................... SUCCESS [ 37.141 s]
[INFO] Apache Jena - SPARQL Text Search ................... SUCCESS [ 35.950 s]
[INFO] Apache Jena - SPARQL Text Search - Elasticsearch ... FAILURE [ 29.765 s]
[INFO] Apache Jena - Fuseki - A SPARQL 1.1 Server ......... SKIPPED
[INFO] Apache Jena - Fuseki Core Engine ................... SKIPPED
[INFO] Apache Jena - Fuseki Data Access Control ........... SKIPPED
[INFO] Apache Jena - Fuseki Server ........................ SKIPPED
[INFO] Apache Jena - Fuseki Server Jar .................... SKIPPED
[INFO] Apache Jena - Fuseki Webapp ........................ SKIPPED
[INFO] Apache Jena - Fuseki WAR File ...................... SKIPPED
[INFO] Apache Jena - Fuseki Server Standalone Jar ......... SKIPPED
[INFO] Apache Jena - Fuseki Binary Distribution ........... SKIPPED
[INFO] Apache Jena - GeoSPARQL Engine ..................... SKIPPED
[INFO] Apache Jena - Fuseki with GeoSPARQL Engine ......... SKIPPED
[INFO] Apache Jena - Integration Testing .................. SKIPPED
[INFO] Apache Jena - Distribution ......................... SKIPPED
[INFO] Apache Jena - SDB (SQL based triple store) ......... SKIPPED
[INFO] Apache Jena - Security Permissions ................. SKIPPED
[INFO] Apache Jena - Extras ............................... SKIPPED
[INFO] Apache Jena - Extras - Query Builder ............... SKIPPED
[INFO] Apache Jena - JDBC Parent .......................... SKIPPED
[INFO] Apache Jena - JDBC Core API ........................ SKIPPED
[INFO] Apache Jena - JDBC Remote Endpoint Driver .......... SKIPPED
[INFO] Apache Jena - JDBC In-Memory Driver ................ SKIPPED
[INFO] Apache Jena - JDBC TDB Driver ...................... SKIPPED
[INFO] Apache Jena - JDBC Driver Bundle ................... SKIPPED
[INFO] Apache Jena - Elephas .............................. SKIPPED
[INFO] Apache Jena - OSGi ................................. SKIPPED
[INFO] Apache Jena - OSGi bundle .......................... SKIPPED
[INFO] Apache Jena - OSGi Karaf features .................. SKIPPED
[INFO] ------------------------------------------------------------------------
[INFO] BUILD FAILURE
[INFO] ------------------------------------------------------------------------
[INFO] Total time: 14:48 min
[INFO] Finished at: 2019-07-14T18:05:12Z
[INFO] ------------------------------------------------------------------------
Waiting for Jenkins to finish collecting data
[ERROR] Failed to execute goal com.github.alexcojocaru:elasticsearch-maven-plugin:6.8:runforked (start-elasticsearch) on project jena-text-es: This Elasticsearch process destroyer does not support this operation -> [Help 1]
[ERROR]
[ERROR] To see the full stack trace of the errors, re-run Maven with the -e switch.
[ERROR] Re-run Maven using the -X switch to enable full debug logging.
[ERROR]
[ERROR] For more information about the errors and possible solutions, please read the following articles:
[ERROR] [Help 1] http://cwiki.apache.org/confluence/display/MAVEN/MojoExecutionException
[ERROR]
[ERROR] After correcting the problems, you can resume the build with the command
[ERROR] mvn <goals> -rf :jena-text-es
channel stopped
[INFO] Cleaning up at application shutdown...
[INFO] The Elasticsearch process has already stopped. Nothing to clean up