You are viewing a plain text version of this content. The canonical link for it is here.
Posted to dev@zookeeper.apache.org by Apache Jenkins Server <je...@builds.apache.org> on 2014/05/07 14:30:26 UTC
ZooKeeper-trunk-jdk8 - Build # 23 - Failure
See https://builds.apache.org/job/ZooKeeper-trunk-jdk8/23/
###################################################################################
########################## LAST 60 LINES OF THE CONSOLE ###########################
[...truncated 237870 lines...]
[junit] 2014-05-07 12:30:05,248 [myid:] - INFO [Snapshot Thread:FileTxnSnapLog@298] - Snapshotting: 0x2000002c3 to /x1/jenkins/jenkins-slave/workspace/ZooKeeper-trunk-jdk8/trunk/build/test/tmp/test6846072314896433509.junit.dir/version-2/snapshot.2000002c3
[junit] 2014-05-07 12:30:05,290 [myid:] - INFO [SyncThread:3:FileTxnLog@200] - Creating new log file: log.2000002c5
[junit] 2014-05-07 12:30:05,688 [myid:] - INFO [Snapshot Thread:FileTxnSnapLog@298] - Snapshotting: 0x2000002cd to /x1/jenkins/jenkins-slave/workspace/ZooKeeper-trunk-jdk8/trunk/build/test/tmp/test2223615682282151217.junit.dir/version-2/snapshot.2000002cd
[junit] 2014-05-07 12:30:05,729 [myid:] - INFO [SyncThread:4:FileTxnLog@200] - Creating new log file: log.2000002cf
[junit] 2014-05-07 12:30:07,150 [myid:] - INFO [Snapshot Thread:FileTxnSnapLog@298] - Snapshotting: 0x2000002e9 to /x1/jenkins/jenkins-slave/workspace/ZooKeeper-trunk-jdk8/trunk/build/test/tmp/test4095683480742917893.junit.dir/version-2/snapshot.2000002e9
[junit] 2014-05-07 12:30:07,189 [myid:] - INFO [SyncThread:1:FileTxnLog@200] - Creating new log file: log.2000002eb
[junit] 2014-05-07 12:30:08,193 [myid:] - INFO [Snapshot Thread:FileTxnSnapLog@298] - Snapshotting: 0x2000002ff to /x1/jenkins/jenkins-slave/workspace/ZooKeeper-trunk-jdk8/trunk/build/test/tmp/test4569171021859339932.junit.dir/version-2/snapshot.2000002ff
[junit] 2014-05-07 12:30:08,234 [myid:] - INFO [SyncThread:2:FileTxnLog@200] - Creating new log file: log.200000301
[junit] 2014-05-07 12:30:08,756 [myid:] - INFO [Snapshot Thread:FileTxnSnapLog@298] - Snapshotting: 0x200000305 to /x1/jenkins/jenkins-slave/workspace/ZooKeeper-trunk-jdk8/trunk/build/test/tmp/test2223615682282151217.junit.dir/version-2/snapshot.200000305
[junit] 2014-05-07 12:30:08,797 [myid:] - INFO [SyncThread:4:FileTxnLog@200] - Creating new log file: log.200000307
[junit] 2014-05-07 12:30:09,347 [myid:] - INFO [Snapshot Thread:FileTxnSnapLog@298] - Snapshotting: 0x200000312 to /x1/jenkins/jenkins-slave/workspace/ZooKeeper-trunk-jdk8/trunk/build/test/tmp/test6846072314896433509.junit.dir/version-2/snapshot.200000312
[junit] 2014-05-07 12:30:09,381 [myid:] - INFO [SyncThread:3:FileTxnLog@200] - Creating new log file: log.200000314
[junit] 2014-05-07 12:30:10,623 [myid:] - INFO [Snapshot Thread:FileTxnSnapLog@298] - Snapshotting: 0x20000033b to /x1/jenkins/jenkins-slave/workspace/ZooKeeper-trunk-jdk8/trunk/build/test/tmp/test4095683480742917893.junit.dir/version-2/snapshot.20000033b
[junit] 2014-05-07 12:30:10,657 [myid:] - INFO [SyncThread:1:FileTxnLog@200] - Creating new log file: log.20000033d
[junit] 2014-05-07 12:30:11,602 [myid:] - INFO [Snapshot Thread:FileTxnSnapLog@298] - Snapshotting: 0x200000348 to /x1/jenkins/jenkins-slave/workspace/ZooKeeper-trunk-jdk8/trunk/build/test/tmp/test4569171021859339932.junit.dir/version-2/snapshot.200000348
[junit] 2014-05-07 12:30:11,620 [myid:] - INFO [SyncThread:2:FileTxnLog@200] - Creating new log file: log.20000034a
[junit] 2014-05-07 12:30:11,996 [myid:] - INFO [Snapshot Thread:FileTxnSnapLog@298] - Snapshotting: 0x200000357 to /x1/jenkins/jenkins-slave/workspace/ZooKeeper-trunk-jdk8/trunk/build/test/tmp/test2223615682282151217.junit.dir/version-2/snapshot.200000357
[junit] 2014-05-07 12:30:12,019 [myid:] - INFO [SyncThread:4:FileTxnLog@200] - Creating new log file: log.200000359
[junit] 2014-05-07 12:30:12,666 [myid:] - INFO [Snapshot Thread:FileTxnSnapLog@298] - Snapshotting: 0x200000369 to /x1/jenkins/jenkins-slave/workspace/ZooKeeper-trunk-jdk8/trunk/build/test/tmp/test6846072314896433509.junit.dir/version-2/snapshot.200000369
[junit] 2014-05-07 12:30:12,698 [myid:] - INFO [SyncThread:3:FileTxnLog@200] - Creating new log file: log.20000036b
[junit] 2014-05-07 12:30:12,927 [myid:] - INFO [Snapshot Thread:FileTxnSnapLog@298] - Snapshotting: 0x20000036f to /x1/jenkins/jenkins-slave/workspace/ZooKeeper-trunk-jdk8/trunk/build/test/tmp/test4095683480742917893.junit.dir/version-2/snapshot.20000036f
[junit] 2014-05-07 12:30:12,962 [myid:] - INFO [SyncThread:1:FileTxnLog@200] - Creating new log file: log.200000371
[junit] 2014-05-07 12:30:14,669 [myid:] - INFO [Snapshot Thread:FileTxnSnapLog@298] - Snapshotting: 0x200000399 to /x1/jenkins/jenkins-slave/workspace/ZooKeeper-trunk-jdk8/trunk/build/test/tmp/test4569171021859339932.junit.dir/version-2/snapshot.200000399
[junit] 2014-05-07 12:30:14,707 [myid:] - INFO [SyncThread:2:FileTxnLog@200] - Creating new log file: log.20000039b
[junit] 2014-05-07 12:30:15,875 [myid:] - INFO [Snapshot Thread:FileTxnSnapLog@298] - Snapshotting: 0x2000003b3 to /x1/jenkins/jenkins-slave/workspace/ZooKeeper-trunk-jdk8/trunk/build/test/tmp/test6846072314896433509.junit.dir/version-2/snapshot.2000003b3
[junit] 2014-05-07 12:30:15,919 [myid:] - INFO [SyncThread:3:FileTxnLog@200] - Creating new log file: log.2000003b5
[junit] 2014-05-07 12:30:16,435 [myid:] - INFO [Snapshot Thread:FileTxnSnapLog@298] - Snapshotting: 0x2000003b7 to /x1/jenkins/jenkins-slave/workspace/ZooKeeper-trunk-jdk8/trunk/build/test/tmp/test2223615682282151217.junit.dir/version-2/snapshot.2000003b7
[junit] 2014-05-07 12:30:16,476 [myid:] - INFO [SyncThread:4:FileTxnLog@200] - Creating new log file: log.2000003b9
[junit] 2014-05-07 12:30:16,891 [myid:] - INFO [Snapshot Thread:FileTxnSnapLog@298] - Snapshotting: 0x2000003c6 to /x1/jenkins/jenkins-slave/workspace/ZooKeeper-trunk-jdk8/trunk/build/test/tmp/test4095683480742917893.junit.dir/version-2/snapshot.2000003c6
[junit] 2014-05-07 12:30:16,927 [myid:] - INFO [SyncThread:1:FileTxnLog@200] - Creating new log file: log.2000003c8
[junit] 2014-05-07 12:30:17,531 [myid:] - INFO [Snapshot Thread:FileTxnSnapLog@298] - Snapshotting: 0x2000003e4 to /x1/jenkins/jenkins-slave/workspace/ZooKeeper-trunk-jdk8/trunk/build/test/tmp/test4569171021859339932.junit.dir/version-2/snapshot.2000003e4
[junit] 2014-05-07 12:30:17,549 [myid:] - INFO [SyncThread:2:FileTxnLog@200] - Creating new log file: log.2000003e6
[junit] 2014-05-07 12:30:17,975 [myid:] - INFO [Snapshot Thread:FileTxnSnapLog@298] - Snapshotting: 0x2000003f4 to /x1/jenkins/jenkins-slave/workspace/ZooKeeper-trunk-jdk8/trunk/build/test/tmp/test2223615682282151217.junit.dir/version-2/snapshot.2000003f4
[junit] 2014-05-07 12:30:18,005 [myid:] - INFO [SyncThread:4:FileTxnLog@200] - Creating new log file: log.2000003f6
[junit] 2014-05-07 12:30:18,252 [myid:] - INFO [Snapshot Thread:FileTxnSnapLog@298] - Snapshotting: 0x2000003fd to /x1/jenkins/jenkins-slave/workspace/ZooKeeper-trunk-jdk8/trunk/build/test/tmp/test4095683480742917893.junit.dir/version-2/snapshot.2000003fd
[junit] 2014-05-07 12:30:18,281 [myid:] - INFO [SyncThread:1:FileTxnLog@200] - Creating new log file: log.2000003ff
[junit] 2014-05-07 12:30:18,642 [myid:] - INFO [Snapshot Thread:FileTxnSnapLog@298] - Snapshotting: 0x200000409 to /x1/jenkins/jenkins-slave/workspace/ZooKeeper-trunk-jdk8/trunk/build/test/tmp/test6846072314896433509.junit.dir/version-2/snapshot.200000409
[junit] 2014-05-07 12:30:18,672 [myid:] - INFO [SyncThread:3:FileTxnLog@200] - Creating new log file: log.20000040b
[junit] 2014-05-07 12:30:21,352 [myid:] - INFO [Snapshot Thread:FileTxnSnapLog@298] - Snapshotting: 0x20000043f to /x1/jenkins/jenkins-slave/workspace/ZooKeeper-trunk-jdk8/trunk/build/test/tmp/test2223615682282151217.junit.dir/version-2/snapshot.20000043f
[junit] 2014-05-07 12:30:21,395 [myid:] - INFO [SyncThread:4:FileTxnLog@200] - Creating new log file: log.200000441
[junit] 2014-05-07 12:30:21,717 [myid:] - INFO [Snapshot Thread:FileTxnSnapLog@298] - Snapshotting: 0x200000446 to /x1/jenkins/jenkins-slave/workspace/ZooKeeper-trunk-jdk8/trunk/build/test/tmp/test4569171021859339932.junit.dir/version-2/snapshot.200000446
[junit] 2014-05-07 12:30:21,753 [myid:] - INFO [SyncThread:2:FileTxnLog@200] - Creating new log file: log.200000448
[junit] 2014-05-07 12:30:22,004 [myid:] - INFO [Snapshot Thread:FileTxnSnapLog@298] - Snapshotting: 0x20000044a to /x1/jenkins/jenkins-slave/workspace/ZooKeeper-trunk-jdk8/trunk/build/test/tmp/test4095683480742917893.junit.dir/version-2/snapshot.20000044a
[junit] 2014-05-07 12:30:22,033 [myid:] - INFO [SyncThread:1:FileTxnLog@200] - Creating new log file: log.20000044c
[junit] 2014-05-07 12:30:23,134 [myid:] - INFO [Snapshot Thread:FileTxnSnapLog@298] - Snapshotting: 0x200000468 to /x1/jenkins/jenkins-slave/workspace/ZooKeeper-trunk-jdk8/trunk/build/test/tmp/test6846072314896433509.junit.dir/version-2/snapshot.200000468
[junit] 2014-05-07 12:30:23,164 [myid:] - INFO [SyncThread:3:FileTxnLog@200] - Creating new log file: log.20000046a
[junit] 2014-05-07 12:30:23,758 [myid:] - INFO [Snapshot Thread:FileTxnSnapLog@298] - Snapshotting: 0x200000480 to /x1/jenkins/jenkins-slave/workspace/ZooKeeper-trunk-jdk8/trunk/build/test/tmp/test4095683480742917893.junit.dir/version-2/snapshot.200000480
[junit] 2014-05-07 12:30:23,776 [myid:] - INFO [SyncThread:1:FileTxnLog@200] - Creating new log file: log.200000482
[junit] 2014-05-07 12:30:23,873 [myid:] - INFO [Snapshot Thread:FileTxnSnapLog@298] - Snapshotting: 0x200000485 to /x1/jenkins/jenkins-slave/workspace/ZooKeeper-trunk-jdk8/trunk/build/test/tmp/test2223615682282151217.junit.dir/version-2/snapshot.200000485
[junit] 2014-05-07 12:30:23,903 [myid:] - INFO [SyncThread:4:FileTxnLog@200] - Creating new log file: log.200000487
Build timed out (after 60 minutes). Marking the build as failed.
[locks-and-latches] Releasing all the locks
[locks-and-latches] All the locks released
Build was aborted
[WARNINGS] Skipping publisher since build result is FAILURE
Recording test results
[junit] 2014-05-07 12:30:25,185 [myid:] - INFO [Snapshot Thread:FileTxnSnapLog@298] - Snapshotting: 0x2000004a8 to /x1/jenkins/jenkins-slave/workspace/ZooKeeper-trunk-jdk8/trunk/build/test/tmp/test4569171021859339932.junit.dir/version-2/snapshot.2000004a8
Email was triggered for: Failure
Sending email for trigger: Failure
###################################################################################
############################## FAILED TESTS (if any) ##############################
2 tests failed.
REGRESSION: org.apache.zookeeper.test.StaticHostProviderTest.testUpdateLoadBalancing
Error Message:
Timeout occurred. Please note the time in the report does not reflect the time until the timeout.
Stack Trace:
junit.framework.AssertionFailedError: Timeout occurred. Please note the time in the report does not reflect the time until the timeout.
FAILED: TEST-org.apache.zookeeper.test.ZkDatabaseCorruptionTest.xml.<init>
Error Message:
Stack Trace:
Test report file /home/jenkins/jenkins-slave/workspace/ZooKeeper-trunk-jdk8/trunk/build/test/logs/TEST-org.apache.zookeeper.test.ZkDatabaseCorruptionTest.xml was length 0
ZooKeeper-trunk-jdk8 - Build # 24 - Still Failing
Posted by Apache Jenkins Server <je...@builds.apache.org>.
See https://builds.apache.org/job/ZooKeeper-trunk-jdk8/24/
###################################################################################
########################## LAST 60 LINES OF THE CONSOLE ###########################
[...truncated 1441 lines...]
compile_jute:
[mkdir] Created dir: /home/hudson/jenkins-slave/workspace/ZooKeeper-trunk-jdk8/trunk/src/java/generated
[mkdir] Created dir: /home/hudson/jenkins-slave/workspace/ZooKeeper-trunk-jdk8/trunk/src/c/generated
[java] ../../zookeeper.jute Parsed Successfully
[java] ../../zookeeper.jute Parsed Successfully
[touch] Creating /home/hudson/jenkins-slave/workspace/ZooKeeper-trunk-jdk8/trunk/src/java/generated/.generated
ver-gen:
[javac] Compiling 1 source file to /home/hudson/jenkins-slave/workspace/ZooKeeper-trunk-jdk8/trunk/build/classes
[javac] warning: [options] bootstrap class path not set in conjunction with -source 1.5
[javac] warning: [options] source value 1.5 is obsolete and will be removed in a future release
[javac] warning: [options] To suppress warnings about obsolete options, use -Xlint:-options.
[javac] 3 warnings
svn-revision:
[mkdir] Created dir: /home/hudson/jenkins-slave/workspace/ZooKeeper-trunk-jdk8/trunk/.revision
version-info:
process-template:
build-generated:
[javac] Compiling 60 source files to /home/hudson/jenkins-slave/workspace/ZooKeeper-trunk-jdk8/trunk/build/classes
[javac] warning: [options] bootstrap class path not set in conjunction with -source 1.5
[javac] warning: [options] source value 1.5 is obsolete and will be removed in a future release
[javac] warning: [options] To suppress warnings about obsolete options, use -Xlint:-options.
[javac] 3 warnings
compile:
[javac] Compiling 185 source files to /home/hudson/jenkins-slave/workspace/ZooKeeper-trunk-jdk8/trunk/build/classes
[javac] warning: [options] bootstrap class path not set in conjunction with -source 1.5
[javac] warning: [options] source value 1.5 is obsolete and will be removed in a future release
[javac] warning: [options] To suppress warnings about obsolete options, use -Xlint:-options.
[javac] /home/hudson/jenkins-slave/workspace/ZooKeeper-trunk-jdk8/trunk/src/java/main/org/apache/zookeeper/server/quorum/Leader.java:65: error: cannot find symbol
[javac] static public class Proposal extends SyncedLearnerTracker {
[javac] ^
[javac] symbol: class SyncedLearnerTracker
[javac] location: class Leader
[javac] /home/hudson/jenkins-slave/workspace/ZooKeeper-trunk-jdk8/trunk/src/java/main/org/apache/zookeeper/jmx/ManagedUtil.java:62: warning: [rawtypes] found raw type: Enumeration
[javac] Enumeration enumer = r.getCurrentLoggers();
[javac] ^
[javac] missing type arguments for generic class Enumeration<E>
[javac] where E is a type-variable:
[javac] E extends Object declared in interface Enumeration
[javac] /home/hudson/jenkins-slave/workspace/ZooKeeper-trunk-jdk8/trunk/src/java/main/org/apache/zookeeper/server/quorum/Leader.java:69: error: method does not override or implement a method from a supertype
[javac] @Override
[javac] ^
BUILD FAILED
/home/hudson/jenkins-slave/workspace/ZooKeeper-trunk-jdk8/trunk/build.xml:436: Compile failed; see the compiler error output for details.
Total time: 10 seconds
Build step 'Execute shell' marked build as failure
[locks-and-latches] Releasing all the locks
[locks-and-latches] All the locks released
[WARNINGS] Skipping publisher since build result is FAILURE
Recording test results
Email was triggered for: Failure
Sending email for trigger: Failure
###################################################################################
############################## FAILED TESTS (if any) ##############################
No tests ran.