You are viewing a plain text version of this content. The canonical link for it is here.
Posted to dev@kafka.apache.org by Apache Jenkins Server <je...@builds.apache.org> on 2016/09/10 10:16:26 UTC

Build failed in Jenkins: kafka-trunk-jdk8 #874

See <https://builds.apache.org/job/kafka-trunk-jdk8/874/changes>

Changes:

[ismael] KAFKA-4145; Avoid redundant integration testing in ProducerSendTests

------------------------------------------
[...truncated 13777 lines...]
org.apache.kafka.connect.runtime.WorkerSinkTaskThreadedTest > testPollsInBackground PASSED

org.apache.kafka.connect.runtime.WorkerSinkTaskThreadedTest > testCommit STARTED

org.apache.kafka.connect.runtime.WorkerSinkTaskThreadedTest > testCommit PASSED

org.apache.kafka.connect.runtime.WorkerSinkTaskThreadedTest > testCommitTaskFlushFailure STARTED

org.apache.kafka.connect.runtime.WorkerSinkTaskThreadedTest > testCommitTaskFlushFailure PASSED

org.apache.kafka.connect.runtime.WorkerSinkTaskThreadedTest > testCommitTaskSuccessAndFlushFailure STARTED

org.apache.kafka.connect.runtime.WorkerSinkTaskThreadedTest > testCommitTaskSuccessAndFlushFailure PASSED

org.apache.kafka.connect.runtime.WorkerSinkTaskThreadedTest > testCommitConsumerFailure STARTED

org.apache.kafka.connect.runtime.WorkerSinkTaskThreadedTest > testCommitConsumerFailure PASSED

org.apache.kafka.connect.runtime.WorkerSinkTaskThreadedTest > testCommitTimeout STARTED

org.apache.kafka.connect.runtime.WorkerSinkTaskThreadedTest > testCommitTimeout PASSED

org.apache.kafka.connect.runtime.WorkerSinkTaskThreadedTest > testAssignmentPauseResume STARTED

org.apache.kafka.connect.runtime.WorkerSinkTaskThreadedTest > testAssignmentPauseResume PASSED

org.apache.kafka.connect.runtime.WorkerSinkTaskThreadedTest > testRewind STARTED

org.apache.kafka.connect.runtime.WorkerSinkTaskThreadedTest > testRewind PASSED

org.apache.kafka.connect.runtime.WorkerSinkTaskThreadedTest > testRewindOnRebalanceDuringPoll STARTED

org.apache.kafka.connect.runtime.WorkerSinkTaskThreadedTest > testRewindOnRebalanceDuringPoll PASSED

org.apache.kafka.connect.storage.KafkaOffsetBackingStoreTest > testStartStop STARTED

org.apache.kafka.connect.storage.KafkaOffsetBackingStoreTest > testStartStop PASSED

org.apache.kafka.connect.storage.KafkaOffsetBackingStoreTest > testReloadOnStart STARTED

org.apache.kafka.connect.storage.KafkaOffsetBackingStoreTest > testReloadOnStart PASSED

org.apache.kafka.connect.storage.KafkaOffsetBackingStoreTest > testGetSet STARTED

org.apache.kafka.connect.storage.KafkaOffsetBackingStoreTest > testGetSet PASSED

org.apache.kafka.connect.storage.KafkaOffsetBackingStoreTest > testGetSetNull STARTED

org.apache.kafka.connect.storage.KafkaOffsetBackingStoreTest > testGetSetNull PASSED

org.apache.kafka.connect.storage.KafkaOffsetBackingStoreTest > testSetFailure STARTED

org.apache.kafka.connect.storage.KafkaOffsetBackingStoreTest > testSetFailure PASSED

org.apache.kafka.connect.storage.MemoryStatusBackingStoreTest > putAndGetConnectorStatus STARTED

org.apache.kafka.connect.storage.MemoryStatusBackingStoreTest > putAndGetConnectorStatus PASSED

org.apache.kafka.connect.storage.MemoryStatusBackingStoreTest > putAndGetTaskStatus STARTED

org.apache.kafka.connect.storage.MemoryStatusBackingStoreTest > putAndGetTaskStatus PASSED

org.apache.kafka.connect.storage.MemoryStatusBackingStoreTest > deleteTaskStatus STARTED

org.apache.kafka.connect.storage.MemoryStatusBackingStoreTest > deleteTaskStatus PASSED

org.apache.kafka.connect.storage.MemoryStatusBackingStoreTest > deleteConnectorStatus STARTED

org.apache.kafka.connect.storage.MemoryStatusBackingStoreTest > deleteConnectorStatus PASSED

org.apache.kafka.connect.storage.KafkaStatusBackingStoreTest > readTaskState STARTED

org.apache.kafka.connect.storage.KafkaStatusBackingStoreTest > readTaskState PASSED

org.apache.kafka.connect.storage.KafkaStatusBackingStoreTest > putTaskState STARTED

org.apache.kafka.connect.storage.KafkaStatusBackingStoreTest > putTaskState PASSED

org.apache.kafka.connect.storage.KafkaStatusBackingStoreTest > putSafeWithNoPreviousValueIsPropagated STARTED

org.apache.kafka.connect.storage.KafkaStatusBackingStoreTest > putSafeWithNoPreviousValueIsPropagated PASSED

org.apache.kafka.connect.storage.KafkaStatusBackingStoreTest > putConnectorStateNonRetriableFailure STARTED

org.apache.kafka.connect.storage.KafkaStatusBackingStoreTest > putConnectorStateNonRetriableFailure PASSED

org.apache.kafka.connect.storage.KafkaStatusBackingStoreTest > putConnectorStateShouldOverride STARTED

org.apache.kafka.connect.storage.KafkaStatusBackingStoreTest > putConnectorStateShouldOverride PASSED

org.apache.kafka.connect.storage.KafkaStatusBackingStoreTest > putConnectorStateRetriableFailure STARTED

org.apache.kafka.connect.storage.KafkaStatusBackingStoreTest > putConnectorStateRetriableFailure PASSED

org.apache.kafka.connect.storage.KafkaStatusBackingStoreTest > putSafeOverridesValueSetBySameWorker STARTED

org.apache.kafka.connect.storage.KafkaStatusBackingStoreTest > putSafeOverridesValueSetBySameWorker PASSED

org.apache.kafka.connect.storage.KafkaStatusBackingStoreTest > readConnectorState STARTED

org.apache.kafka.connect.storage.KafkaStatusBackingStoreTest > readConnectorState PASSED

org.apache.kafka.connect.storage.KafkaStatusBackingStoreTest > putSafeConnectorIgnoresStaleStatus STARTED

org.apache.kafka.connect.storage.KafkaStatusBackingStoreTest > putSafeConnectorIgnoresStaleStatus PASSED

org.apache.kafka.connect.storage.KafkaStatusBackingStoreTest > putConnectorState STARTED

org.apache.kafka.connect.storage.KafkaStatusBackingStoreTest > putConnectorState PASSED

org.apache.kafka.connect.storage.OffsetStorageWriterTest > testWriteFlush STARTED

org.apache.kafka.connect.storage.OffsetStorageWriterTest > testWriteFlush PASSED

org.apache.kafka.connect.storage.OffsetStorageWriterTest > testWriteNullValueFlush STARTED

org.apache.kafka.connect.storage.OffsetStorageWriterTest > testWriteNullValueFlush PASSED

org.apache.kafka.connect.storage.OffsetStorageWriterTest > testWriteNullKeyFlush STARTED

org.apache.kafka.connect.storage.OffsetStorageWriterTest > testWriteNullKeyFlush PASSED

org.apache.kafka.connect.storage.OffsetStorageWriterTest > testNoOffsetsToFlush STARTED

org.apache.kafka.connect.storage.OffsetStorageWriterTest > testNoOffsetsToFlush PASSED

org.apache.kafka.connect.storage.OffsetStorageWriterTest > testFlushFailureReplacesOffsets STARTED

org.apache.kafka.connect.storage.OffsetStorageWriterTest > testFlushFailureReplacesOffsets PASSED

org.apache.kafka.connect.storage.OffsetStorageWriterTest > testAlreadyFlushing STARTED

org.apache.kafka.connect.storage.OffsetStorageWriterTest > testAlreadyFlushing PASSED

org.apache.kafka.connect.storage.OffsetStorageWriterTest > testCancelBeforeAwaitFlush STARTED

org.apache.kafka.connect.storage.OffsetStorageWriterTest > testCancelBeforeAwaitFlush PASSED

org.apache.kafka.connect.storage.OffsetStorageWriterTest > testCancelAfterAwaitFlush STARTED

org.apache.kafka.connect.storage.OffsetStorageWriterTest > testCancelAfterAwaitFlush PASSED

org.apache.kafka.connect.storage.KafkaConfigBackingStoreTest > testPutConnectorConfig STARTED

org.apache.kafka.connect.storage.KafkaConfigBackingStoreTest > testPutConnectorConfig PASSED

org.apache.kafka.connect.storage.KafkaConfigBackingStoreTest > testStartStop STARTED

org.apache.kafka.connect.storage.KafkaConfigBackingStoreTest > testStartStop PASSED

org.apache.kafka.connect.storage.KafkaConfigBackingStoreTest > testPutTaskConfigs STARTED

org.apache.kafka.connect.storage.KafkaConfigBackingStoreTest > testPutTaskConfigs PASSED

org.apache.kafka.connect.storage.KafkaConfigBackingStoreTest > testBackgroundUpdateTargetState STARTED

org.apache.kafka.connect.storage.KafkaConfigBackingStoreTest > testBackgroundUpdateTargetState PASSED

org.apache.kafka.connect.storage.KafkaConfigBackingStoreTest > testBackgroundConnectorDeletion STARTED

org.apache.kafka.connect.storage.KafkaConfigBackingStoreTest > testBackgroundConnectorDeletion PASSED

org.apache.kafka.connect.storage.KafkaConfigBackingStoreTest > testRestoreTargetStateUnexpectedDeletion STARTED

org.apache.kafka.connect.storage.KafkaConfigBackingStoreTest > testRestoreTargetStateUnexpectedDeletion PASSED

org.apache.kafka.connect.storage.KafkaConfigBackingStoreTest > testRestore STARTED

org.apache.kafka.connect.storage.KafkaConfigBackingStoreTest > testRestore PASSED

org.apache.kafka.connect.storage.KafkaConfigBackingStoreTest > testRestoreConnectorDeletion STARTED

org.apache.kafka.connect.storage.KafkaConfigBackingStoreTest > testRestoreConnectorDeletion PASSED

org.apache.kafka.connect.storage.KafkaConfigBackingStoreTest > testRestoreZeroTasks STARTED

org.apache.kafka.connect.storage.KafkaConfigBackingStoreTest > testRestoreZeroTasks PASSED

org.apache.kafka.connect.storage.KafkaConfigBackingStoreTest > testPutTaskConfigsDoesNotResolveAllInconsistencies STARTED

org.apache.kafka.connect.storage.KafkaConfigBackingStoreTest > testPutTaskConfigsDoesNotResolveAllInconsistencies PASSED

org.apache.kafka.connect.storage.KafkaConfigBackingStoreTest > testPutTaskConfigsZeroTasks STARTED

org.apache.kafka.connect.storage.KafkaConfigBackingStoreTest > testPutTaskConfigsZeroTasks PASSED

org.apache.kafka.connect.storage.KafkaConfigBackingStoreTest > testRestoreTargetState STARTED

org.apache.kafka.connect.storage.KafkaConfigBackingStoreTest > testRestoreTargetState PASSED

org.apache.kafka.connect.storage.FileOffsetBackingStoreTest > testSaveRestore STARTED

org.apache.kafka.connect.storage.FileOffsetBackingStoreTest > testSaveRestore PASSED

org.apache.kafka.connect.storage.FileOffsetBackingStoreTest > testGetSet STARTED

org.apache.kafka.connect.storage.FileOffsetBackingStoreTest > testGetSet PASSED

org.apache.kafka.connect.util.KafkaBasedLogTest > testStartStop STARTED

org.apache.kafka.connect.util.KafkaBasedLogTest > testStartStop PASSED

org.apache.kafka.connect.util.KafkaBasedLogTest > testReloadOnStart STARTED

org.apache.kafka.connect.util.KafkaBasedLogTest > testReloadOnStart PASSED

org.apache.kafka.connect.util.KafkaBasedLogTest > testSendAndReadToEnd STARTED

org.apache.kafka.connect.util.KafkaBasedLogTest > testSendAndReadToEnd PASSED

org.apache.kafka.connect.util.KafkaBasedLogTest > testConsumerError STARTED

org.apache.kafka.connect.util.KafkaBasedLogTest > testConsumerError PASSED

org.apache.kafka.connect.util.KafkaBasedLogTest > testProducerError STARTED

org.apache.kafka.connect.util.KafkaBasedLogTest > testProducerError PASSED

org.apache.kafka.connect.util.TableTest > basicOperations STARTED

org.apache.kafka.connect.util.TableTest > basicOperations PASSED

org.apache.kafka.connect.util.ShutdownableThreadTest > testGracefulShutdown STARTED

org.apache.kafka.connect.util.ShutdownableThreadTest > testGracefulShutdown PASSED

org.apache.kafka.connect.util.ShutdownableThreadTest > testForcibleShutdown STARTED

org.apache.kafka.connect.util.ShutdownableThreadTest > testForcibleShutdown PASSED

177 tests completed, 1 failed
:connect:runtime:test FAILED

FAILURE: Build failed with an exception.

* What went wrong:
Execution failed for task ':connect:runtime:test'.
> There were failing tests. See the report at: file://<https://builds.apache.org/job/kafka-trunk-jdk8/ws/connect/runtime/build/reports/tests/test/index.html>

* Try:
Run with --stacktrace option to get the stack trace. Run with --info or --debug option to get more log output.

BUILD FAILED

Total time: 2 hrs 0 mins 14.69 secs
Build step 'Execute shell' marked build as failure
Recording test results
Setting GRADLE_2_4_RC_2_HOME=/home/jenkins/jenkins-slave/tools/hudson.plugins.gradle.GradleInstallation/Gradle_2.4-rc-2
Setting GRADLE_2_4_RC_2_HOME=/home/jenkins/jenkins-slave/tools/hudson.plugins.gradle.GradleInstallation/Gradle_2.4-rc-2

Jenkins build is back to normal : kafka-trunk-jdk8 #875

Posted by Apache Jenkins Server <je...@builds.apache.org>.
See <https://builds.apache.org/job/kafka-trunk-jdk8/875/changes>