You are viewing a plain text version of this content. The canonical link for it is here.
Posted to builds@hbase.apache.org by Apache Jenkins Server <je...@builds.apache.org> on 2015/10/13 20:01:00 UTC

Build failed in Jenkins: HBase-TRUNK #6903

See <https://builds.apache.org/job/HBase-TRUNK/6903/changes>

Changes:

[stack] HBASE-14593 Add more info on zombies to test-patch.sh; ADD EVEN MORE

------------------------------------------
[...truncated 5340 lines...]
Running org.apache.hadoop.hbase.replication.regionserver.TestReplicationSink
Tests run: 5, Failures: 0, Errors: 0, Skipped: 0, Time elapsed: 6.188 sec - in org.apache.hadoop.hbase.replication.regionserver.TestReplicationSourceManager
Tests run: 5, Failures: 0, Errors: 0, Skipped: 0, Time elapsed: 2.926 sec - in org.apache.hadoop.hbase.replication.regionserver.TestReplicationSink
Running org.apache.hadoop.hbase.replication.regionserver.TestReplicationWALReaderManager
Running org.apache.hadoop.hbase.replication.regionserver.TestRegionReplicaReplicationEndpoint
Tests run: 1, Failures: 0, Errors: 0, Skipped: 0, Time elapsed: 67.1 sec - in org.apache.hadoop.hbase.replication.multiwal.TestReplicationSyncUpToolWithMultipleWAL
Tests run: 2, Failures: 0, Errors: 0, Skipped: 0, Time elapsed: 46.961 sec - in org.apache.hadoop.hbase.replication.TestPerTableCFReplication
Running org.apache.hadoop.hbase.replication.TestReplicationSource
Tests run: 1, Failures: 0, Errors: 0, Skipped: 0, Time elapsed: 0.45 sec - in org.apache.hadoop.hbase.replication.TestReplicationSource
Running org.apache.hadoop.hbase.replication.regionserver.TestRegionReplicaReplicationEndpointNoMaster
Running org.apache.hadoop.hbase.replication.TestReplicationChangingPeerRegionservers
Tests run: 1, Failures: 0, Errors: 0, Skipped: 0, Time elapsed: 6.863 sec - in org.apache.hadoop.hbase.replication.TestReplicationChangingPeerRegionservers
Tests run: 4, Failures: 0, Errors: 0, Skipped: 0, Time elapsed: 58.011 sec - in org.apache.hadoop.hbase.replication.regionserver.TestRegionReplicaReplicationEndpointNoMaster
Tests run: 7, Failures: 0, Errors: 0, Skipped: 0, Time elapsed: 386.504 sec - in org.apache.hadoop.hbase.mapred.TestTableSnapshotInputFormat
Running org.apache.hadoop.hbase.replication.TestMultiSlaveReplication
Running org.apache.hadoop.hbase.replication.TestReplicationSyncUpTool
Running org.apache.hadoop.hbase.replication.TestReplicationKillMasterRS
Tests run: 9, Failures: 0, Errors: 0, Skipped: 0, Time elapsed: 155.566 sec - in org.apache.hadoop.hbase.replication.regionserver.TestRegionReplicaReplicationEndpoint
Tests run: 1, Failures: 0, Errors: 0, Skipped: 0, Time elapsed: 37.924 sec - in org.apache.hadoop.hbase.replication.TestReplicationKillMasterRS
Tests run: 1, Failures: 0, Errors: 0, Skipped: 0, Time elapsed: 60.474 sec - in org.apache.hadoop.hbase.replication.TestMultiSlaveReplication
Running org.apache.hadoop.hbase.replication.TestReplicationStateZKImpl
Tests run: 1, Failures: 0, Errors: 0, Skipped: 0, Time elapsed: 68.738 sec - in org.apache.hadoop.hbase.replication.TestReplicationSyncUpTool
Tests run: 6, Failures: 0, Errors: 0, Skipped: 0, Time elapsed: 7.343 sec - in org.apache.hadoop.hbase.replication.TestReplicationStateZKImpl
Running org.apache.hadoop.hbase.replication.TestMasterReplication
Running org.apache.hadoop.hbase.replication.TestReplicationWithTags
Tests run: 1, Failures: 0, Errors: 0, Skipped: 0, Time elapsed: 3.299 sec - in org.apache.hadoop.hbase.replication.TestReplicationWithTags
Running org.apache.hadoop.hbase.util.TestMergeTool
Running org.apache.hadoop.hbase.replication.TestReplicationKillSlaveRS
Running org.apache.hadoop.hbase.replication.TestReplicationSmallTests
Tests run: 1, Failures: 0, Errors: 0, Skipped: 0, Time elapsed: 28.575 sec - in org.apache.hadoop.hbase.util.TestMergeTool
Running org.apache.hadoop.hbase.util.TestFSTableDescriptors
Tests run: 1, Failures: 0, Errors: 0, Skipped: 0, Time elapsed: 27.048 sec - in org.apache.hadoop.hbase.replication.TestReplicationKillSlaveRS
Tests run: 16, Failures: 0, Errors: 0, Skipped: 0, Time elapsed: 3.003 sec - in org.apache.hadoop.hbase.util.TestFSTableDescriptors
Running org.apache.hadoop.hbase.util.TestHBaseFsckEncryption
Running org.apache.hadoop.hbase.util.TestConnectionCache
Tests run: 1, Failures: 0, Errors: 0, Skipped: 0, Time elapsed: 28.671 sec - in org.apache.hadoop.hbase.util.TestHBaseFsckEncryption
Tests run: 1, Failures: 0, Errors: 0, Skipped: 0, Time elapsed: 30.641 sec - in org.apache.hadoop.hbase.util.TestConnectionCache
Running org.apache.hadoop.hbase.util.TestIdLock
Running org.apache.hadoop.hbase.util.TestMiniClusterLoadSequential
Tests run: 1, Failures: 0, Errors: 0, Skipped: 0, Time elapsed: 15.156 sec - in org.apache.hadoop.hbase.util.TestIdLock
Running org.apache.hadoop.hbase.util.TestMergeTable
Tests run: 10, Failures: 0, Errors: 0, Skipped: 0, Time elapsed: 76.184 sec - in org.apache.hadoop.hbase.replication.TestReplicationSmallTests
Running org.apache.hadoop.hbase.util.TestMiniClusterLoadParallel
Tests run: 3, Failures: 0, Errors: 0, Skipped: 0, Time elapsed: 132.322 sec - in org.apache.hadoop.hbase.replication.TestMasterReplication
Tests run: 8, Failures: 0, Errors: 0, Skipped: 0, Time elapsed: 351.193 sec - in org.apache.hadoop.hbase.replication.regionserver.TestReplicationWALReaderManager
Tests run: 1, Failures: 0, Errors: 0, Skipped: 0, Time elapsed: 38.995 sec - in org.apache.hadoop.hbase.util.TestMergeTable
Running org.apache.hadoop.hbase.util.TestFSUtils
Running org.apache.hadoop.hbase.util.TestHBaseFsck
Tests run: 4, Failures: 0, Errors: 0, Skipped: 0, Time elapsed: 74.92 sec - in org.apache.hadoop.hbase.util.TestMiniClusterLoadSequential
Running org.apache.hadoop.hbase.util.TestTableName
Tests run: 6, Failures: 0, Errors: 0, Skipped: 0, Time elapsed: 0.489 sec - in org.apache.hadoop.hbase.util.TestTableName
Running org.apache.hadoop.hbase.util.TestRegionSplitter
Running org.apache.hadoop.hbase.util.TestMiniClusterLoadEncoded
Tests run: 6, Failures: 0, Errors: 0, Skipped: 0, Time elapsed: 11.414 sec - in org.apache.hadoop.hbase.util.TestRegionSplitter
Tests run: 11, Failures: 0, Errors: 0, Skipped: 0, Time elapsed: 35.403 sec - in org.apache.hadoop.hbase.util.TestFSUtils
Running org.apache.hadoop.hbase.util.TestFSVisitor
Tests run: 1, Failures: 0, Errors: 0, Skipped: 0, Time elapsed: 2.331 sec - in org.apache.hadoop.hbase.util.TestFSVisitor
Running org.apache.hadoop.hbase.util.hbck.TestOfflineMetaRebuildBase
Tests run: 4, Failures: 0, Errors: 0, Skipped: 0, Time elapsed: 75.749 sec - in org.apache.hadoop.hbase.util.TestMiniClusterLoadParallel
Running org.apache.hadoop.hbase.util.hbck.TestOfflineMetaRebuildOverlap
Running org.apache.hadoop.hbase.util.TestCoprocessorScanPolicy
Tests run: 4, Failures: 0, Errors: 0, Skipped: 0, Time elapsed: 22.524 sec - in org.apache.hadoop.hbase.util.TestCoprocessorScanPolicy
Running org.apache.hadoop.hbase.util.hbck.TestOfflineMetaRebuildHole
Tests run: 1, Failures: 0, Errors: 0, Skipped: 0, Time elapsed: 42.628 sec - in org.apache.hadoop.hbase.util.hbck.TestOfflineMetaRebuildBase
Tests run: 1, Failures: 0, Errors: 0, Skipped: 0, Time elapsed: 38.946 sec - in org.apache.hadoop.hbase.util.hbck.TestOfflineMetaRebuildOverlap
Running org.apache.hadoop.hbase.util.TestDefaultEnvironmentEdge
Tests run: 1, Failures: 0, Errors: 0, Skipped: 0, Time elapsed: 0.26 sec - in org.apache.hadoop.hbase.util.TestDefaultEnvironmentEdge
Running org.apache.hadoop.hbase.util.TestFSHDFSUtils
Tests run: 3, Failures: 0, Errors: 0, Skipped: 0, Time elapsed: 8.527 sec - in org.apache.hadoop.hbase.util.TestFSHDFSUtils
Tests run: 5, Failures: 0, Errors: 0, Skipped: 0, Time elapsed: 87.521 sec - in org.apache.hadoop.hbase.util.TestMiniClusterLoadEncoded
Running org.apache.hadoop.hbase.TestMetaTableAccessorNoCluster
Tests run: 2, Failures: 0, Errors: 0, Skipped: 0, Time elapsed: 4.426 sec - in org.apache.hadoop.hbase.TestMetaTableAccessorNoCluster
Tests run: 1, Failures: 0, Errors: 0, Skipped: 0, Time elapsed: 36.315 sec - in org.apache.hadoop.hbase.util.hbck.TestOfflineMetaRebuildHole
Running org.apache.hadoop.hbase.mob.TestExpiredMobFileCleaner
Running org.apache.hadoop.hbase.TestNamespace
Running org.apache.hadoop.hbase.mob.mapreduce.TestMobSweepReducer
Running org.apache.hadoop.hbase.mob.mapreduce.TestMobSweepJob
Tests run: 3, Failures: 0, Errors: 0, Skipped: 0, Time elapsed: 2.866 sec - in org.apache.hadoop.hbase.mob.mapreduce.TestMobSweepJob
Tests run: 1, Failures: 0, Errors: 0, Skipped: 0, Time elapsed: 31.37 sec - in org.apache.hadoop.hbase.mob.TestExpiredMobFileCleaner
Tests run: 1, Failures: 0, Errors: 0, Skipped: 0, Time elapsed: 14.782 sec - in org.apache.hadoop.hbase.mob.mapreduce.TestMobSweepReducer
Running org.apache.hadoop.hbase.mob.compactions.TestPartitionedMobCompactor
Running org.apache.hadoop.hbase.mob.compactions.TestMobCompactor
Running org.apache.hadoop.hbase.mob.TestDefaultMobStoreFlusher
Tests run: 2, Failures: 0, Errors: 0, Skipped: 0, Time elapsed: 8.887 sec - in org.apache.hadoop.hbase.mob.TestDefaultMobStoreFlusher
Tests run: 6, Failures: 0, Errors: 0, Skipped: 0, Time elapsed: 17.943 sec - in org.apache.hadoop.hbase.mob.compactions.TestPartitionedMobCompactor
Tests run: 8, Failures: 0, Errors: 0, Skipped: 0, Time elapsed: 69.467 sec - in org.apache.hadoop.hbase.TestNamespace
Running org.apache.hadoop.hbase.mob.TestMobDataBlockEncoding
Running org.apache.hadoop.hbase.TestInfoServers
Tests run: 3, Failures: 0, Errors: 0, Skipped: 0, Time elapsed: 6.574 sec - in org.apache.hadoop.hbase.TestInfoServers
Running org.apache.hadoop.hbase.TestMetaTableAccessor
Tests run: 1, Failures: 0, Errors: 0, Skipped: 0, Time elapsed: 18.461 sec - in org.apache.hadoop.hbase.mob.TestMobDataBlockEncoding
Tests run: 14, Failures: 0, Errors: 0, Skipped: 0, Time elapsed: 28.798 sec - in org.apache.hadoop.hbase.TestMetaTableAccessor
Tests run: 5, Failures: 0, Errors: 0, Skipped: 0, Time elapsed: 99.712 sec - in org.apache.hadoop.hbase.mob.compactions.TestMobCompactor
Tests run: 52, Failures: 0, Errors: 0, Skipped: 1, Time elapsed: 530.329 sec - in org.apache.hadoop.hbase.util.TestHBaseFsck

Results :

Tests in error: 
  TestWALProcedureStoreOnHDFS.testWalRollOnLowReplication:190 ? Runtime sync abo...

Tests run: 2559, Failures: 0, Errors: 1, Skipped: 59

[INFO] ------------------------------------------------------------------------
[INFO] Reactor Summary:
[INFO] 
[INFO] Apache HBase ...................................... SUCCESS [  2.679 s]
[INFO] Apache HBase - Checkstyle ......................... SUCCESS [  1.367 s]
[INFO] Apache HBase - Resource Bundle .................... SUCCESS [  0.405 s]
[INFO] Apache HBase - Annotations ........................ SUCCESS [  0.491 s]
[INFO] Apache HBase - Protocol ........................... SUCCESS [  4.586 s]
[INFO] Apache HBase - Common ............................. SUCCESS [02:37 min]
[INFO] Apache HBase - Procedure .......................... SUCCESS [02:03 min]
[INFO] Apache HBase - Client ............................. SUCCESS [02:05 min]
[INFO] Apache HBase - Hadoop Compatibility ............... SUCCESS [ 13.619 s]
[INFO] Apache HBase - Hadoop Two Compatibility ........... SUCCESS [ 18.741 s]
[INFO] Apache HBase - Prefix Tree ........................ SUCCESS [ 22.353 s]
[INFO] Apache HBase - Server ............................. FAILURE [  02:33 h]
[INFO] Apache HBase - Testing Util ....................... SKIPPED
[INFO] Apache HBase - Thrift ............................. SKIPPED
[INFO] Apache HBase - Shell .............................. SKIPPED
[INFO] Apache HBase - Integration Tests .................. SKIPPED
[INFO] Apache HBase - Examples ........................... SKIPPED
[INFO] Apache HBase - Rest ............................... SKIPPED
[INFO] Apache HBase - External Block Cache ............... SKIPPED
[INFO] Apache HBase - Assembly ........................... SKIPPED
[INFO] Apache HBase - Shaded ............................. SKIPPED
[INFO] Apache HBase - Shaded - Client .................... SKIPPED
[INFO] Apache HBase - Shaded - Server .................... SKIPPED
[INFO] Apache HBase - Spark .............................. SKIPPED
[INFO] ------------------------------------------------------------------------
[INFO] BUILD FAILURE
[INFO] ------------------------------------------------------------------------
[INFO] Total time: 02:41 h
[INFO] Finished at: 2015-10-13T17:58:44+00:00
[INFO] Final Memory: 59M/563M
[INFO] ------------------------------------------------------------------------
[ERROR] Failed to execute goal org.apache.maven.plugins:maven-surefire-plugin:2.18.1:test (secondPartTestsExecution) on project hbase-server: There are test failures.
[ERROR] 
[ERROR] Please refer to /x1/jenkins/jenkins-slave/workspace/HBase-TRUNK/hbase-server/target/surefire-reports for the individual test results.
[ERROR] -> [Help 1]
[ERROR] 
[ERROR] To see the full stack trace of the errors, re-run Maven with the -e switch.
[ERROR] Re-run Maven using the -X switch to enable full debug logging.
[ERROR] 
[ERROR] For more information about the errors and possible solutions, please read the following articles:
[ERROR] [Help 1] http://cwiki.apache.org/confluence/display/MAVEN/MojoFailureException
[ERROR] 
[ERROR] After correcting the problems, you can resume the build with the command
[ERROR]   mvn <goals> -rf :hbase-server
Build step 'Invoke top-level Maven targets' marked build as failure
Performing Post build task...
Match found for :.* : True
Logical operation result is TRUE
Running script  :   ZOMBIE_TESTS_COUNT=`jps | grep surefirebooter | wc -l`
  if [[ $ZOMBIE_TESTS_COUNT != 0 ]] ; then
    #It seems sometimes the tests are not dying immediately. Let's give them 10s
    echo "Suspicious java process found - waiting 10s to see if there are just slow to stop"
    sleep 10   
    ZOMBIE_TESTS_COUNT=`jps | grep surefirebooter | wc -l`
    if [[ $ZOMBIE_TESTS_COUNT != 0 ]] ; then
      echo "There are $ZOMBIE_TESTS_COUNT zombie tests, they should have been killed by surefire but survived"
      echo "************ BEGIN zombies jstack extract"
      ZB_STACK=`jps | grep surefirebooter | cut -d ' ' -f 1 | xargs -n 1 jstack | grep ".test" | grep "\.java"`
      jps | grep surefirebooter | cut -d ' ' -f 1 | xargs -n 1 jstack
      echo "************ END  zombies jstack extract"
      JIRA_COMMENT="$JIRA_COMMENT

     {color:red}-1 core zombie tests{color}.  There are ${ZOMBIE_TESTS_COUNT} zombie test(s): ${ZB_STACK}"
      BAD=1
      jps | grep surefirebooter | cut -d ' ' -f 1 | xargs kill -9
    else
      echo "We're ok: there is no zombie test, but some tests took some time to stop"
    fi
  else
    echo "We're ok: there is no zombie test"
  fi
[HBase-TRUNK] $ /bin/bash -xe /tmp/hudson7664534325214877831.sh
++ wc -l
++ grep surefirebooter
++ jps
+ ZOMBIE_TESTS_COUNT=0
+ [[ 0 != 0 ]]
+ echo 'We'\''re ok: there is no zombie test'
We're ok: there is no zombie test
POST BUILD TASK : SUCCESS
END OF POST BUILD TASK : 0
Archiving artifacts
Recording test results
[FINDBUGS] Collecting findbugs analysis files...
[FINDBUGS] Finding all files that match the pattern **/findbugs.xml,**/findbugsXml.xml
[FINDBUGS] Parsing 28 files in <https://builds.apache.org/job/HBase-TRUNK/ws/>
[FINDBUGS] Successfully parsed file <https://builds.apache.org/job/HBase-TRUNK/6903/artifact/hbase-annotations/target/findbugs.xml> with 0 unique warnings and 0 duplicates.
[FINDBUGS] Successfully parsed file <https://builds.apache.org/job/HBase-TRUNK/6903/artifact/hbase-annotations/target/findbugsXml.xml> with 0 unique warnings and 0 duplicates.
[FINDBUGS] Successfully parsed file <https://builds.apache.org/job/HBase-TRUNK/6903/artifact/hbase-client/target/findbugs.xml> with 0 unique warnings and 0 duplicates.
[FINDBUGS] Successfully parsed file <https://builds.apache.org/job/HBase-TRUNK/6903/artifact/hbase-client/target/findbugsXml.xml> with 13 unique warnings and 0 duplicates.
[FINDBUGS] Successfully parsed file <https://builds.apache.org/job/HBase-TRUNK/6903/artifact/hbase-common/target/findbugs.xml> with 13 unique warnings and 0 duplicates.
[FINDBUGS] Successfully parsed file <https://builds.apache.org/job/HBase-TRUNK/6903/artifact/hbase-common/target/findbugsXml.xml> with 21 unique warnings and 0 duplicates.
[FINDBUGS] Successfully parsed file <https://builds.apache.org/job/HBase-TRUNK/6903/artifact/hbase-examples/target/findbugs.xml> with 21 unique warnings and 0 duplicates.
[FINDBUGS] Successfully parsed file <https://builds.apache.org/job/HBase-TRUNK/6903/artifact/hbase-examples/target/findbugsXml.xml> with 21 unique warnings and 0 duplicates.
[FINDBUGS] Successfully parsed file <https://builds.apache.org/job/HBase-TRUNK/6903/artifact/hbase-external-blockcache/target/findbugs.xml> with 21 unique warnings and 0 duplicates.
[FINDBUGS] Successfully parsed file <https://builds.apache.org/job/HBase-TRUNK/6903/artifact/hbase-external-blockcache/target/findbugsXml.xml> with 21 unique warnings and 0 duplicates.
[FINDBUGS] Successfully parsed file <https://builds.apache.org/job/HBase-TRUNK/6903/artifact/hbase-hadoop-compat/target/findbugs.xml> with 21 unique warnings and 0 duplicates.
[FINDBUGS] Successfully parsed file <https://builds.apache.org/job/HBase-TRUNK/6903/artifact/hbase-hadoop-compat/target/findbugsXml.xml> with 21 unique warnings and 0 duplicates.
[FINDBUGS] Successfully parsed file <https://builds.apache.org/job/HBase-TRUNK/6903/artifact/hbase-hadoop2-compat/target/findbugs.xml> with 21 unique warnings and 0 duplicates.
[FINDBUGS] Successfully parsed file <https://builds.apache.org/job/HBase-TRUNK/6903/artifact/hbase-hadoop2-compat/target/findbugsXml.xml> with 21 unique warnings and 0 duplicates.
[FINDBUGS] Successfully parsed file <https://builds.apache.org/job/HBase-TRUNK/6903/artifact/hbase-prefix-tree/target/findbugs.xml> with 21 unique warnings and 0 duplicates.
[FINDBUGS] Successfully parsed file <https://builds.apache.org/job/HBase-TRUNK/6903/artifact/hbase-prefix-tree/target/findbugsXml.xml> with 22 unique warnings and 0 duplicates.
[FINDBUGS] Successfully parsed file <https://builds.apache.org/job/HBase-TRUNK/6903/artifact/hbase-procedure/target/findbugs.xml> with 22 unique warnings and 0 duplicates.
[FINDBUGS] Successfully parsed file <https://builds.apache.org/job/HBase-TRUNK/6903/artifact/hbase-procedure/target/findbugsXml.xml> with 23 unique warnings and 0 duplicates.
[FINDBUGS] Successfully parsed file <https://builds.apache.org/job/HBase-TRUNK/6903/artifact/hbase-protocol/target/findbugs.xml> with 23 unique warnings and 0 duplicates.
[FINDBUGS] Successfully parsed file <https://builds.apache.org/job/HBase-TRUNK/6903/artifact/hbase-protocol/target/findbugsXml.xml> with 23 unique warnings and 0 duplicates.
[FINDBUGS] Successfully parsed file <https://builds.apache.org/job/HBase-TRUNK/6903/artifact/hbase-rest/target/findbugs.xml> with 23 unique warnings and 0 duplicates.
[FINDBUGS] Successfully parsed file <https://builds.apache.org/job/HBase-TRUNK/6903/artifact/hbase-rest/target/findbugsXml.xml> with 25 unique warnings and 0 duplicates.
[FINDBUGS] Successfully parsed file <https://builds.apache.org/job/HBase-TRUNK/6903/artifact/hbase-server/target/findbugs.xml> with 25 unique warnings and 0 duplicates.
[FINDBUGS] Successfully parsed file <https://builds.apache.org/job/HBase-TRUNK/6903/artifact/hbase-server/target/findbugsXml.xml> with 101 unique warnings and 1 duplicate.
[FINDBUGS] Successfully parsed file <https://builds.apache.org/job/HBase-TRUNK/6903/artifact/hbase-spark/target/findbugs.xml> with 101 unique warnings and 0 duplicates.
[FINDBUGS] Successfully parsed file <https://builds.apache.org/job/HBase-TRUNK/6903/artifact/hbase-spark/target/findbugsXml.xml> with 132 unique warnings and 0 duplicates.
[FINDBUGS] Successfully parsed file <https://builds.apache.org/job/HBase-TRUNK/6903/artifact/hbase-thrift/target/findbugs.xml> with 132 unique warnings and 0 duplicates.
[FINDBUGS] Successfully parsed file <https://builds.apache.org/job/HBase-TRUNK/6903/artifact/hbase-thrift/target/findbugsXml.xml> with 132 unique warnings and 0 duplicates.
[FINDBUGS] Computing warning deltas based on reference build #6882
[CHECKSTYLE] Collecting checkstyle analysis files...
[CHECKSTYLE] Finding all files that match the pattern **/checkstyle-result.xml
[CHECKSTYLE] Parsing 24 files in <https://builds.apache.org/job/HBase-TRUNK/ws/>
[CHECKSTYLE] Successfully parsed file <https://builds.apache.org/job/HBase-TRUNK/6903/artifact/hbase-annotations/target/checkstyle-result.xml> with 0 unique warnings and 0 duplicates.
[CHECKSTYLE] Successfully parsed file <https://builds.apache.org/job/HBase-TRUNK/6903/artifact/hbase-assembly/target/checkstyle-result.xml> with 0 unique warnings and 0 duplicates.
[CHECKSTYLE] Successfully parsed file <https://builds.apache.org/job/HBase-TRUNK/6903/artifact/hbase-checkstyle/target/checkstyle-result.xml> with 0 unique warnings and 0 duplicates.
[CHECKSTYLE] Successfully parsed file <https://builds.apache.org/job/HBase-TRUNK/6903/artifact/hbase-client/target/checkstyle-result.xml> with 203 unique warnings and 0 duplicates.
[CHECKSTYLE] Successfully parsed file <https://builds.apache.org/job/HBase-TRUNK/6903/artifact/hbase-common/target/checkstyle-result.xml> with 303 unique warnings and 0 duplicates.
[CHECKSTYLE] Successfully parsed file <https://builds.apache.org/job/HBase-TRUNK/6903/artifact/hbase-examples/target/checkstyle-result.xml> with 331 unique warnings and 0 duplicates.
[CHECKSTYLE] Successfully parsed file <https://builds.apache.org/job/HBase-TRUNK/6903/artifact/hbase-external-blockcache/target/checkstyle-result.xml> with 331 unique warnings and 0 duplicates.
[CHECKSTYLE] Successfully parsed file <https://builds.apache.org/job/HBase-TRUNK/6903/artifact/hbase-hadoop-compat/target/checkstyle-result.xml> with 333 unique warnings and 0 duplicates.
[CHECKSTYLE] Successfully parsed file <https://builds.apache.org/job/HBase-TRUNK/6903/artifact/hbase-hadoop2-compat/target/checkstyle-result.xml> with 364 unique warnings and 0 duplicates.
[CHECKSTYLE] Successfully parsed file <https://builds.apache.org/job/HBase-TRUNK/6903/artifact/hbase-it/target/checkstyle-result.xml> with 364 unique warnings and 0 duplicates.
[CHECKSTYLE] Successfully parsed file <https://builds.apache.org/job/HBase-TRUNK/6903/artifact/hbase-prefix-tree/target/checkstyle-result.xml> with 380 unique warnings and 0 duplicates.
[CHECKSTYLE] Successfully parsed file <https://builds.apache.org/job/HBase-TRUNK/6903/artifact/hbase-procedure/target/checkstyle-result.xml> with 380 unique warnings and 0 duplicates.
[CHECKSTYLE] Successfully parsed file <https://builds.apache.org/job/HBase-TRUNK/6903/artifact/hbase-protocol/target/checkstyle-result.xml> with 382 unique warnings and 0 duplicates.
[CHECKSTYLE] Successfully parsed file <https://builds.apache.org/job/HBase-TRUNK/6903/artifact/hbase-resource-bundle/target/checkstyle-result.xml> with 382 unique warnings and 0 duplicates.
[CHECKSTYLE] Successfully parsed file <https://builds.apache.org/job/HBase-TRUNK/6903/artifact/hbase-rest/target/checkstyle-result.xml> with 424 unique warnings and 0 duplicates.
[CHECKSTYLE] Successfully parsed file <https://builds.apache.org/job/HBase-TRUNK/6903/artifact/hbase-server/target/checkstyle-result.xml> with 1730 unique warnings and 0 duplicates.
[CHECKSTYLE] Successfully parsed file <https://builds.apache.org/job/HBase-TRUNK/6903/artifact/hbase-shaded/hbase-shaded-client/target/checkstyle-result.xml> with 1730 unique warnings and 0 duplicates.
[CHECKSTYLE] Successfully parsed file <https://builds.apache.org/job/HBase-TRUNK/6903/artifact/hbase-shaded/hbase-shaded-server/target/checkstyle-result.xml> with 1730 unique warnings and 0 duplicates.
[CHECKSTYLE] Successfully parsed file <https://builds.apache.org/job/HBase-TRUNK/6903/artifact/hbase-shaded/target/checkstyle-result.xml> with 1730 unique warnings and 0 duplicates.
[CHECKSTYLE] Successfully parsed file <https://builds.apache.org/job/HBase-TRUNK/6903/artifact/hbase-shell/target/checkstyle-result.xml> with 1730 unique warnings and 0 duplicates.
[CHECKSTYLE] Successfully parsed file <https://builds.apache.org/job/HBase-TRUNK/6903/artifact/hbase-spark/target/checkstyle-result.xml> with 1730 unique warnings and 0 duplicates.
[CHECKSTYLE] Successfully parsed file <https://builds.apache.org/job/HBase-TRUNK/6903/artifact/hbase-testing-util/target/checkstyle-result.xml> with 1730 unique warnings and 0 duplicates.
[CHECKSTYLE] Successfully parsed file <https://builds.apache.org/job/HBase-TRUNK/6903/artifact/hbase-thrift/target/checkstyle-result.xml> with 1752 unique warnings and 0 duplicates.
[CHECKSTYLE] Successfully parsed file <https://builds.apache.org/job/HBase-TRUNK/6903/artifact/target/checkstyle-result.xml> with 1752 unique warnings and 0 duplicates.
[CHECKSTYLE] Computing warning deltas based on reference build #6882
Updating HBASE-14593

Jenkins build is back to normal : HBase-TRUNK #6905

Posted by Apache Jenkins Server <je...@builds.apache.org>.
See <https://builds.apache.org/job/HBase-TRUNK/6905/changes>


Re: Build failed in Jenkins: HBase-TRUNK #6904

Posted by Stack <st...@duboce.net>.
Error'd out.

St.Ack

[ERROR] Failed to execute goal
org.apache.maven.plugins:maven-surefire-plugin:2.18.1:test
(default-test) on project hbase-server: ExecutionException:
java.lang.RuntimeException: The forked VM terminated without properly
saying goodbye. VM crash or System.exit called?
[ERROR] Command was /bin/sh -c cd
/home/jenkins/jenkins-slave/workspace/HBase-TRUNK/hbase-server &&
/home/jenkins/jenkins-slave/tools/hudson.model.JDK/jdk-1.7u51/jre/bin/java
-enableassertions -Dhbase.test -Xmx2800m -XX:MaxPermSize=256m
-Djava.security.egd=file:/dev/./urandom
-Djava.net.preferIPv4Stack=true -Djava.awt.headless=true
'-javaagent:/home/jenkins/.m2/repository/org/jacoco/org.jacoco.agent/0.7.5.201505241946/org.jacoco.agent-0.7.5.201505241946-runtime.jar=destfile=/home/jenkins/jenkins-slave/workspace/HBase-TRUNK/hbase-server/target/jacoco.exec,excludes=**/generated/**/*.class'
-jar /home/jenkins/jenkins-slave/workspace/HBase-TRUNK/hbase-server/target/surefire/surefirebooter2785103537049341491.jar
/home/jenkins/jenkins-slave/workspace/HBase-TRUNK/hbase-server/target/surefire/surefire2760074544225477033tmp
/home/jenkins/jenkins-slave/workspace/HBase-TRUNK/hbase-server/target/surefire/surefire_241417963402301582665tmp
[ERROR] -> [Help 1]
[ERROR]
[ERROR] To see the full stack trace of the errors, re-run Maven with
the -e switch.
[ERROR] Re-run Maven using the -X switch to enable full debug logging.
[ERROR]
[ERROR] For more information about the errors and possible solutions,
please read the following articles:
[ERROR] [Help 1]
http://cwiki.apache.org/confluence/display/MAVEN/MojoFailureException
[ERROR]
[ERROR] After correcting the problems, you can resume the build with the command
[ERROR]   mvn <goals> -rf :hbase-server


On Tue, Oct 13, 2015 at 3:40 PM, Apache Jenkins Server <
jenkins@builds.apache.org> wrote:

> See <https://builds.apache.org/job/HBase-TRUNK/6904/changes>
>
> Changes:
>
> [stack] HBASE-14596 TestCellACLs failing... on1.2 builds; TUNEUP -- ADD
> DEBUG
>
> ------------------------------------------
> [...truncated 21955 lines...]
>         at
> org.apache.hadoop.ipc.Server$Listener$Reader.doRunLoop(Server.java:629)
>         - locked <0x0000000754b5b1f0> (a
> org.apache.hadoop.ipc.Server$Listener$Reader)
>         at
> org.apache.hadoop.ipc.Server$Listener$Reader.run(Server.java:608)
>
> "Timer-0" daemon prio=10 tid=0x00007f189d0b7000 nid=0x731d in
> Object.wait() [0x00007f186b35b000]
>    java.lang.Thread.State: TIMED_WAITING (on object monitor)
>         at java.lang.Object.wait(Native Method)
>         - waiting on <0x00000007dea32d60> (a java.util.TaskQueue)
>         at java.util.TimerThread.mainLoop(Timer.java:552)
>         - locked <0x00000007dea32d60> (a java.util.TaskQueue)
>         at java.util.TimerThread.run(Timer.java:505)
>
> "1125728581@qtp-1929057227-1 - Acceptor0
> HttpServer2$SelectChannelConnectorWithSafeStartup@localhost:59905" daemon
> prio=10 tid=0x00007f189d0a8000 nid=0x7311 runnable [0x00007f186b45c000]
>    java.lang.Thread.State: RUNNABLE
>         at sun.nio.ch.EPollArrayWrapper.epollWait(Native Method)
>         at sun.nio.ch.EPollArrayWrapper.poll(EPollArrayWrapper.java:269)
>         at sun.nio.ch.EPollSelectorImpl.doSelect(EPollSelectorImpl.java:79)
>         at sun.nio.ch.SelectorImpl.lockAndDoSelect(SelectorImpl.java:87)
>         - locked <0x00000007df3ecc50> (a sun.nio.ch.Util$2)
>         - locked <0x00000007df3ecc40> (a
> java.util.Collections$UnmodifiableSet)
>         - locked <0x00000007df3ec870> (a sun.nio.ch.EPollSelectorImpl)
>         at sun.nio.ch.SelectorImpl.select(SelectorImpl.java:98)
>         at
> org.mortbay.io.nio.SelectorManager$SelectSet.doSelect(SelectorManager.java:498)
>         at
> org.mortbay.io.nio.SelectorManager.doSelect(SelectorManager.java:192)
>         at
> org.mortbay.jetty.nio.SelectChannelConnector.accept(SelectChannelConnector.java:124)
>         at
> org.mortbay.jetty.AbstractConnector$Acceptor.run(AbstractConnector.java:708)
>         at
> org.mortbay.thread.QueuedThreadPool$PoolThread.run(QueuedThreadPool.java:582)
>
> "409910713@qtp-1929057227-0" daemon prio=10 tid=0x00007f189d0ae000
> nid=0x7310 in Object.wait() [0x00007f186b55d000]
>    java.lang.Thread.State: TIMED_WAITING (on object monitor)
>         at java.lang.Object.wait(Native Method)
>         - waiting on <0x00000007df3ec368> (a
> org.mortbay.thread.QueuedThreadPool$PoolThread)
>         at
> org.mortbay.thread.QueuedThreadPool$PoolThread.run(QueuedThreadPool.java:626)
>         - locked <0x00000007df3ec368> (a
> org.mortbay.thread.QueuedThreadPool$PoolThread)
>
> "pool-2-thread-1" prio=10 tid=0x00007f189d089000 nid=0x730f waiting on
> condition [0x00007f186bfc5000]
>    java.lang.Thread.State: TIMED_WAITING (parking)
>         at sun.misc.Unsafe.park(Native Method)
>         - parking to wait for  <0x00000007de9ef238> (a
> java.util.concurrent.locks.AbstractQueuedSynchronizer$ConditionObject)
>         at
> java.util.concurrent.locks.LockSupport.parkNanos(LockSupport.java:226)
>         at
> java.util.concurrent.locks.AbstractQueuedSynchronizer$ConditionObject.awaitNanos(AbstractQueuedSynchronizer.java:2082)
>         at
> java.util.concurrent.ScheduledThreadPoolExecutor$DelayedWorkQueue.take(ScheduledThreadPoolExecutor.java:1090)
>         at
> java.util.concurrent.ScheduledThreadPoolExecutor$DelayedWorkQueue.take(ScheduledThreadPoolExecutor.java:807)
>         at
> java.util.concurrent.ThreadPoolExecutor.getTask(ThreadPoolExecutor.java:1068)
>         at
> java.util.concurrent.ThreadPoolExecutor.runWorker(ThreadPoolExecutor.java:1130)
>         at
> java.util.concurrent.ThreadPoolExecutor$Worker.run(ThreadPoolExecutor.java:615)
>         at java.lang.Thread.run(Thread.java:744)
>
> "Timer for 'NameNode' metrics system" daemon prio=10
> tid=0x00007f189d022800 nid=0x730e in Object.wait() [0x00007f186b65e000]
>    java.lang.Thread.State: TIMED_WAITING (on object monitor)
>         at java.lang.Object.wait(Native Method)
>         - waiting on <0x0000000754f49338> (a java.util.TaskQueue)
>         at java.util.TimerThread.mainLoop(Timer.java:552)
>         - locked <0x0000000754f49338> (a java.util.TaskQueue)
>         at java.util.TimerThread.run(Timer.java:505)
>
> "process reaper" daemon prio=10 tid=0x00007f189c9fb800 nid=0x71e3 waiting
> on condition [0x00007f186bffe000]
>    java.lang.Thread.State: TIMED_WAITING (parking)
>         at sun.misc.Unsafe.park(Native Method)
>         - parking to wait for  <0x00000007dd588aa0> (a
> java.util.concurrent.SynchronousQueue$TransferStack)
>         at
> java.util.concurrent.locks.LockSupport.parkNanos(LockSupport.java:226)
>         at
> java.util.concurrent.SynchronousQueue$TransferStack.awaitFulfill(SynchronousQueue.java:460)
>         at
> java.util.concurrent.SynchronousQueue$TransferStack.transfer(SynchronousQueue.java:359)
>         at
> java.util.concurrent.SynchronousQueue.poll(SynchronousQueue.java:942)
>         at
> java.util.concurrent.ThreadPoolExecutor.getTask(ThreadPoolExecutor.java:1068)
>         at
> java.util.concurrent.ThreadPoolExecutor.runWorker(ThreadPoolExecutor.java:1130)
>         at
> java.util.concurrent.ThreadPoolExecutor$Worker.run(ThreadPoolExecutor.java:615)
>         at java.lang.Thread.run(Thread.java:744)
>
> "Service Thread" daemon prio=10 tid=0x00007f189c291000 nid=0x7153 runnable
> [0x0000000000000000]
>    java.lang.Thread.State: RUNNABLE
>
> "C2 CompilerThread1" daemon prio=10 tid=0x00007f189c28f000 nid=0x7152
> waiting on condition [0x0000000000000000]
>    java.lang.Thread.State: RUNNABLE
>
> "C2 CompilerThread0" daemon prio=10 tid=0x00007f189c28c000 nid=0x7151
> waiting on condition [0x0000000000000000]
>    java.lang.Thread.State: RUNNABLE
>
> "Signal Dispatcher" daemon prio=10 tid=0x00007f189c282000 nid=0x7150
> runnable [0x0000000000000000]
>    java.lang.Thread.State: RUNNABLE
>
> "Finalizer" daemon prio=10 tid=0x00007f189c26b000 nid=0x714e in
> Object.wait() [0x00007f18894d3000]
>    java.lang.Thread.State: WAITING (on object monitor)
>         at java.lang.Object.wait(Native Method)
>         - waiting on <0x00000007dd832630> (a
> java.lang.ref.ReferenceQueue$Lock)
>         at java.lang.ref.ReferenceQueue.remove(ReferenceQueue.java:135)
>         - locked <0x00000007dd832630> (a java.lang.ref.ReferenceQueue$Lock)
>         at java.lang.ref.ReferenceQueue.remove(ReferenceQueue.java:151)
>         at java.lang.ref.Finalizer$FinalizerThread.run(Finalizer.java:189)
>
> "Reference Handler" daemon prio=10 tid=0x00007f189c267000 nid=0x714d in
> Object.wait() [0x00007f18895d4000]
>    java.lang.Thread.State: WAITING (on object monitor)
>         at java.lang.Object.wait(Native Method)
>         - waiting on <0x00000007dd832280> (a java.lang.ref.Reference$Lock)
>         at java.lang.Object.wait(Object.java:503)
>         at java.lang.ref.Reference$ReferenceHandler.run(Reference.java:133)
>         - locked <0x00000007dd832280> (a java.lang.ref.Reference$Lock)
>
> "main" prio=10 tid=0x00007f189c00a800 nid=0x713a
> sleeping[0x00007f18a401b000]
>    java.lang.Thread.State: TIMED_WAITING (sleeping)
>         at java.lang.Thread.sleep(Native Method)
>         at
> org.apache.hadoop.hbase.util.JVMClusterUtil.startup(JVMClusterUtil.java:228)
>         at
> org.apache.hadoop.hbase.LocalHBaseCluster.startup(LocalHBaseCluster.java:448)
>         at
> org.apache.hadoop.hbase.MiniHBaseCluster.init(MiniHBaseCluster.java:225)
>         at
> org.apache.hadoop.hbase.MiniHBaseCluster.<init>(MiniHBaseCluster.java:94)
>         at
> org.apache.hadoop.hbase.HBaseTestingUtility.startMiniHBaseCluster(HBaseTestingUtility.java:1078)
>         at
> org.apache.hadoop.hbase.HBaseTestingUtility.startMiniCluster(HBaseTestingUtility.java:1038)
>         at
> org.apache.hadoop.hbase.HBaseTestingUtility.startMiniCluster(HBaseTestingUtility.java:910)
>         at
> org.apache.hadoop.hbase.HBaseTestingUtility.startMiniCluster(HBaseTestingUtility.java:892)
>         at
> org.apache.hadoop.hbase.HBaseTestingUtility.startMiniCluster(HBaseTestingUtility.java:879)
>         at
> org.apache.hadoop.hbase.client.TestCloneSnapshotFromClient.setUpBeforeClass(TestCloneSnapshotFromClient.java:76)
>         at sun.reflect.NativeMethodAccessorImpl.invoke0(Native Method)
>         at
> sun.reflect.NativeMethodAccessorImpl.invoke(NativeMethodAccessorImpl.java:57)
>         at
> sun.reflect.DelegatingMethodAccessorImpl.invoke(DelegatingMethodAccessorImpl.java:43)
>         at java.lang.reflect.Method.invoke(Method.java:606)
>         at
> org.junit.runners.model.FrameworkMethod$1.runReflectiveCall(FrameworkMethod.java:50)
>         at
> org.junit.internal.runners.model.ReflectiveCallable.run(ReflectiveCallable.java:12)
>         at
> org.junit.runners.model.FrameworkMethod.invokeExplosively(FrameworkMethod.java:47)
>         at
> org.junit.internal.runners.statements.RunBefores.evaluate(RunBefores.java:24)
>         at
> org.junit.internal.runners.statements.RunAfters.evaluate(RunAfters.java:27)
>         at org.junit.runners.ParentRunner.run(ParentRunner.java:363)
>         at org.junit.runners.Suite.runChild(Suite.java:128)
>         at org.junit.runners.Suite.runChild(Suite.java:27)
>         at org.junit.runners.ParentRunner$3.run(ParentRunner.java:290)
>         at org.junit.runners.ParentRunner$1.schedule(ParentRunner.java:71)
>         at
> org.junit.runners.ParentRunner.runChildren(ParentRunner.java:288)
>         at org.junit.runners.ParentRunner.access$000(ParentRunner.java:58)
>         at org.junit.runners.ParentRunner$2.evaluate(ParentRunner.java:268)
>         at org.junit.runners.ParentRunner.run(ParentRunner.java:363)
>         at org.junit.runner.JUnitCore.run(JUnitCore.java:137)
>         at org.junit.runner.JUnitCore.run(JUnitCore.java:115)
>         at
> org.apache.maven.surefire.junitcore.JUnitCoreWrapper.createRequestAndRun(JUnitCoreWrapper.java:108)
>         at
> org.apache.maven.surefire.junitcore.JUnitCoreWrapper.executeEager(JUnitCoreWrapper.java:78)
>         at
> org.apache.maven.surefire.junitcore.JUnitCoreWrapper.execute(JUnitCoreWrapper.java:54)
>         at
> org.apache.maven.surefire.junitcore.JUnitCoreProvider.invoke(JUnitCoreProvider.java:144)
>         at
> org.apache.maven.surefire.booter.ForkedBooter.invokeProviderInSameClassLoader(ForkedBooter.java:203)
>         at
> org.apache.maven.surefire.booter.ForkedBooter.runSuitesInProcess(ForkedBooter.java:155)
>         at
> org.apache.maven.surefire.booter.ForkedBooter.main(ForkedBooter.java:103)
>
> "VM Thread" prio=10 tid=0x00007f189c265000 nid=0x714c runnable
>
> "GC task thread#0 (ParallelGC)" prio=10 tid=0x00007f189c020800 nid=0x713b
> runnable
>
> "GC task thread#1 (ParallelGC)" prio=10 tid=0x00007f189c022000 nid=0x713c
> runnable
>
> "GC task thread#2 (ParallelGC)" prio=10 tid=0x00007f189c024000 nid=0x713d
> runnable
>
> "GC task thread#3 (ParallelGC)" prio=10 tid=0x00007f189c026000 nid=0x713e
> runnable
>
> "GC task thread#4 (ParallelGC)" prio=10 tid=0x00007f189c028000 nid=0x713f
> runnable
>
> "GC task thread#5 (ParallelGC)" prio=10 tid=0x00007f189c029800 nid=0x7140
> runnable
>
> "GC task thread#6 (ParallelGC)" prio=10 tid=0x00007f189c02b800 nid=0x7141
> runnable
>
> "GC task thread#7 (ParallelGC)" prio=10 tid=0x00007f189c02d800 nid=0x7142
> runnable
>
> "GC task thread#8 (ParallelGC)" prio=10 tid=0x00007f189c02f000 nid=0x7143
> runnable
>
> "GC task thread#9 (ParallelGC)" prio=10 tid=0x00007f189c031000 nid=0x7144
> runnable
>
> "GC task thread#10 (ParallelGC)" prio=10 tid=0x00007f189c033000 nid=0x7145
> runnable
>
> "GC task thread#11 (ParallelGC)" prio=10 tid=0x00007f189c035000 nid=0x7146
> runnable
>
> "GC task thread#12 (ParallelGC)" prio=10 tid=0x00007f189c036800 nid=0x7147
> runnable
>
> "VM Periodic Task Thread" prio=10 tid=0x00007f189c29c000 nid=0x7154
> waiting on condition
>
> JNI global references: 309
>
> + echo '************ END  zombies jstack extract'
> ************ END  zombies jstack extract
> + JIRA_COMMENT='
>
>      {color:red}-1 core zombie tests{color}.  There are 5 zombie test(s):
>      at
> org.apache.hadoop.hbase.client.TestSnapshotFromClient.testSnapshotDeletionWithRegex(TestSnapshotFromClient.java:162)
>         at
> org.apache.hadoop.hbase.TestIOFencing.testFencingAroundCompactionAfterWALSync(TestIOFencing.java:238)
>         at
> org.apache.hadoop.hbase.backup.TestHFileArchiving.testArchiveOnTableDelete(TestHFileArchiving.java:242)'
> + BAD=1
> + jps
> + grep surefirebooter
> + cut -d ' ' -f 1
> + xargs kill -9
> POST BUILD TASK : SUCCESS
> END OF POST BUILD TASK : 0
> Archiving artifacts
> Compressed 15.65 MB of artifacts by 11.0% relative to #6882
> Recording test results
> [FINDBUGS] Collecting findbugs analysis files...
> [FINDBUGS] Finding all files that match the pattern
> **/findbugs.xml,**/findbugsXml.xml
> [FINDBUGS] Parsing 28 files in <
> https://builds.apache.org/job/HBase-TRUNK/ws/>
> [FINDBUGS] Successfully parsed file <
> https://builds.apache.org/job/HBase-TRUNK/6904/artifact/hbase-annotations/target/findbugs.xml>
> with 0 unique warnings and 0 duplicates.
> [FINDBUGS] Successfully parsed file <
> https://builds.apache.org/job/HBase-TRUNK/6904/artifact/hbase-annotations/target/findbugsXml.xml>
> with 0 unique warnings and 0 duplicates.
> [FINDBUGS] Successfully parsed file <
> https://builds.apache.org/job/HBase-TRUNK/6904/artifact/hbase-client/target/findbugs.xml>
> with 0 unique warnings and 0 duplicates.
> [FINDBUGS] Successfully parsed file <
> https://builds.apache.org/job/HBase-TRUNK/6904/artifact/hbase-client/target/findbugsXml.xml>
> with 13 unique warnings and 0 duplicates.
> [FINDBUGS] Successfully parsed file <
> https://builds.apache.org/job/HBase-TRUNK/6904/artifact/hbase-common/target/findbugs.xml>
> with 13 unique warnings and 0 duplicates.
> [FINDBUGS] Successfully parsed file <
> https://builds.apache.org/job/HBase-TRUNK/6904/artifact/hbase-common/target/findbugsXml.xml>
> with 21 unique warnings and 0 duplicates.
> [FINDBUGS] Successfully parsed file <
> https://builds.apache.org/job/HBase-TRUNK/6904/artifact/hbase-examples/target/findbugs.xml>
> with 21 unique warnings and 0 duplicates.
> [FINDBUGS] Successfully parsed file <
> https://builds.apache.org/job/HBase-TRUNK/6904/artifact/hbase-examples/target/findbugsXml.xml>
> with 21 unique warnings and 0 duplicates.
> [FINDBUGS] Successfully parsed file <
> https://builds.apache.org/job/HBase-TRUNK/6904/artifact/hbase-external-blockcache/target/findbugs.xml>
> with 21 unique warnings and 0 duplicates.
> [FINDBUGS] Successfully parsed file <
> https://builds.apache.org/job/HBase-TRUNK/6904/artifact/hbase-external-blockcache/target/findbugsXml.xml>
> with 21 unique warnings and 0 duplicates.
> [FINDBUGS] Successfully parsed file <
> https://builds.apache.org/job/HBase-TRUNK/6904/artifact/hbase-hadoop-compat/target/findbugs.xml>
> with 21 unique warnings and 0 duplicates.
> [FINDBUGS] Successfully parsed file <
> https://builds.apache.org/job/HBase-TRUNK/6904/artifact/hbase-hadoop-compat/target/findbugsXml.xml>
> with 21 unique warnings and 0 duplicates.
> [FINDBUGS] Successfully parsed file <
> https://builds.apache.org/job/HBase-TRUNK/6904/artifact/hbase-hadoop2-compat/target/findbugs.xml>
> with 21 unique warnings and 0 duplicates.
> [FINDBUGS] Successfully parsed file <
> https://builds.apache.org/job/HBase-TRUNK/6904/artifact/hbase-hadoop2-compat/target/findbugsXml.xml>
> with 21 unique warnings and 0 duplicates.
> [FINDBUGS] Successfully parsed file <
> https://builds.apache.org/job/HBase-TRUNK/6904/artifact/hbase-prefix-tree/target/findbugs.xml>
> with 21 unique warnings and 0 duplicates.
> [FINDBUGS] Successfully parsed file <
> https://builds.apache.org/job/HBase-TRUNK/6904/artifact/hbase-prefix-tree/target/findbugsXml.xml>
> with 22 unique warnings and 0 duplicates.
> [FINDBUGS] Successfully parsed file <
> https://builds.apache.org/job/HBase-TRUNK/6904/artifact/hbase-procedure/target/findbugs.xml>
> with 22 unique warnings and 0 duplicates.
> [FINDBUGS] Successfully parsed file <
> https://builds.apache.org/job/HBase-TRUNK/6904/artifact/hbase-procedure/target/findbugsXml.xml>
> with 23 unique warnings and 0 duplicates.
> [FINDBUGS] Successfully parsed file <
> https://builds.apache.org/job/HBase-TRUNK/6904/artifact/hbase-protocol/target/findbugs.xml>
> with 23 unique warnings and 0 duplicates.
> [FINDBUGS] Successfully parsed file <
> https://builds.apache.org/job/HBase-TRUNK/6904/artifact/hbase-protocol/target/findbugsXml.xml>
> with 23 unique warnings and 0 duplicates.
> [FINDBUGS] Successfully parsed file <
> https://builds.apache.org/job/HBase-TRUNK/6904/artifact/hbase-rest/target/findbugs.xml>
> with 23 unique warnings and 0 duplicates.
> [FINDBUGS] Successfully parsed file <
> https://builds.apache.org/job/HBase-TRUNK/6904/artifact/hbase-rest/target/findbugsXml.xml>
> with 25 unique warnings and 0 duplicates.
> [FINDBUGS] Successfully parsed file <
> https://builds.apache.org/job/HBase-TRUNK/6904/artifact/hbase-server/target/findbugs.xml>
> with 25 unique warnings and 0 duplicates.
> [FINDBUGS] Successfully parsed file <
> https://builds.apache.org/job/HBase-TRUNK/6904/artifact/hbase-server/target/findbugsXml.xml>
> with 101 unique warnings and 1 duplicate.
> [FINDBUGS] Successfully parsed file <
> https://builds.apache.org/job/HBase-TRUNK/6904/artifact/hbase-spark/target/findbugs.xml>
> with 101 unique warnings and 0 duplicates.
> [FINDBUGS] Successfully parsed file <
> https://builds.apache.org/job/HBase-TRUNK/6904/artifact/hbase-spark/target/findbugsXml.xml>
> with 132 unique warnings and 0 duplicates.
> [FINDBUGS] Successfully parsed file <
> https://builds.apache.org/job/HBase-TRUNK/6904/artifact/hbase-thrift/target/findbugs.xml>
> with 132 unique warnings and 0 duplicates.
> [FINDBUGS] Successfully parsed file <
> https://builds.apache.org/job/HBase-TRUNK/6904/artifact/hbase-thrift/target/findbugsXml.xml>
> with 132 unique warnings and 0 duplicates.
> [FINDBUGS] Computing warning deltas based on reference build #6882
> [CHECKSTYLE] Collecting checkstyle analysis files...
> [CHECKSTYLE] Finding all files that match the pattern
> **/checkstyle-result.xml
> [CHECKSTYLE] Parsing 24 files in <
> https://builds.apache.org/job/HBase-TRUNK/ws/>
> [CHECKSTYLE] Successfully parsed file <
> https://builds.apache.org/job/HBase-TRUNK/6904/artifact/hbase-annotations/target/checkstyle-result.xml>
> with 0 unique warnings and 0 duplicates.
> [CHECKSTYLE] Successfully parsed file <
> https://builds.apache.org/job/HBase-TRUNK/6904/artifact/hbase-assembly/target/checkstyle-result.xml>
> with 0 unique warnings and 0 duplicates.
> [CHECKSTYLE] Successfully parsed file <
> https://builds.apache.org/job/HBase-TRUNK/6904/artifact/hbase-checkstyle/target/checkstyle-result.xml>
> with 0 unique warnings and 0 duplicates.
> [CHECKSTYLE] Successfully parsed file <
> https://builds.apache.org/job/HBase-TRUNK/6904/artifact/hbase-client/target/checkstyle-result.xml>
> with 203 unique warnings and 0 duplicates.
> [CHECKSTYLE] Successfully parsed file <
> https://builds.apache.org/job/HBase-TRUNK/6904/artifact/hbase-common/target/checkstyle-result.xml>
> with 303 unique warnings and 0 duplicates.
> [CHECKSTYLE] Successfully parsed file <
> https://builds.apache.org/job/HBase-TRUNK/6904/artifact/hbase-examples/target/checkstyle-result.xml>
> with 331 unique warnings and 0 duplicates.
> [CHECKSTYLE] Successfully parsed file <
> https://builds.apache.org/job/HBase-TRUNK/6904/artifact/hbase-external-blockcache/target/checkstyle-result.xml>
> with 331 unique warnings and 0 duplicates.
> [CHECKSTYLE] Successfully parsed file <
> https://builds.apache.org/job/HBase-TRUNK/6904/artifact/hbase-hadoop-compat/target/checkstyle-result.xml>
> with 333 unique warnings and 0 duplicates.
> [CHECKSTYLE] Successfully parsed file <
> https://builds.apache.org/job/HBase-TRUNK/6904/artifact/hbase-hadoop2-compat/target/checkstyle-result.xml>
> with 364 unique warnings and 0 duplicates.
> [CHECKSTYLE] Successfully parsed file <
> https://builds.apache.org/job/HBase-TRUNK/6904/artifact/hbase-it/target/checkstyle-result.xml>
> with 364 unique warnings and 0 duplicates.
> [CHECKSTYLE] Successfully parsed file <
> https://builds.apache.org/job/HBase-TRUNK/6904/artifact/hbase-prefix-tree/target/checkstyle-result.xml>
> with 380 unique warnings and 0 duplicates.
> [CHECKSTYLE] Successfully parsed file <
> https://builds.apache.org/job/HBase-TRUNK/6904/artifact/hbase-procedure/target/checkstyle-result.xml>
> with 380 unique warnings and 0 duplicates.
> [CHECKSTYLE] Successfully parsed file <
> https://builds.apache.org/job/HBase-TRUNK/6904/artifact/hbase-protocol/target/checkstyle-result.xml>
> with 382 unique warnings and 0 duplicates.
> [CHECKSTYLE] Successfully parsed file <
> https://builds.apache.org/job/HBase-TRUNK/6904/artifact/hbase-resource-bundle/target/checkstyle-result.xml>
> with 382 unique warnings and 0 duplicates.
> [CHECKSTYLE] Successfully parsed file <
> https://builds.apache.org/job/HBase-TRUNK/6904/artifact/hbase-rest/target/checkstyle-result.xml>
> with 424 unique warnings and 0 duplicates.
> [CHECKSTYLE] Successfully parsed file <
> https://builds.apache.org/job/HBase-TRUNK/6904/artifact/hbase-server/target/checkstyle-result.xml>
> with 1730 unique warnings and 0 duplicates.
> [CHECKSTYLE] Successfully parsed file <
> https://builds.apache.org/job/HBase-TRUNK/6904/artifact/hbase-shaded/hbase-shaded-client/target/checkstyle-result.xml>
> with 1730 unique warnings and 0 duplicates.
> [CHECKSTYLE] Successfully parsed file <
> https://builds.apache.org/job/HBase-TRUNK/6904/artifact/hbase-shaded/hbase-shaded-server/target/checkstyle-result.xml>
> with 1730 unique warnings and 0 duplicates.
> [CHECKSTYLE] Successfully parsed file <
> https://builds.apache.org/job/HBase-TRUNK/6904/artifact/hbase-shaded/target/checkstyle-result.xml>
> with 1730 unique warnings and 0 duplicates.
> [CHECKSTYLE] Successfully parsed file <
> https://builds.apache.org/job/HBase-TRUNK/6904/artifact/hbase-shell/target/checkstyle-result.xml>
> with 1730 unique warnings and 0 duplicates.
> [CHECKSTYLE] Successfully parsed file <
> https://builds.apache.org/job/HBase-TRUNK/6904/artifact/hbase-spark/target/checkstyle-result.xml>
> with 1730 unique warnings and 0 duplicates.
> [CHECKSTYLE] Successfully parsed file <
> https://builds.apache.org/job/HBase-TRUNK/6904/artifact/hbase-testing-util/target/checkstyle-result.xml>
> with 1730 unique warnings and 0 duplicates.
> [CHECKSTYLE] Successfully parsed file <
> https://builds.apache.org/job/HBase-TRUNK/6904/artifact/hbase-thrift/target/checkstyle-result.xml>
> with 1752 unique warnings and 0 duplicates.
> [CHECKSTYLE] Successfully parsed file <
> https://builds.apache.org/job/HBase-TRUNK/6904/artifact/target/checkstyle-result.xml>
> with 1752 unique warnings and 0 duplicates.
> [CHECKSTYLE] Computing warning deltas based on reference build #6882
> Updating HBASE-14596
>

Build failed in Jenkins: HBase-TRUNK #6904

Posted by Apache Jenkins Server <je...@builds.apache.org>.
See <https://builds.apache.org/job/HBase-TRUNK/6904/changes>

Changes:

[stack] HBASE-14596 TestCellACLs failing... on1.2 builds; TUNEUP -- ADD DEBUG

------------------------------------------
[...truncated 21955 lines...]
	at org.apache.hadoop.ipc.Server$Listener$Reader.doRunLoop(Server.java:629)
	- locked <0x0000000754b5b1f0> (a org.apache.hadoop.ipc.Server$Listener$Reader)
	at org.apache.hadoop.ipc.Server$Listener$Reader.run(Server.java:608)

"Timer-0" daemon prio=10 tid=0x00007f189d0b7000 nid=0x731d in Object.wait() [0x00007f186b35b000]
   java.lang.Thread.State: TIMED_WAITING (on object monitor)
	at java.lang.Object.wait(Native Method)
	- waiting on <0x00000007dea32d60> (a java.util.TaskQueue)
	at java.util.TimerThread.mainLoop(Timer.java:552)
	- locked <0x00000007dea32d60> (a java.util.TaskQueue)
	at java.util.TimerThread.run(Timer.java:505)

"1125728581@qtp-1929057227-1 - Acceptor0 HttpServer2$SelectChannelConnectorWithSafeStartup@localhost:59905" daemon prio=10 tid=0x00007f189d0a8000 nid=0x7311 runnable [0x00007f186b45c000]
   java.lang.Thread.State: RUNNABLE
	at sun.nio.ch.EPollArrayWrapper.epollWait(Native Method)
	at sun.nio.ch.EPollArrayWrapper.poll(EPollArrayWrapper.java:269)
	at sun.nio.ch.EPollSelectorImpl.doSelect(EPollSelectorImpl.java:79)
	at sun.nio.ch.SelectorImpl.lockAndDoSelect(SelectorImpl.java:87)
	- locked <0x00000007df3ecc50> (a sun.nio.ch.Util$2)
	- locked <0x00000007df3ecc40> (a java.util.Collections$UnmodifiableSet)
	- locked <0x00000007df3ec870> (a sun.nio.ch.EPollSelectorImpl)
	at sun.nio.ch.SelectorImpl.select(SelectorImpl.java:98)
	at org.mortbay.io.nio.SelectorManager$SelectSet.doSelect(SelectorManager.java:498)
	at org.mortbay.io.nio.SelectorManager.doSelect(SelectorManager.java:192)
	at org.mortbay.jetty.nio.SelectChannelConnector.accept(SelectChannelConnector.java:124)
	at org.mortbay.jetty.AbstractConnector$Acceptor.run(AbstractConnector.java:708)
	at org.mortbay.thread.QueuedThreadPool$PoolThread.run(QueuedThreadPool.java:582)

"409910713@qtp-1929057227-0" daemon prio=10 tid=0x00007f189d0ae000 nid=0x7310 in Object.wait() [0x00007f186b55d000]
   java.lang.Thread.State: TIMED_WAITING (on object monitor)
	at java.lang.Object.wait(Native Method)
	- waiting on <0x00000007df3ec368> (a org.mortbay.thread.QueuedThreadPool$PoolThread)
	at org.mortbay.thread.QueuedThreadPool$PoolThread.run(QueuedThreadPool.java:626)
	- locked <0x00000007df3ec368> (a org.mortbay.thread.QueuedThreadPool$PoolThread)

"pool-2-thread-1" prio=10 tid=0x00007f189d089000 nid=0x730f waiting on condition [0x00007f186bfc5000]
   java.lang.Thread.State: TIMED_WAITING (parking)
	at sun.misc.Unsafe.park(Native Method)
	- parking to wait for  <0x00000007de9ef238> (a java.util.concurrent.locks.AbstractQueuedSynchronizer$ConditionObject)
	at java.util.concurrent.locks.LockSupport.parkNanos(LockSupport.java:226)
	at java.util.concurrent.locks.AbstractQueuedSynchronizer$ConditionObject.awaitNanos(AbstractQueuedSynchronizer.java:2082)
	at java.util.concurrent.ScheduledThreadPoolExecutor$DelayedWorkQueue.take(ScheduledThreadPoolExecutor.java:1090)
	at java.util.concurrent.ScheduledThreadPoolExecutor$DelayedWorkQueue.take(ScheduledThreadPoolExecutor.java:807)
	at java.util.concurrent.ThreadPoolExecutor.getTask(ThreadPoolExecutor.java:1068)
	at java.util.concurrent.ThreadPoolExecutor.runWorker(ThreadPoolExecutor.java:1130)
	at java.util.concurrent.ThreadPoolExecutor$Worker.run(ThreadPoolExecutor.java:615)
	at java.lang.Thread.run(Thread.java:744)

"Timer for 'NameNode' metrics system" daemon prio=10 tid=0x00007f189d022800 nid=0x730e in Object.wait() [0x00007f186b65e000]
   java.lang.Thread.State: TIMED_WAITING (on object monitor)
	at java.lang.Object.wait(Native Method)
	- waiting on <0x0000000754f49338> (a java.util.TaskQueue)
	at java.util.TimerThread.mainLoop(Timer.java:552)
	- locked <0x0000000754f49338> (a java.util.TaskQueue)
	at java.util.TimerThread.run(Timer.java:505)

"process reaper" daemon prio=10 tid=0x00007f189c9fb800 nid=0x71e3 waiting on condition [0x00007f186bffe000]
   java.lang.Thread.State: TIMED_WAITING (parking)
	at sun.misc.Unsafe.park(Native Method)
	- parking to wait for  <0x00000007dd588aa0> (a java.util.concurrent.SynchronousQueue$TransferStack)
	at java.util.concurrent.locks.LockSupport.parkNanos(LockSupport.java:226)
	at java.util.concurrent.SynchronousQueue$TransferStack.awaitFulfill(SynchronousQueue.java:460)
	at java.util.concurrent.SynchronousQueue$TransferStack.transfer(SynchronousQueue.java:359)
	at java.util.concurrent.SynchronousQueue.poll(SynchronousQueue.java:942)
	at java.util.concurrent.ThreadPoolExecutor.getTask(ThreadPoolExecutor.java:1068)
	at java.util.concurrent.ThreadPoolExecutor.runWorker(ThreadPoolExecutor.java:1130)
	at java.util.concurrent.ThreadPoolExecutor$Worker.run(ThreadPoolExecutor.java:615)
	at java.lang.Thread.run(Thread.java:744)

"Service Thread" daemon prio=10 tid=0x00007f189c291000 nid=0x7153 runnable [0x0000000000000000]
   java.lang.Thread.State: RUNNABLE

"C2 CompilerThread1" daemon prio=10 tid=0x00007f189c28f000 nid=0x7152 waiting on condition [0x0000000000000000]
   java.lang.Thread.State: RUNNABLE

"C2 CompilerThread0" daemon prio=10 tid=0x00007f189c28c000 nid=0x7151 waiting on condition [0x0000000000000000]
   java.lang.Thread.State: RUNNABLE

"Signal Dispatcher" daemon prio=10 tid=0x00007f189c282000 nid=0x7150 runnable [0x0000000000000000]
   java.lang.Thread.State: RUNNABLE

"Finalizer" daemon prio=10 tid=0x00007f189c26b000 nid=0x714e in Object.wait() [0x00007f18894d3000]
   java.lang.Thread.State: WAITING (on object monitor)
	at java.lang.Object.wait(Native Method)
	- waiting on <0x00000007dd832630> (a java.lang.ref.ReferenceQueue$Lock)
	at java.lang.ref.ReferenceQueue.remove(ReferenceQueue.java:135)
	- locked <0x00000007dd832630> (a java.lang.ref.ReferenceQueue$Lock)
	at java.lang.ref.ReferenceQueue.remove(ReferenceQueue.java:151)
	at java.lang.ref.Finalizer$FinalizerThread.run(Finalizer.java:189)

"Reference Handler" daemon prio=10 tid=0x00007f189c267000 nid=0x714d in Object.wait() [0x00007f18895d4000]
   java.lang.Thread.State: WAITING (on object monitor)
	at java.lang.Object.wait(Native Method)
	- waiting on <0x00000007dd832280> (a java.lang.ref.Reference$Lock)
	at java.lang.Object.wait(Object.java:503)
	at java.lang.ref.Reference$ReferenceHandler.run(Reference.java:133)
	- locked <0x00000007dd832280> (a java.lang.ref.Reference$Lock)

"main" prio=10 tid=0x00007f189c00a800 nid=0x713a sleeping[0x00007f18a401b000]
   java.lang.Thread.State: TIMED_WAITING (sleeping)
	at java.lang.Thread.sleep(Native Method)
	at org.apache.hadoop.hbase.util.JVMClusterUtil.startup(JVMClusterUtil.java:228)
	at org.apache.hadoop.hbase.LocalHBaseCluster.startup(LocalHBaseCluster.java:448)
	at org.apache.hadoop.hbase.MiniHBaseCluster.init(MiniHBaseCluster.java:225)
	at org.apache.hadoop.hbase.MiniHBaseCluster.<init>(MiniHBaseCluster.java:94)
	at org.apache.hadoop.hbase.HBaseTestingUtility.startMiniHBaseCluster(HBaseTestingUtility.java:1078)
	at org.apache.hadoop.hbase.HBaseTestingUtility.startMiniCluster(HBaseTestingUtility.java:1038)
	at org.apache.hadoop.hbase.HBaseTestingUtility.startMiniCluster(HBaseTestingUtility.java:910)
	at org.apache.hadoop.hbase.HBaseTestingUtility.startMiniCluster(HBaseTestingUtility.java:892)
	at org.apache.hadoop.hbase.HBaseTestingUtility.startMiniCluster(HBaseTestingUtility.java:879)
	at org.apache.hadoop.hbase.client.TestCloneSnapshotFromClient.setUpBeforeClass(TestCloneSnapshotFromClient.java:76)
	at sun.reflect.NativeMethodAccessorImpl.invoke0(Native Method)
	at sun.reflect.NativeMethodAccessorImpl.invoke(NativeMethodAccessorImpl.java:57)
	at sun.reflect.DelegatingMethodAccessorImpl.invoke(DelegatingMethodAccessorImpl.java:43)
	at java.lang.reflect.Method.invoke(Method.java:606)
	at org.junit.runners.model.FrameworkMethod$1.runReflectiveCall(FrameworkMethod.java:50)
	at org.junit.internal.runners.model.ReflectiveCallable.run(ReflectiveCallable.java:12)
	at org.junit.runners.model.FrameworkMethod.invokeExplosively(FrameworkMethod.java:47)
	at org.junit.internal.runners.statements.RunBefores.evaluate(RunBefores.java:24)
	at org.junit.internal.runners.statements.RunAfters.evaluate(RunAfters.java:27)
	at org.junit.runners.ParentRunner.run(ParentRunner.java:363)
	at org.junit.runners.Suite.runChild(Suite.java:128)
	at org.junit.runners.Suite.runChild(Suite.java:27)
	at org.junit.runners.ParentRunner$3.run(ParentRunner.java:290)
	at org.junit.runners.ParentRunner$1.schedule(ParentRunner.java:71)
	at org.junit.runners.ParentRunner.runChildren(ParentRunner.java:288)
	at org.junit.runners.ParentRunner.access$000(ParentRunner.java:58)
	at org.junit.runners.ParentRunner$2.evaluate(ParentRunner.java:268)
	at org.junit.runners.ParentRunner.run(ParentRunner.java:363)
	at org.junit.runner.JUnitCore.run(JUnitCore.java:137)
	at org.junit.runner.JUnitCore.run(JUnitCore.java:115)
	at org.apache.maven.surefire.junitcore.JUnitCoreWrapper.createRequestAndRun(JUnitCoreWrapper.java:108)
	at org.apache.maven.surefire.junitcore.JUnitCoreWrapper.executeEager(JUnitCoreWrapper.java:78)
	at org.apache.maven.surefire.junitcore.JUnitCoreWrapper.execute(JUnitCoreWrapper.java:54)
	at org.apache.maven.surefire.junitcore.JUnitCoreProvider.invoke(JUnitCoreProvider.java:144)
	at org.apache.maven.surefire.booter.ForkedBooter.invokeProviderInSameClassLoader(ForkedBooter.java:203)
	at org.apache.maven.surefire.booter.ForkedBooter.runSuitesInProcess(ForkedBooter.java:155)
	at org.apache.maven.surefire.booter.ForkedBooter.main(ForkedBooter.java:103)

"VM Thread" prio=10 tid=0x00007f189c265000 nid=0x714c runnable 

"GC task thread#0 (ParallelGC)" prio=10 tid=0x00007f189c020800 nid=0x713b runnable 

"GC task thread#1 (ParallelGC)" prio=10 tid=0x00007f189c022000 nid=0x713c runnable 

"GC task thread#2 (ParallelGC)" prio=10 tid=0x00007f189c024000 nid=0x713d runnable 

"GC task thread#3 (ParallelGC)" prio=10 tid=0x00007f189c026000 nid=0x713e runnable 

"GC task thread#4 (ParallelGC)" prio=10 tid=0x00007f189c028000 nid=0x713f runnable 

"GC task thread#5 (ParallelGC)" prio=10 tid=0x00007f189c029800 nid=0x7140 runnable 

"GC task thread#6 (ParallelGC)" prio=10 tid=0x00007f189c02b800 nid=0x7141 runnable 

"GC task thread#7 (ParallelGC)" prio=10 tid=0x00007f189c02d800 nid=0x7142 runnable 

"GC task thread#8 (ParallelGC)" prio=10 tid=0x00007f189c02f000 nid=0x7143 runnable 

"GC task thread#9 (ParallelGC)" prio=10 tid=0x00007f189c031000 nid=0x7144 runnable 

"GC task thread#10 (ParallelGC)" prio=10 tid=0x00007f189c033000 nid=0x7145 runnable 

"GC task thread#11 (ParallelGC)" prio=10 tid=0x00007f189c035000 nid=0x7146 runnable 

"GC task thread#12 (ParallelGC)" prio=10 tid=0x00007f189c036800 nid=0x7147 runnable 

"VM Periodic Task Thread" prio=10 tid=0x00007f189c29c000 nid=0x7154 waiting on condition 

JNI global references: 309

+ echo '************ END  zombies jstack extract'
************ END  zombies jstack extract
+ JIRA_COMMENT='

     {color:red}-1 core zombie tests{color}.  There are 5 zombie test(s): 	at org.apache.hadoop.hbase.client.TestSnapshotFromClient.testSnapshotDeletionWithRegex(TestSnapshotFromClient.java:162)
	at org.apache.hadoop.hbase.TestIOFencing.testFencingAroundCompactionAfterWALSync(TestIOFencing.java:238)
	at org.apache.hadoop.hbase.backup.TestHFileArchiving.testArchiveOnTableDelete(TestHFileArchiving.java:242)'
+ BAD=1
+ jps
+ grep surefirebooter
+ cut -d ' ' -f 1
+ xargs kill -9
POST BUILD TASK : SUCCESS
END OF POST BUILD TASK : 0
Archiving artifacts
Compressed 15.65 MB of artifacts by 11.0% relative to #6882
Recording test results
[FINDBUGS] Collecting findbugs analysis files...
[FINDBUGS] Finding all files that match the pattern **/findbugs.xml,**/findbugsXml.xml
[FINDBUGS] Parsing 28 files in <https://builds.apache.org/job/HBase-TRUNK/ws/>
[FINDBUGS] Successfully parsed file <https://builds.apache.org/job/HBase-TRUNK/6904/artifact/hbase-annotations/target/findbugs.xml> with 0 unique warnings and 0 duplicates.
[FINDBUGS] Successfully parsed file <https://builds.apache.org/job/HBase-TRUNK/6904/artifact/hbase-annotations/target/findbugsXml.xml> with 0 unique warnings and 0 duplicates.
[FINDBUGS] Successfully parsed file <https://builds.apache.org/job/HBase-TRUNK/6904/artifact/hbase-client/target/findbugs.xml> with 0 unique warnings and 0 duplicates.
[FINDBUGS] Successfully parsed file <https://builds.apache.org/job/HBase-TRUNK/6904/artifact/hbase-client/target/findbugsXml.xml> with 13 unique warnings and 0 duplicates.
[FINDBUGS] Successfully parsed file <https://builds.apache.org/job/HBase-TRUNK/6904/artifact/hbase-common/target/findbugs.xml> with 13 unique warnings and 0 duplicates.
[FINDBUGS] Successfully parsed file <https://builds.apache.org/job/HBase-TRUNK/6904/artifact/hbase-common/target/findbugsXml.xml> with 21 unique warnings and 0 duplicates.
[FINDBUGS] Successfully parsed file <https://builds.apache.org/job/HBase-TRUNK/6904/artifact/hbase-examples/target/findbugs.xml> with 21 unique warnings and 0 duplicates.
[FINDBUGS] Successfully parsed file <https://builds.apache.org/job/HBase-TRUNK/6904/artifact/hbase-examples/target/findbugsXml.xml> with 21 unique warnings and 0 duplicates.
[FINDBUGS] Successfully parsed file <https://builds.apache.org/job/HBase-TRUNK/6904/artifact/hbase-external-blockcache/target/findbugs.xml> with 21 unique warnings and 0 duplicates.
[FINDBUGS] Successfully parsed file <https://builds.apache.org/job/HBase-TRUNK/6904/artifact/hbase-external-blockcache/target/findbugsXml.xml> with 21 unique warnings and 0 duplicates.
[FINDBUGS] Successfully parsed file <https://builds.apache.org/job/HBase-TRUNK/6904/artifact/hbase-hadoop-compat/target/findbugs.xml> with 21 unique warnings and 0 duplicates.
[FINDBUGS] Successfully parsed file <https://builds.apache.org/job/HBase-TRUNK/6904/artifact/hbase-hadoop-compat/target/findbugsXml.xml> with 21 unique warnings and 0 duplicates.
[FINDBUGS] Successfully parsed file <https://builds.apache.org/job/HBase-TRUNK/6904/artifact/hbase-hadoop2-compat/target/findbugs.xml> with 21 unique warnings and 0 duplicates.
[FINDBUGS] Successfully parsed file <https://builds.apache.org/job/HBase-TRUNK/6904/artifact/hbase-hadoop2-compat/target/findbugsXml.xml> with 21 unique warnings and 0 duplicates.
[FINDBUGS] Successfully parsed file <https://builds.apache.org/job/HBase-TRUNK/6904/artifact/hbase-prefix-tree/target/findbugs.xml> with 21 unique warnings and 0 duplicates.
[FINDBUGS] Successfully parsed file <https://builds.apache.org/job/HBase-TRUNK/6904/artifact/hbase-prefix-tree/target/findbugsXml.xml> with 22 unique warnings and 0 duplicates.
[FINDBUGS] Successfully parsed file <https://builds.apache.org/job/HBase-TRUNK/6904/artifact/hbase-procedure/target/findbugs.xml> with 22 unique warnings and 0 duplicates.
[FINDBUGS] Successfully parsed file <https://builds.apache.org/job/HBase-TRUNK/6904/artifact/hbase-procedure/target/findbugsXml.xml> with 23 unique warnings and 0 duplicates.
[FINDBUGS] Successfully parsed file <https://builds.apache.org/job/HBase-TRUNK/6904/artifact/hbase-protocol/target/findbugs.xml> with 23 unique warnings and 0 duplicates.
[FINDBUGS] Successfully parsed file <https://builds.apache.org/job/HBase-TRUNK/6904/artifact/hbase-protocol/target/findbugsXml.xml> with 23 unique warnings and 0 duplicates.
[FINDBUGS] Successfully parsed file <https://builds.apache.org/job/HBase-TRUNK/6904/artifact/hbase-rest/target/findbugs.xml> with 23 unique warnings and 0 duplicates.
[FINDBUGS] Successfully parsed file <https://builds.apache.org/job/HBase-TRUNK/6904/artifact/hbase-rest/target/findbugsXml.xml> with 25 unique warnings and 0 duplicates.
[FINDBUGS] Successfully parsed file <https://builds.apache.org/job/HBase-TRUNK/6904/artifact/hbase-server/target/findbugs.xml> with 25 unique warnings and 0 duplicates.
[FINDBUGS] Successfully parsed file <https://builds.apache.org/job/HBase-TRUNK/6904/artifact/hbase-server/target/findbugsXml.xml> with 101 unique warnings and 1 duplicate.
[FINDBUGS] Successfully parsed file <https://builds.apache.org/job/HBase-TRUNK/6904/artifact/hbase-spark/target/findbugs.xml> with 101 unique warnings and 0 duplicates.
[FINDBUGS] Successfully parsed file <https://builds.apache.org/job/HBase-TRUNK/6904/artifact/hbase-spark/target/findbugsXml.xml> with 132 unique warnings and 0 duplicates.
[FINDBUGS] Successfully parsed file <https://builds.apache.org/job/HBase-TRUNK/6904/artifact/hbase-thrift/target/findbugs.xml> with 132 unique warnings and 0 duplicates.
[FINDBUGS] Successfully parsed file <https://builds.apache.org/job/HBase-TRUNK/6904/artifact/hbase-thrift/target/findbugsXml.xml> with 132 unique warnings and 0 duplicates.
[FINDBUGS] Computing warning deltas based on reference build #6882
[CHECKSTYLE] Collecting checkstyle analysis files...
[CHECKSTYLE] Finding all files that match the pattern **/checkstyle-result.xml
[CHECKSTYLE] Parsing 24 files in <https://builds.apache.org/job/HBase-TRUNK/ws/>
[CHECKSTYLE] Successfully parsed file <https://builds.apache.org/job/HBase-TRUNK/6904/artifact/hbase-annotations/target/checkstyle-result.xml> with 0 unique warnings and 0 duplicates.
[CHECKSTYLE] Successfully parsed file <https://builds.apache.org/job/HBase-TRUNK/6904/artifact/hbase-assembly/target/checkstyle-result.xml> with 0 unique warnings and 0 duplicates.
[CHECKSTYLE] Successfully parsed file <https://builds.apache.org/job/HBase-TRUNK/6904/artifact/hbase-checkstyle/target/checkstyle-result.xml> with 0 unique warnings and 0 duplicates.
[CHECKSTYLE] Successfully parsed file <https://builds.apache.org/job/HBase-TRUNK/6904/artifact/hbase-client/target/checkstyle-result.xml> with 203 unique warnings and 0 duplicates.
[CHECKSTYLE] Successfully parsed file <https://builds.apache.org/job/HBase-TRUNK/6904/artifact/hbase-common/target/checkstyle-result.xml> with 303 unique warnings and 0 duplicates.
[CHECKSTYLE] Successfully parsed file <https://builds.apache.org/job/HBase-TRUNK/6904/artifact/hbase-examples/target/checkstyle-result.xml> with 331 unique warnings and 0 duplicates.
[CHECKSTYLE] Successfully parsed file <https://builds.apache.org/job/HBase-TRUNK/6904/artifact/hbase-external-blockcache/target/checkstyle-result.xml> with 331 unique warnings and 0 duplicates.
[CHECKSTYLE] Successfully parsed file <https://builds.apache.org/job/HBase-TRUNK/6904/artifact/hbase-hadoop-compat/target/checkstyle-result.xml> with 333 unique warnings and 0 duplicates.
[CHECKSTYLE] Successfully parsed file <https://builds.apache.org/job/HBase-TRUNK/6904/artifact/hbase-hadoop2-compat/target/checkstyle-result.xml> with 364 unique warnings and 0 duplicates.
[CHECKSTYLE] Successfully parsed file <https://builds.apache.org/job/HBase-TRUNK/6904/artifact/hbase-it/target/checkstyle-result.xml> with 364 unique warnings and 0 duplicates.
[CHECKSTYLE] Successfully parsed file <https://builds.apache.org/job/HBase-TRUNK/6904/artifact/hbase-prefix-tree/target/checkstyle-result.xml> with 380 unique warnings and 0 duplicates.
[CHECKSTYLE] Successfully parsed file <https://builds.apache.org/job/HBase-TRUNK/6904/artifact/hbase-procedure/target/checkstyle-result.xml> with 380 unique warnings and 0 duplicates.
[CHECKSTYLE] Successfully parsed file <https://builds.apache.org/job/HBase-TRUNK/6904/artifact/hbase-protocol/target/checkstyle-result.xml> with 382 unique warnings and 0 duplicates.
[CHECKSTYLE] Successfully parsed file <https://builds.apache.org/job/HBase-TRUNK/6904/artifact/hbase-resource-bundle/target/checkstyle-result.xml> with 382 unique warnings and 0 duplicates.
[CHECKSTYLE] Successfully parsed file <https://builds.apache.org/job/HBase-TRUNK/6904/artifact/hbase-rest/target/checkstyle-result.xml> with 424 unique warnings and 0 duplicates.
[CHECKSTYLE] Successfully parsed file <https://builds.apache.org/job/HBase-TRUNK/6904/artifact/hbase-server/target/checkstyle-result.xml> with 1730 unique warnings and 0 duplicates.
[CHECKSTYLE] Successfully parsed file <https://builds.apache.org/job/HBase-TRUNK/6904/artifact/hbase-shaded/hbase-shaded-client/target/checkstyle-result.xml> with 1730 unique warnings and 0 duplicates.
[CHECKSTYLE] Successfully parsed file <https://builds.apache.org/job/HBase-TRUNK/6904/artifact/hbase-shaded/hbase-shaded-server/target/checkstyle-result.xml> with 1730 unique warnings and 0 duplicates.
[CHECKSTYLE] Successfully parsed file <https://builds.apache.org/job/HBase-TRUNK/6904/artifact/hbase-shaded/target/checkstyle-result.xml> with 1730 unique warnings and 0 duplicates.
[CHECKSTYLE] Successfully parsed file <https://builds.apache.org/job/HBase-TRUNK/6904/artifact/hbase-shell/target/checkstyle-result.xml> with 1730 unique warnings and 0 duplicates.
[CHECKSTYLE] Successfully parsed file <https://builds.apache.org/job/HBase-TRUNK/6904/artifact/hbase-spark/target/checkstyle-result.xml> with 1730 unique warnings and 0 duplicates.
[CHECKSTYLE] Successfully parsed file <https://builds.apache.org/job/HBase-TRUNK/6904/artifact/hbase-testing-util/target/checkstyle-result.xml> with 1730 unique warnings and 0 duplicates.
[CHECKSTYLE] Successfully parsed file <https://builds.apache.org/job/HBase-TRUNK/6904/artifact/hbase-thrift/target/checkstyle-result.xml> with 1752 unique warnings and 0 duplicates.
[CHECKSTYLE] Successfully parsed file <https://builds.apache.org/job/HBase-TRUNK/6904/artifact/target/checkstyle-result.xml> with 1752 unique warnings and 0 duplicates.
[CHECKSTYLE] Computing warning deltas based on reference build #6882
Updating HBASE-14596