You are viewing a plain text version of this content. The canonical link for it is here.
Posted to notifications@maven.apache.org by Apache Jenkins Server <je...@builds.apache.org> on 2015/09/24 23:30:06 UTC
Build failed in Jenkins: maven-plugins-ITs-m2 #2195
See <https://builds.apache.org/job/maven-plugins-ITs-m2/2195/changes>
Changes:
[Robert Scholte] Result of mvn versions:update-child-modules -DallowSnapshots -N
[Robert Scholte] Upgrade to maven-parent 27
Lock maven-invoker-plugin to 2.0.0
------------------------------------------
Started by an SCM change
[EnvInject] - Loading node environment variables.
Building remotely on ubuntu3 (Ubuntu ubuntu legacy-ubuntu) in workspace <https://builds.apache.org/job/maven-plugins-ITs-m2/ws/>
Updating http://svn.apache.org/repos/asf/maven/plugins/trunk at revision '2015-09-24T21:25:22.805 +0000'
U maven-source-plugin/pom.xml
U maven-stage-plugin/pom.xml
U maven-toolchains-plugin/pom.xml
U maven-javadoc-plugin/pom.xml
U maven-antrun-plugin/pom.xml
U maven-pdf-plugin/src/site/site.xml
U maven-pdf-plugin/pom.xml
U maven-jar-plugin/pom.xml
U maven-invoker-plugin/pom.xml
U maven-gpg-plugin/pom.xml
U maven-pmd-plugin/pom.xml
U maven-clean-plugin/pom.xml
U maven-docck-plugin/pom.xml
U maven-rar-plugin/pom.xml
U maven-plugins/pom.xml
U maven-scm-publish-plugin/src/main/java/org/apache/maven/plugins/scmpublish/ScmPublishPublishScmMojo.java
U maven-scm-publish-plugin/pom.xml
U maven-linkcheck-plugin/pom.xml
U maven-checkstyle-plugin/pom.xml
U maven-patch-plugin/pom.xml
U maven-ejb-plugin/pom.xml
U maven-remote-resources-plugin/pom.xml
U maven-site-plugin/pom.xml
U maven-acr-plugin/pom.xml
U maven-install-plugin/pom.xml
U maven-ear-plugin/pom.xml
U maven-changes-plugin/pom.xml
U maven-resources-plugin/pom.xml
U maven-compiler-plugin/pom.xml
U maven-verifier-plugin/pom.xml
U maven-dependency-plugin/pom.xml
U maven-repository-plugin/pom.xml
U maven-assembly-plugin/pom.xml
U maven-ant-plugin/pom.xml
U maven-doap-plugin/pom.xml
U maven-shade-plugin/pom.xml
U maven-eclipse-plugin/pom.xml
U maven-jarsigner-plugin/pom.xml
U maven-changelog-plugin/pom.xml
U maven-help-plugin/pom.xml
U maven-war-plugin/pom.xml
U maven-project-info-reports-plugin/pom.xml
U maven-deploy-plugin/pom.xml
At revision 1705155
provisoning config files...
copy managed file [simple-deploy-settings-no-mirror] to file:/tmp/config2505195395686059156tmp
[maven-plugins-ITs-m2] $ /home/jenkins/tools/maven/apache-maven-2.2.1/bin/mvn clean verify -Prun-its,!maven-3_jdk5,!maven-3_jdk6 -U -B -V -fae -s /tmp/config2505195395686059156tmp -e
+ Error stacktraces are turned on.
Apache Maven 2.2.1 (r801777; 2009-08-06 19:16:01+0000)
Java version: 1.6.0_45
Java home: /x1/jenkins/tools/java/jdk1.6.0_45-32/jre
Default locale: en_US, platform encoding: ANSI_X3.4-1968
OS name: "linux" version: "3.2.0-89-generic" arch: "i386" Family: "unix"
[INFO] Scanning for projects...
Downloading: http://repo1.maven.org/maven2/org/apache/maven/maven-parent/27/maven-parent-27.pom
39K downloaded (maven-parent-27.pom)
[INFO] ------------------------------------------------------------------------
[ERROR] BUILD FAILURE
[INFO] ------------------------------------------------------------------------
[INFO] The projects in the reactor contain a cyclic reference: Edge between 'Vertex{label='org.apache.maven.plugins:maven-invoker-plugin'}' and 'Vertex{label='org.apache.maven.plugins:maven-site-plugin'}' introduces to cycle in the graph org.apache.maven.plugins:maven-site-plugin --> org.apache.maven.plugins:maven-invoker-plugin --> org.apache.maven.plugins:maven-site-plugin
[INFO] ------------------------------------------------------------------------
[INFO] Trace
org.apache.maven.BuildFailureException: The projects in the reactor contain a cyclic reference: Edge between 'Vertex{label='org.apache.maven.plugins:maven-invoker-plugin'}' and 'Vertex{label='org.apache.maven.plugins:maven-site-plugin'}' introduces to cycle in the graph org.apache.maven.plugins:maven-site-plugin --> org.apache.maven.plugins:maven-invoker-plugin --> org.apache.maven.plugins:maven-site-plugin
at org.apache.maven.DefaultMaven.doExecute(DefaultMaven.java:295)
at org.apache.maven.DefaultMaven.execute(DefaultMaven.java:138)
at org.apache.maven.cli.MavenCli.main(MavenCli.java:362)
at org.apache.maven.cli.compat.CompatibleMain.main(CompatibleMain.java:60)
at sun.reflect.NativeMethodAccessorImpl.invoke0(Native Method)
at sun.reflect.NativeMethodAccessorImpl.invoke(NativeMethodAccessorImpl.java:39)
at sun.reflect.DelegatingMethodAccessorImpl.invoke(DelegatingMethodAccessorImpl.java:25)
at java.lang.reflect.Method.invoke(Method.java:597)
at org.codehaus.classworlds.Launcher.launchEnhanced(Launcher.java:315)
at org.codehaus.classworlds.Launcher.launch(Launcher.java:255)
at org.codehaus.classworlds.Launcher.mainWithExitCode(Launcher.java:430)
at org.codehaus.classworlds.Launcher.main(Launcher.java:375)
Caused by: hidden.org.codehaus.plexus.util.dag.CycleDetectedException: Edge between 'Vertex{label='org.apache.maven.plugins:maven-invoker-plugin'}' and 'Vertex{label='org.apache.maven.plugins:maven-site-plugin'}' introduces to cycle in the graph org.apache.maven.plugins:maven-site-plugin --> org.apache.maven.plugins:maven-invoker-plugin --> org.apache.maven.plugins:maven-site-plugin
at hidden.org.codehaus.plexus.util.dag.DAG.addEdge(DAG.java:143)
at hidden.org.codehaus.plexus.util.dag.DAG.addEdge(DAG.java:123)
at org.apache.maven.project.ProjectSorter.addEdgeWithParentCheck(ProjectSorter.java:362)
at org.apache.maven.project.ProjectSorter.<init>(ProjectSorter.java:146)
at org.apache.maven.execution.ReactorManager.<init>(ReactorManager.java:99)
at org.apache.maven.DefaultMaven.doExecute(DefaultMaven.java:288)
... 11 more
[INFO] ------------------------------------------------------------------------
[INFO] Total time: 4 seconds
[INFO] Finished at: Thu Sep 24 21:30:27 UTC 2015
[INFO] Final Memory: 10M/80M
[INFO] ------------------------------------------------------------------------
Build step 'Invoke top-level Maven targets' marked build as failure
Build failed in Jenkins: maven-plugins-ITs-m2 #2199
Posted by Apache Jenkins Server <je...@builds.apache.org>.
See <https://builds.apache.org/job/maven-plugins-ITs-m2/2199/changes>
Changes:
[Robert Scholte] Fix 500+ checkstyle reported errors
------------------------------------------
Started by an SCM change
[EnvInject] - Loading node environment variables.
Building remotely on ubuntu-4 (docker Ubuntu ubuntu4 ubuntu) in workspace <https://builds.apache.org/job/maven-plugins-ITs-m2/ws/>
Updating http://svn.apache.org/repos/asf/maven/plugins/trunk at revision '2015-09-25T22:29:29.809 +0000'
U maven-ear-plugin/pom.xml
U maven-antrun-plugin/pom.xml
U maven-changes-plugin/pom.xml
U maven-resources-plugin/pom.xml
U maven-ant-plugin/src/it/webapp-it/pom.xml
U maven-ant-plugin/src/it/test-default-selector-it/pom.xml
U maven-ant-plugin/src/it/system-scope-dep/pom.xml
U maven-ant-plugin/src/it/plugin-it/pom.xml
U maven-ant-plugin/src/it/single-test-it/pom.xml
U maven-ant-plugin/src/it/test-custom-selector-it/pom.xml
U maven-ant-plugin/src/it/ear-it/pom.xml
U maven-ant-plugin/pom.xml
U maven-jarsigner-plugin/pom.xml
U maven-eclipse-plugin/src/main/java/org/apache/maven/plugin/ide/IdeDependency.java
U maven-eclipse-plugin/src/main/java/org/apache/maven/plugin/ide/IdeUtils.java
U maven-eclipse-plugin/src/main/java/org/apache/maven/plugin/ide/JeeDescriptor.java
U maven-eclipse-plugin/src/main/java/org/apache/maven/plugin/ide/JeeUtils.java
U maven-eclipse-plugin/src/main/java/org/apache/maven/plugin/ide/AbstractIdeSupportMojo.java
U maven-eclipse-plugin/src/main/java/org/apache/maven/plugin/eclipse/InstallPluginsMojo.java
U maven-eclipse-plugin/src/main/java/org/apache/maven/plugin/eclipse/BuildCommand.java
U maven-eclipse-plugin/src/main/java/org/apache/maven/plugin/eclipse/RadCleanMojo.java
U maven-eclipse-plugin/src/main/java/org/apache/maven/plugin/eclipse/osgiplugin/AbstractEclipseOsgiPlugin.java
U maven-eclipse-plugin/src/main/java/org/apache/maven/plugin/eclipse/osgiplugin/PackagedPlugin.java
U maven-eclipse-plugin/src/main/java/org/apache/maven/plugin/eclipse/osgiplugin/ExplodedPlugin.java
U maven-eclipse-plugin/src/main/java/org/apache/maven/plugin/eclipse/osgiplugin/EclipseOsgiPlugin.java
U maven-eclipse-plugin/src/main/java/org/apache/maven/plugin/eclipse/EclipseToMavenMojo.java
U maven-eclipse-plugin/src/main/java/org/apache/maven/plugin/eclipse/EclipsePlugin.java
U maven-eclipse-plugin/src/main/java/org/apache/maven/plugin/eclipse/EclipseSourceDir.java
U maven-eclipse-plugin/src/main/java/org/apache/maven/plugin/eclipse/RemoveCacheMojo.java
U maven-eclipse-plugin/src/main/java/org/apache/maven/plugin/eclipse/Messages.java
U maven-eclipse-plugin/src/main/java/org/apache/maven/plugin/eclipse/AbstractWorkspaceMojo.java
U maven-eclipse-plugin/src/main/java/org/apache/maven/plugin/eclipse/MyEclipsePlugin.java
U maven-eclipse-plugin/src/main/java/org/apache/maven/plugin/eclipse/EclipseConfigFile.java
U maven-eclipse-plugin/src/main/java/org/apache/maven/plugin/eclipse/Constants.java
U maven-eclipse-plugin/src/main/java/org/apache/maven/plugin/eclipse/EclipseCleanMojo.java
U maven-eclipse-plugin/src/main/java/org/apache/maven/plugin/eclipse/LinkedResource.java
U maven-eclipse-plugin/src/main/java/org/apache/maven/plugin/eclipse/writers/EclipseWriter.java
U maven-eclipse-plugin/src/main/java/org/apache/maven/plugin/eclipse/writers/EclipseAjdtWriter.java
U maven-eclipse-plugin/src/main/java/org/apache/maven/plugin/eclipse/writers/EclipseClasspathWriter.java
U maven-eclipse-plugin/src/main/java/org/apache/maven/plugin/eclipse/writers/EclipseLaunchConfigurationWriter.java
U maven-eclipse-plugin/src/main/java/org/apache/maven/plugin/eclipse/writers/AbstractEclipseWriter.java
U maven-eclipse-plugin/src/main/java/org/apache/maven/plugin/eclipse/writers/rad/RadEjbClasspathWriter.java
U maven-eclipse-plugin/src/main/java/org/apache/maven/plugin/eclipse/writers/rad/RadApplicationXMLWriter.java
U maven-eclipse-plugin/src/main/java/org/apache/maven/plugin/eclipse/writers/rad/RadJ2EEWriter.java
U maven-eclipse-plugin/src/main/java/org/apache/maven/plugin/eclipse/writers/rad/RadManifestWriter.java
U maven-eclipse-plugin/src/main/java/org/apache/maven/plugin/eclipse/writers/rad/RadWebsiteConfigWriter.java
U maven-eclipse-plugin/src/main/java/org/apache/maven/plugin/eclipse/writers/rad/RadLibCopier.java
U maven-eclipse-plugin/src/main/java/org/apache/maven/plugin/eclipse/writers/rad/RadWebSettingsWriter.java
U maven-eclipse-plugin/src/main/java/org/apache/maven/plugin/eclipse/writers/EclipseWriterConfig.java
U maven-eclipse-plugin/src/main/java/org/apache/maven/plugin/eclipse/writers/EclipseManifestWriter.java
U maven-eclipse-plugin/src/main/java/org/apache/maven/plugin/eclipse/writers/EclipseProjectWriter.java
U maven-eclipse-plugin/src/main/java/org/apache/maven/plugin/eclipse/writers/MonitoredResource.java
U maven-eclipse-plugin/src/main/java/org/apache/maven/plugin/eclipse/writers/EclipseAntExternalLaunchConfigurationWriter.java
U maven-eclipse-plugin/src/main/java/org/apache/maven/plugin/eclipse/writers/myeclipse/MyEclipseMetadataWriter.java
U maven-eclipse-plugin/src/main/java/org/apache/maven/plugin/eclipse/writers/myeclipse/MyEclipseHibernateWriter.java
U maven-eclipse-plugin/src/main/java/org/apache/maven/plugin/eclipse/writers/myeclipse/MyEclipseSpringBeansWriter.java
U maven-eclipse-plugin/src/main/java/org/apache/maven/plugin/eclipse/writers/myeclipse/MyEclipseStrutsDataWriter.java
U maven-eclipse-plugin/src/main/java/org/apache/maven/plugin/eclipse/writers/wtp/EclipseWtpApplicationXMLWriter.java
U maven-eclipse-plugin/src/main/java/org/apache/maven/plugin/eclipse/writers/wtp/EclipseWtpFacetsWriter.java
U maven-eclipse-plugin/src/main/java/org/apache/maven/plugin/eclipse/writers/wtp/AbstractWtpResourceWriter.java
U maven-eclipse-plugin/src/main/java/org/apache/maven/plugin/eclipse/writers/wtp/EclipseWtpComponent15Writer.java
U maven-eclipse-plugin/src/main/java/org/apache/maven/plugin/eclipse/writers/wtp/EclipseWtpmodulesWriter.java
U maven-eclipse-plugin/src/main/java/org/apache/maven/plugin/eclipse/writers/wtp/EclipseWtpComponentWriter.java
U maven-eclipse-plugin/src/main/java/org/apache/maven/plugin/eclipse/writers/AbstractEclipseManifestWriter.java
U maven-eclipse-plugin/src/main/java/org/apache/maven/plugin/eclipse/writers/workspace/WorkspaceWriter.java
U maven-eclipse-plugin/src/main/java/org/apache/maven/plugin/eclipse/writers/workspace/EclipseWorkspaceWriter.java
U maven-eclipse-plugin/src/main/java/org/apache/maven/plugin/eclipse/writers/workspace/EclipseSettingsWriter.java
U maven-eclipse-plugin/src/main/java/org/apache/maven/plugin/eclipse/writers/workspace/EclipseCodeFormatterProfile.java
U maven-eclipse-plugin/src/main/java/org/apache/maven/plugin/eclipse/reader/ReadWorkspaceLocations.java
U maven-eclipse-plugin/src/main/java/org/apache/maven/plugin/eclipse/WorkspaceDependencyResolveMojo.java
U maven-eclipse-plugin/src/main/java/org/apache/maven/plugin/eclipse/MyEclipseCleanMojo.java
U maven-eclipse-plugin/src/main/java/org/apache/maven/plugin/eclipse/ConfigureWorkspaceMojo.java
U maven-eclipse-plugin/src/main/java/org/apache/maven/plugin/eclipse/RadPlugin.java
U maven-eclipse-plugin/src/main/java/org/apache/maven/plugin/eclipse/WorkspaceConfiguration.java
U maven-eclipse-plugin/pom.xml
U maven-shade-plugin/pom.xml
U maven-plugins/pom.xml
U maven-changelog-plugin/src/main/java/org/apache/maven/plugin/changelog/ChangeLogReport.java
A maven-changelog-plugin/src/main/java/org/apache/maven/scm
A maven-changelog-plugin/src/main/java/org/apache/maven/scm/provider
A maven-changelog-plugin/src/main/java/org/apache/maven/scm/provider/svn
A maven-changelog-plugin/src/main/java/org/apache/maven/scm/provider/svn/svnexe
A maven-changelog-plugin/src/main/java/org/apache/maven/scm/provider/svn/svnexe/command
A maven-changelog-plugin/src/main/java/org/apache/maven/scm/provider/svn/svnexe/command/info
AU maven-changelog-plugin/src/main/java/org/apache/maven/scm/provider/svn/svnexe/command/info/SvnInfoCommandExpanded.java
U maven-changelog-plugin/pom.xml
U maven-changelog-plugin
U maven-war-plugin/pom.xml
U maven-checkstyle-plugin/pom.xml
U maven-remote-resources-plugin/pom.xml
U maven-stage-plugin/pom.xml
U maven-site-plugin/pom.xml
U maven-javadoc-plugin/pom.xml
U maven-pdf-plugin/pom.xml
U maven-pdf-plugin/src/site/apt/limitations.apt
U maven-compiler-plugin/pom.xml
U maven-verifier-plugin/pom.xml
U maven-jar-plugin/pom.xml
U maven-invoker-plugin/pom.xml
U maven-gpg-plugin/pom.xml
U maven-dependency-plugin/pom.xml
U maven-assembly-plugin/pom.xml
U maven-repository-plugin/pom.xml
U maven-pmd-plugin/pom.xml
U maven-clean-plugin/pom.xml
U maven-docck-plugin/pom.xml
U maven-doap-plugin/pom.xml
U maven-rar-plugin/pom.xml
U maven-scm-publish-plugin/src/main/java/org/apache/maven/plugins/scmpublish/ScmPublishPublishScmMojo.java
U maven-scm-publish-plugin/pom.xml
U maven-help-plugin/pom.xml
U maven-linkcheck-plugin/pom.xml
U maven-project-info-reports-plugin/pom.xml
U maven-deploy-plugin/pom.xml
U maven-patch-plugin/pom.xml
U maven-ejb-plugin/pom.xml
U maven-source-plugin/pom.xml
U maven-toolchains-plugin/pom.xml
U maven-acr-plugin/pom.xml
U maven-install-plugin/pom.xml
At revision 1705367
provisoning config files...
copy managed file [simple-deploy-settings-no-mirror] to file:/tmp/config8019691870669872119tmp
[maven-plugins-ITs-m2] $ /home/jenkins/tools/maven/apache-maven-2.2.1/bin/mvn clean verify -Prun-its,!maven-3_jdk5,!maven-3_jdk6 -U -B -V -fae -s /tmp/config8019691870669872119tmp -e
+ Error stacktraces are turned on.
Apache Maven 2.2.1 (r801777; 2009-08-06 19:16:01+0000)
Java version: 1.6.0_45
Java home: /home/jenkins/tools/java/jdk1.6.0_45-32/jre
Default locale: en_US, platform encoding: ISO-8859-1
OS name: "linux" version: "3.13.0-36-lowlatency" arch: "i386" Family: "unix"
[INFO] Scanning for projects...
Downloading: http://repo1.maven.org/maven2/org/apache/maven/maven-parent/27/maven-parent-27.pom
39K downloaded (maven-parent-27.pom)
[INFO] ------------------------------------------------------------------------
[ERROR] BUILD FAILURE
[INFO] ------------------------------------------------------------------------
[INFO] The projects in the reactor contain a cyclic reference: Edge between 'Vertex{label='org.apache.maven.plugins:maven-invoker-plugin'}' and 'Vertex{label='org.apache.maven.plugins:maven-site-plugin'}' introduces to cycle in the graph org.apache.maven.plugins:maven-site-plugin --> org.apache.maven.plugins:maven-invoker-plugin --> org.apache.maven.plugins:maven-site-plugin
[INFO] ------------------------------------------------------------------------
[INFO] Trace
org.apache.maven.BuildFailureException: The projects in the reactor contain a cyclic reference: Edge between 'Vertex{label='org.apache.maven.plugins:maven-invoker-plugin'}' and 'Vertex{label='org.apache.maven.plugins:maven-site-plugin'}' introduces to cycle in the graph org.apache.maven.plugins:maven-site-plugin --> org.apache.maven.plugins:maven-invoker-plugin --> org.apache.maven.plugins:maven-site-plugin
at org.apache.maven.DefaultMaven.doExecute(DefaultMaven.java:295)
at org.apache.maven.DefaultMaven.execute(DefaultMaven.java:138)
at org.apache.maven.cli.MavenCli.main(MavenCli.java:362)
at org.apache.maven.cli.compat.CompatibleMain.main(CompatibleMain.java:60)
at sun.reflect.NativeMethodAccessorImpl.invoke0(Native Method)
at sun.reflect.NativeMethodAccessorImpl.invoke(NativeMethodAccessorImpl.java:39)
at sun.reflect.DelegatingMethodAccessorImpl.invoke(DelegatingMethodAccessorImpl.java:25)
at java.lang.reflect.Method.invoke(Method.java:597)
at org.codehaus.classworlds.Launcher.launchEnhanced(Launcher.java:315)
at org.codehaus.classworlds.Launcher.launch(Launcher.java:255)
at org.codehaus.classworlds.Launcher.mainWithExitCode(Launcher.java:430)
at org.codehaus.classworlds.Launcher.main(Launcher.java:375)
Caused by: hidden.org.codehaus.plexus.util.dag.CycleDetectedException: Edge between 'Vertex{label='org.apache.maven.plugins:maven-invoker-plugin'}' and 'Vertex{label='org.apache.maven.plugins:maven-site-plugin'}' introduces to cycle in the graph org.apache.maven.plugins:maven-site-plugin --> org.apache.maven.plugins:maven-invoker-plugin --> org.apache.maven.plugins:maven-site-plugin
at hidden.org.codehaus.plexus.util.dag.DAG.addEdge(DAG.java:143)
at hidden.org.codehaus.plexus.util.dag.DAG.addEdge(DAG.java:123)
at org.apache.maven.project.ProjectSorter.addEdgeWithParentCheck(ProjectSorter.java:362)
at org.apache.maven.project.ProjectSorter.<init>(ProjectSorter.java:146)
at org.apache.maven.execution.ReactorManager.<init>(ReactorManager.java:99)
at org.apache.maven.DefaultMaven.doExecute(DefaultMaven.java:288)
... 11 more
[INFO] ------------------------------------------------------------------------
[INFO] Total time: 1 second
[INFO] Finished at: Fri Sep 25 22:31:58 UTC 2015
[INFO] Final Memory: 10M/109M
[INFO] ------------------------------------------------------------------------
Build step 'Invoke top-level Maven targets' marked build as failure
Build failed in Jenkins: maven-plugins-ITs-m2 #2198
Posted by Apache Jenkins Server <je...@builds.apache.org>.
See <https://builds.apache.org/job/maven-plugins-ITs-m2/2198/changes>
Changes:
[khmarbaise] [MPDF-76] Maven Parent Version 27
Undone the pom upgrade step cause i have mistaken that.
[Robert Scholte] Make ITs JDK9 ready. maven-ant-plugin uses value of source/target parameter of maven-compiler-plugin, so can't use expressions here.
------------------------------------------
[...truncated 19346 lines...]
A maven-ant-plugin/src/it/ear-it/servlets/servlet/src/main
A maven-ant-plugin/src/it/ear-it/servlets/servlet/src/main/webapp
A maven-ant-plugin/src/it/ear-it/servlets/servlet/src/main/webapp/WEB-INF
AU maven-ant-plugin/src/it/ear-it/servlets/servlet/src/main/webapp/WEB-INF/web.xml
AU maven-ant-plugin/src/it/ear-it/servlets/servlet/src/main/webapp/index.jsp
AU maven-ant-plugin/src/it/ear-it/servlets/servlet/pom.xml
A maven-ant-plugin/src/it/ear-it/src
A maven-ant-plugin/src/it/ear-it/src/main
A maven-ant-plugin/src/it/ear-it/src/main/resources
AU maven-ant-plugin/src/it/ear-it/invoker.properties
A maven-ant-plugin/src/it/ear-it/projects
A maven-ant-plugin/src/it/ear-it/projects/logging
A maven-ant-plugin/src/it/ear-it/projects/logging/src
A maven-ant-plugin/src/it/ear-it/projects/logging/src/main
A maven-ant-plugin/src/it/ear-it/projects/logging/src/main/java
A maven-ant-plugin/src/it/ear-it/projects/logging/src/main/java/test
AU maven-ant-plugin/src/it/ear-it/projects/logging/src/main/java/test/Log.java
AU maven-ant-plugin/src/it/ear-it/projects/logging/pom.xml
AU maven-ant-plugin/src/it/ear-it/projects/pom.xml
AU maven-ant-plugin/src/it/ear-it/pom.xml
A maven-ant-plugin/src/it/javadoc-it
AU maven-ant-plugin/src/it/javadoc-it/pom.xml
A maven-ant-plugin/src/it/javadoc-it/src
A maven-ant-plugin/src/it/javadoc-it/src/main
A maven-ant-plugin/src/it/javadoc-it/src/main/java
AU maven-ant-plugin/src/it/javadoc-it/src/main/java/Main.java
A maven-ant-plugin/src/test
A maven-ant-plugin/src/test/java
A maven-ant-plugin/src/test/java/org
A maven-ant-plugin/src/test/java/org/apache
A maven-ant-plugin/src/test/java/org/apache/maven
A maven-ant-plugin/src/test/java/org/apache/maven/plugin
A maven-ant-plugin/src/test/java/org/apache/maven/plugin/ant
AU maven-ant-plugin/src/test/java/org/apache/maven/plugin/ant/AntWrapper.java
AU maven-ant-plugin/src/test/java/org/apache/maven/plugin/ant/AntMojoTest.java
AU maven-ant-plugin/src/test/java/org/apache/maven/plugin/ant/AntBuildWriterUtilTest.java
AU maven-ant-plugin/src/test/java/org/apache/maven/plugin/ant/AntBuildWriterTest.java
A maven-ant-plugin/src/test/java/org/apache/maven/plugin/ant/stubs
AU maven-ant-plugin/src/test/java/org/apache/maven/plugin/ant/stubs/AntTestMavenProjectStub.java
AU maven-ant-plugin/src/test/java/org/apache/maven/plugin/ant/stubs/SettingsStub.java
AU maven-ant-plugin/src/test/java/org/apache/maven/plugin/ant/stubs/AbstractAntTestMavenProjectStub.java
AU maven-ant-plugin/src/test/java/org/apache/maven/plugin/ant/stubs/JavadocTestMavenProjectStub.java
AU maven-ant-plugin/src/test/java/org/apache/maven/plugin/ant/stubs/AntNoDepTestMavenProjectStub.java
A maven-ant-plugin/src/test/resources
A maven-ant-plugin/src/test/resources/unit
A maven-ant-plugin/src/test/resources/unit/ant-war-config-test
AU maven-ant-plugin/src/test/resources/unit/ant-war-config-test/pom.xml
A maven-ant-plugin/src/test/resources/unit/ant-compiler-config-test
AU maven-ant-plugin/src/test/resources/unit/ant-compiler-config-test/pom.xml
A maven-ant-plugin/src/test/resources/unit/ant-test
A maven-ant-plugin/src/test/resources/unit/ant-test/src
A maven-ant-plugin/src/test/resources/unit/ant-test/src/test
A maven-ant-plugin/src/test/resources/unit/ant-test/src/test/resources
AU maven-ant-plugin/src/test/resources/unit/ant-test/src/test/resources/test.txt
A maven-ant-plugin/src/test/resources/unit/ant-test/src/test/java
A maven-ant-plugin/src/test/resources/unit/ant-test/src/test/java/org
A maven-ant-plugin/src/test/resources/unit/ant-test/src/test/java/org/apache
A maven-ant-plugin/src/test/resources/unit/ant-test/src/test/java/org/apache/maven
A maven-ant-plugin/src/test/resources/unit/ant-test/src/test/java/org/apache/maven/plugins
A maven-ant-plugin/src/test/resources/unit/ant-test/src/test/java/org/apache/maven/plugins/ant
A maven-ant-plugin/src/test/resources/unit/ant-test/src/test/java/org/apache/maven/plugins/ant/test
AU maven-ant-plugin/src/test/resources/unit/ant-test/src/test/java/org/apache/maven/plugins/ant/test/AppTest.java
A maven-ant-plugin/src/test/resources/unit/ant-test/src/main
A maven-ant-plugin/src/test/resources/unit/ant-test/src/main/java
A maven-ant-plugin/src/test/resources/unit/ant-test/src/main/java/org
A maven-ant-plugin/src/test/resources/unit/ant-test/src/main/java/org/apache
A maven-ant-plugin/src/test/resources/unit/ant-test/src/main/java/org/apache/maven
A maven-ant-plugin/src/test/resources/unit/ant-test/src/main/java/org/apache/maven/plugins
A maven-ant-plugin/src/test/resources/unit/ant-test/src/main/java/org/apache/maven/plugins/ant
A maven-ant-plugin/src/test/resources/unit/ant-test/src/main/java/org/apache/maven/plugins/ant/test
AU maven-ant-plugin/src/test/resources/unit/ant-test/src/main/java/org/apache/maven/plugins/ant/test/App.java
A maven-ant-plugin/src/test/resources/unit/ant-test/src/main/resources
AU maven-ant-plugin/src/test/resources/unit/ant-test/src/main/resources/main.txt
AU maven-ant-plugin/src/test/resources/unit/ant-test/pom.xml
A maven-ant-plugin/src/test/resources/unit/ant-nodep-test
AU maven-ant-plugin/src/test/resources/unit/ant-nodep-test/pom.xml
A maven-ant-plugin/src/test/resources/unit/ant-nodep-test/src
A maven-ant-plugin/src/test/resources/unit/ant-nodep-test/src/main
A maven-ant-plugin/src/test/resources/unit/ant-nodep-test/src/main/java
A maven-ant-plugin/src/test/resources/unit/ant-nodep-test/src/main/java/org
A maven-ant-plugin/src/test/resources/unit/ant-nodep-test/src/main/java/org/apache
A maven-ant-plugin/src/test/resources/unit/ant-nodep-test/src/main/java/org/apache/maven
A maven-ant-plugin/src/test/resources/unit/ant-nodep-test/src/main/java/org/apache/maven/plugins
A maven-ant-plugin/src/test/resources/unit/ant-nodep-test/src/main/java/org/apache/maven/plugins/ant
A maven-ant-plugin/src/test/resources/unit/ant-nodep-test/src/main/java/org/apache/maven/plugins/ant/test
AU maven-ant-plugin/src/test/resources/unit/ant-nodep-test/src/main/java/org/apache/maven/plugins/ant/test/App.java
A maven-ant-plugin/src/test/resources/unit/ant-nodep-test/src/main/resources
AU maven-ant-plugin/src/test/resources/unit/ant-nodep-test/src/main/resources/main.txt
A maven-ant-plugin/src/test/resources/unit/ant-javadoc-test
A maven-ant-plugin/src/test/resources/unit/ant-javadoc-test/src
A maven-ant-plugin/src/test/resources/unit/ant-javadoc-test/src/test
A maven-ant-plugin/src/test/resources/unit/ant-javadoc-test/src/test/java
A maven-ant-plugin/src/test/resources/unit/ant-javadoc-test/src/test/java/org
A maven-ant-plugin/src/test/resources/unit/ant-javadoc-test/src/test/java/org/apache
A maven-ant-plugin/src/test/resources/unit/ant-javadoc-test/src/test/java/org/apache/maven
A maven-ant-plugin/src/test/resources/unit/ant-javadoc-test/src/test/java/org/apache/maven/plugins
A maven-ant-plugin/src/test/resources/unit/ant-javadoc-test/src/test/java/org/apache/maven/plugins/ant
A maven-ant-plugin/src/test/resources/unit/ant-javadoc-test/src/test/java/org/apache/maven/plugins/ant/test
AU maven-ant-plugin/src/test/resources/unit/ant-javadoc-test/src/test/java/org/apache/maven/plugins/ant/test/AppTest.java
A maven-ant-plugin/src/test/resources/unit/ant-javadoc-test/src/test/resources
AU maven-ant-plugin/src/test/resources/unit/ant-javadoc-test/src/test/resources/test.txt
A maven-ant-plugin/src/test/resources/unit/ant-javadoc-test/src/main
A maven-ant-plugin/src/test/resources/unit/ant-javadoc-test/src/main/resources
AU maven-ant-plugin/src/test/resources/unit/ant-javadoc-test/src/main/resources/main.txt
A maven-ant-plugin/src/test/resources/unit/ant-javadoc-test/src/main/java
A maven-ant-plugin/src/test/resources/unit/ant-javadoc-test/src/main/java/org
A maven-ant-plugin/src/test/resources/unit/ant-javadoc-test/src/main/java/org/apache
A maven-ant-plugin/src/test/resources/unit/ant-javadoc-test/src/main/java/org/apache/maven
A maven-ant-plugin/src/test/resources/unit/ant-javadoc-test/src/main/java/org/apache/maven/plugins
A maven-ant-plugin/src/test/resources/unit/ant-javadoc-test/src/main/java/org/apache/maven/plugins/ant
A maven-ant-plugin/src/test/resources/unit/ant-javadoc-test/src/main/java/org/apache/maven/plugins/ant/test
AU maven-ant-plugin/src/test/resources/unit/ant-javadoc-test/src/main/java/org/apache/maven/plugins/ant/test/App.java
AU maven-ant-plugin/src/test/resources/unit/ant-javadoc-test/pom.xml
AU maven-ant-plugin/deploySite.sh
AU maven-ant-plugin/pom.xml
A maven-doap-plugin
A maven-doap-plugin/src
A maven-doap-plugin/src/main
A maven-doap-plugin/src/main/resources
AU maven-doap-plugin/src/main/resources/doap-person.properties
AU maven-doap-plugin/src/main/resources/doap-person_en.properties
AU maven-doap-plugin/src/main/resources/doap-person_es.properties
AU maven-doap-plugin/src/main/resources/doap-person_fr.properties
AU maven-doap-plugin/src/main/resources/doap-person_de.properties
A maven-doap-plugin/src/main/mdo
AU maven-doap-plugin/src/main/mdo/doapOptions.mdo
AU maven-doap-plugin/src/main/mdo/asfextOptions.mdo
AU maven-doap-plugin/src/main/mdo/extOptions.mdo
A maven-doap-plugin/src/main/java
A maven-doap-plugin/src/main/java/org
A maven-doap-plugin/src/main/java/org/apache
A maven-doap-plugin/src/main/java/org/apache/maven
A maven-doap-plugin/src/main/java/org/apache/maven/plugin
A maven-doap-plugin/src/main/java/org/apache/maven/plugin/doap
AU maven-doap-plugin/src/main/java/org/apache/maven/plugin/doap/DoapMojo.java
A maven-doap-plugin/src/main/java/org/apache/maven/plugin/doap/options
AU maven-doap-plugin/src/main/java/org/apache/maven/plugin/doap/options/ASFExtOptionsUtil.java
AU maven-doap-plugin/src/main/java/org/apache/maven/plugin/doap/DoapUtil.java
A maven-doap-plugin/src/site
AU maven-doap-plugin/src/site/site.xml
A maven-doap-plugin/src/site/apt
A maven-doap-plugin/src/site/apt/examples
AU maven-doap-plugin/src/site/apt/examples/doap-in-use.apt
AU maven-doap-plugin/src/site/apt/examples/with-site-plugin.apt.vm
AU maven-doap-plugin/src/site/apt/links.apt
AU maven-doap-plugin/src/site/apt/usage.apt.vm
AU maven-doap-plugin/src/site/apt/index.apt.vm
A maven-doap-plugin/src/site/resources
A maven-doap-plugin/src/site/resources/download.cgi
A maven-doap-plugin/src/site/xdoc
A maven-doap-plugin/src/site/xdoc/download.xml.vm
A maven-doap-plugin/src/site/fml
AU maven-doap-plugin/src/site/fml/faq.fml
A maven-doap-plugin/src/it
AU maven-doap-plugin/src/it/settings.xml
A maven-doap-plugin/src/it/basic
AU maven-doap-plugin/src/it/basic/pom.xml
AU maven-doap-plugin/src/it/basic/verify.bsh
A maven-doap-plugin/src/it/doapfile
AU maven-doap-plugin/src/it/doapfile/verify.bsh
AU maven-doap-plugin/src/it/doapfile/pom.xml
A maven-doap-plugin/src/it/minimal
AU maven-doap-plugin/src/it/minimal/pom.xml
AU maven-doap-plugin/src/it/minimal/verify.bsh
A maven-doap-plugin/src/it/MDOAP-38
AU maven-doap-plugin/src/it/MDOAP-38/invoker.properties
AU maven-doap-plugin/src/it/MDOAP-38/verify.groovy
AU maven-doap-plugin/src/it/MDOAP-38/pom.xml
A maven-doap-plugin/src/test
A maven-doap-plugin/src/test/java
A maven-doap-plugin/src/test/java/org
A maven-doap-plugin/src/test/java/org/apache
A maven-doap-plugin/src/test/java/org/apache/maven
A maven-doap-plugin/src/test/java/org/apache/maven/plugin
A maven-doap-plugin/src/test/java/org/apache/maven/plugin/doap
A maven-doap-plugin/src/test/java/org/apache/maven/plugin/doap/stubs
AU maven-doap-plugin/src/test/java/org/apache/maven/plugin/doap/stubs/AsfDoapProjectStub.java
AU maven-doap-plugin/src/test/java/org/apache/maven/plugin/doap/stubs/DoapProjectStub.java
AU maven-doap-plugin/src/test/java/org/apache/maven/plugin/doap/DoapUtilTest.java
AU maven-doap-plugin/src/test/java/org/apache/maven/plugin/doap/DoapMojoTest.java
A maven-doap-plugin/src/test/resources
AU maven-doap-plugin/src/test/resources/generated-doap-1.0.rdf
A maven-doap-plugin/src/test/resources/org
A maven-doap-plugin/src/test/resources/org/apache
A maven-doap-plugin/src/test/resources/org/apache/maven
A maven-doap-plugin/src/test/resources/org/apache/maven/plugin
A maven-doap-plugin/src/test/resources/org/apache/maven/plugin/doap
AU maven-doap-plugin/src/test/resources/org/apache/maven/plugin/doap/DoapUtilTest.xml
A maven-doap-plugin/src/test/resources/unit
A maven-doap-plugin/src/test/resources/unit/doap-configuration
AU maven-doap-plugin/src/test/resources/unit/doap-configuration/doap-configuration-plugin-config.xml
AU maven-doap-plugin/src/test/resources/unit/doap-configuration/doap-extra-configuration-plugin-config.xml
A maven-doap-plugin/src/test/resources/unit/asf-doap-configuration
AU maven-doap-plugin/src/test/resources/unit/asf-doap-configuration/asf-doap-configuration-plugin-config.xml
AU maven-doap-plugin/deploySite.sh
AU maven-doap-plugin/pom.xml
U .
At revision 1705337
provisoning config files...
copy managed file [simple-deploy-settings-no-mirror] to file:/tmp/config6066704389049159397tmp
[maven-plugins-ITs-m2] $ /home/jenkins/tools/maven/apache-maven-2.2.1/bin/mvn clean verify -Prun-its,!maven-3_jdk5,!maven-3_jdk6 -U -B -V -fae -s /tmp/config6066704389049159397tmp -e
+ Error stacktraces are turned on.
Apache Maven 2.2.1 (r801777; 2009-08-06 19:16:01+0000)
Java version: 1.6.0_45
Java home: /home/jenkins/tools/java/jdk1.6.0_45-32/jre
Default locale: en_US, platform encoding: UTF-8
OS name: "linux" version: "3.13.0-30-generic" arch: "i386" Family: "unix"
[INFO] Scanning for projects...
Downloading: http://repo1.maven.org/maven2/org/apache/maven/maven-parent/24/maven-parent-24.pom
36K downloaded (maven-parent-24.pom)
Downloading: http://repo1.maven.org/maven2/org/apache/apache/14/apache-14.pom
14K downloaded (apache-14.pom)
Downloading: http://repo1.maven.org/maven2/org/apache/maven/maven-parent/27/maven-parent-27.pom
39K downloaded (maven-parent-27.pom)
Downloading: http://repo1.maven.org/maven2/org/apache/apache/17/apache-17.pom
15K downloaded (apache-17.pom)
[INFO] ------------------------------------------------------------------------
[ERROR] BUILD FAILURE
[INFO] ------------------------------------------------------------------------
[INFO] The projects in the reactor contain a cyclic reference: Edge between 'Vertex{label='org.apache.maven.plugins:maven-invoker-plugin'}' and 'Vertex{label='org.apache.maven.plugins:maven-site-plugin'}' introduces to cycle in the graph org.apache.maven.plugins:maven-site-plugin --> org.apache.maven.plugins:maven-invoker-plugin --> org.apache.maven.plugins:maven-site-plugin
[INFO] ------------------------------------------------------------------------
[INFO] Trace
org.apache.maven.BuildFailureException: The projects in the reactor contain a cyclic reference: Edge between 'Vertex{label='org.apache.maven.plugins:maven-invoker-plugin'}' and 'Vertex{label='org.apache.maven.plugins:maven-site-plugin'}' introduces to cycle in the graph org.apache.maven.plugins:maven-site-plugin --> org.apache.maven.plugins:maven-invoker-plugin --> org.apache.maven.plugins:maven-site-plugin
at org.apache.maven.DefaultMaven.doExecute(DefaultMaven.java:295)
at org.apache.maven.DefaultMaven.execute(DefaultMaven.java:138)
at org.apache.maven.cli.MavenCli.main(MavenCli.java:362)
at org.apache.maven.cli.compat.CompatibleMain.main(CompatibleMain.java:60)
at sun.reflect.NativeMethodAccessorImpl.invoke0(Native Method)
at sun.reflect.NativeMethodAccessorImpl.invoke(NativeMethodAccessorImpl.java:39)
at sun.reflect.DelegatingMethodAccessorImpl.invoke(DelegatingMethodAccessorImpl.java:25)
at java.lang.reflect.Method.invoke(Method.java:597)
at org.codehaus.classworlds.Launcher.launchEnhanced(Launcher.java:315)
at org.codehaus.classworlds.Launcher.launch(Launcher.java:255)
at org.codehaus.classworlds.Launcher.mainWithExitCode(Launcher.java:430)
at org.codehaus.classworlds.Launcher.main(Launcher.java:375)
Caused by: hidden.org.codehaus.plexus.util.dag.CycleDetectedException: Edge between 'Vertex{label='org.apache.maven.plugins:maven-invoker-plugin'}' and 'Vertex{label='org.apache.maven.plugins:maven-site-plugin'}' introduces to cycle in the graph org.apache.maven.plugins:maven-site-plugin --> org.apache.maven.plugins:maven-invoker-plugin --> org.apache.maven.plugins:maven-site-plugin
at hidden.org.codehaus.plexus.util.dag.DAG.addEdge(DAG.java:143)
at hidden.org.codehaus.plexus.util.dag.DAG.addEdge(DAG.java:123)
at org.apache.maven.project.ProjectSorter.addEdgeWithParentCheck(ProjectSorter.java:362)
at org.apache.maven.project.ProjectSorter.<init>(ProjectSorter.java:146)
at org.apache.maven.execution.ReactorManager.<init>(ReactorManager.java:99)
at org.apache.maven.DefaultMaven.doExecute(DefaultMaven.java:288)
... 11 more
[INFO] ------------------------------------------------------------------------
[INFO] Total time: 2 seconds
[INFO] Finished at: Fri Sep 25 18:20:57 UTC 2015
[INFO] Final Memory: 10M/77M
[INFO] ------------------------------------------------------------------------
Build step 'Invoke top-level Maven targets' marked build as failure
Build failed in Jenkins: maven-plugins-ITs-m2 #2197
Posted by Apache Jenkins Server <je...@builds.apache.org>.
See <https://builds.apache.org/job/maven-plugins-ITs-m2/2197/changes>
Changes:
[khmarbaise] [MPDF-77] Remove limitations documentation for Maven 2.0.6
[Robert Scholte] Add merge for rat excludes
Add license to WorkspaceDependencyResolveMojo
[khmarbaise] [MPDF-76] Maven Parent Version 27
------------------------------------------
Started by an SCM change
[EnvInject] - Loading node environment variables.
Building remotely on ubuntu-6 (docker Ubuntu ubuntu) in workspace <https://builds.apache.org/job/maven-plugins-ITs-m2/ws/>
Updating http://svn.apache.org/repos/asf/maven/plugins/trunk at revision '2015-09-25T16:14:14.877 +0000'
U maven-ant-plugin/pom.xml
U maven-doap-plugin/pom.xml
U maven-jarsigner-plugin/pom.xml
U maven-eclipse-plugin/src/main/java/org/apache/maven/plugin/eclipse/WorkspaceDependencyResolveMojo.java
U maven-eclipse-plugin/pom.xml
U maven-shade-plugin/pom.xml
A maven-changelog-plugin/src/main/java/org/apache/maven/scm
A maven-changelog-plugin/src/main/java/org/apache/maven/scm/provider
A maven-changelog-plugin/src/main/java/org/apache/maven/scm/provider/svn
A maven-changelog-plugin/src/main/java/org/apache/maven/scm/provider/svn/svnexe
A maven-changelog-plugin/src/main/java/org/apache/maven/scm/provider/svn/svnexe/command
A maven-changelog-plugin/src/main/java/org/apache/maven/scm/provider/svn/svnexe/command/info
AU maven-changelog-plugin/src/main/java/org/apache/maven/scm/provider/svn/svnexe/command/info/SvnInfoCommandExpanded.java
U maven-changelog-plugin/src/main/java/org/apache/maven/plugin/changelog/ChangeLogReport.java
U maven-changelog-plugin/pom.xml
U maven-changelog-plugin
U maven-help-plugin/pom.xml
U maven-war-plugin/pom.xml
U maven-project-info-reports-plugin/pom.xml
U maven-deploy-plugin/pom.xml
U maven-source-plugin/pom.xml
U maven-toolchains-plugin/pom.xml
U maven-stage-plugin/pom.xml
U maven-antrun-plugin/pom.xml
U maven-javadoc-plugin/pom.xml
U maven-pdf-plugin/src/site/site.xml
U maven-pdf-plugin/src/site/apt/limitations.apt
U maven-jar-plugin/pom.xml
U maven-invoker-plugin/pom.xml
U maven-gpg-plugin/pom.xml
U maven-pmd-plugin/pom.xml
U maven-clean-plugin/pom.xml
U maven-docck-plugin/pom.xml
U maven-rar-plugin/pom.xml
U maven-plugins/pom.xml
U maven-scm-publish-plugin/pom.xml
U maven-linkcheck-plugin/pom.xml
U maven-checkstyle-plugin/pom.xml
U maven-patch-plugin/pom.xml
U maven-ejb-plugin/pom.xml
U maven-remote-resources-plugin/pom.xml
U maven-site-plugin/pom.xml
U maven-acr-plugin/pom.xml
U maven-install-plugin/pom.xml
U maven-ear-plugin/pom.xml
U maven-changes-plugin/pom.xml
U maven-compiler-plugin/pom.xml
U maven-resources-plugin/pom.xml
U maven-verifier-plugin/pom.xml
U maven-dependency-plugin/pom.xml
U maven-assembly-plugin/pom.xml
U maven-repository-plugin/pom.xml
At revision 1705327
provisoning config files...
copy managed file [simple-deploy-settings-no-mirror] to file:/tmp/config7811141701883171667tmp
[maven-plugins-ITs-m2] $ /home/jenkins/tools/maven/apache-maven-2.2.1/bin/mvn clean verify -Prun-its,!maven-3_jdk5,!maven-3_jdk6 -U -B -V -fae -s /tmp/config7811141701883171667tmp -e
+ Error stacktraces are turned on.
Apache Maven 2.2.1 (r801777; 2009-08-06 19:16:01+0000)
Java version: 1.6.0_45
Java home: /home/jenkins/tools/java/jdk1.6.0_45-32/jre
Default locale: en_US, platform encoding: ISO-8859-1
OS name: "linux" version: "3.13.0-36-lowlatency" arch: "i386" Family: "unix"
[INFO] Scanning for projects...
[INFO] ------------------------------------------------------------------------
[ERROR] BUILD FAILURE
[INFO] ------------------------------------------------------------------------
[INFO] The projects in the reactor contain a cyclic reference: Edge between 'Vertex{label='org.apache.maven.plugins:maven-invoker-plugin'}' and 'Vertex{label='org.apache.maven.plugins:maven-site-plugin'}' introduces to cycle in the graph org.apache.maven.plugins:maven-site-plugin --> org.apache.maven.plugins:maven-invoker-plugin --> org.apache.maven.plugins:maven-site-plugin
[INFO] ------------------------------------------------------------------------
[INFO] Trace
org.apache.maven.BuildFailureException: The projects in the reactor contain a cyclic reference: Edge between 'Vertex{label='org.apache.maven.plugins:maven-invoker-plugin'}' and 'Vertex{label='org.apache.maven.plugins:maven-site-plugin'}' introduces to cycle in the graph org.apache.maven.plugins:maven-site-plugin --> org.apache.maven.plugins:maven-invoker-plugin --> org.apache.maven.plugins:maven-site-plugin
at org.apache.maven.DefaultMaven.doExecute(DefaultMaven.java:295)
at org.apache.maven.DefaultMaven.execute(DefaultMaven.java:138)
at org.apache.maven.cli.MavenCli.main(MavenCli.java:362)
at org.apache.maven.cli.compat.CompatibleMain.main(CompatibleMain.java:60)
at sun.reflect.NativeMethodAccessorImpl.invoke0(Native Method)
at sun.reflect.NativeMethodAccessorImpl.invoke(NativeMethodAccessorImpl.java:39)
at sun.reflect.DelegatingMethodAccessorImpl.invoke(DelegatingMethodAccessorImpl.java:25)
at java.lang.reflect.Method.invoke(Method.java:597)
at org.codehaus.classworlds.Launcher.launchEnhanced(Launcher.java:315)
at org.codehaus.classworlds.Launcher.launch(Launcher.java:255)
at org.codehaus.classworlds.Launcher.mainWithExitCode(Launcher.java:430)
at org.codehaus.classworlds.Launcher.main(Launcher.java:375)
Caused by: hidden.org.codehaus.plexus.util.dag.CycleDetectedException: Edge between 'Vertex{label='org.apache.maven.plugins:maven-invoker-plugin'}' and 'Vertex{label='org.apache.maven.plugins:maven-site-plugin'}' introduces to cycle in the graph org.apache.maven.plugins:maven-site-plugin --> org.apache.maven.plugins:maven-invoker-plugin --> org.apache.maven.plugins:maven-site-plugin
at hidden.org.codehaus.plexus.util.dag.DAG.addEdge(DAG.java:143)
at hidden.org.codehaus.plexus.util.dag.DAG.addEdge(DAG.java:123)
at org.apache.maven.project.ProjectSorter.addEdgeWithParentCheck(ProjectSorter.java:362)
at org.apache.maven.project.ProjectSorter.<init>(ProjectSorter.java:146)
at org.apache.maven.execution.ReactorManager.<init>(ReactorManager.java:99)
at org.apache.maven.DefaultMaven.doExecute(DefaultMaven.java:288)
... 11 more
[INFO] ------------------------------------------------------------------------
[INFO] Total time: 1 second
[INFO] Finished at: Fri Sep 25 16:17:36 UTC 2015
[INFO] Final Memory: 10M/77M
[INFO] ------------------------------------------------------------------------
Build step 'Invoke top-level Maven targets' marked build as failure
Build failed in Jenkins: maven-plugins-ITs-m2 #2196
Posted by Apache Jenkins Server <je...@builds.apache.org>.
See <https://builds.apache.org/job/maven-plugins-ITs-m2/2196/changes>
Changes:
[dennisl] Oops, didn't mean to commit that change.
[dennisl] Ignore IDEA-directory.
[dennisl] [MCHANGELOG-79] Add support for "tag" type report of Subversion.
Submitted by: Jerome Lacoste and Samuel Van Reeth
Reviewed by: Dennis Lundberg
After removing all the whitespace changed I applied the patch from Samuel, which was based in part on the one from Jerome. I also added some error handling in case you configure a non-existing tag.
------------------------------------------
[...truncated 19338 lines...]
A maven-deploy-plugin/src/it/mdeploy-45-test/src/main/resources
AU maven-deploy-plugin/src/it/mdeploy-45-test/src/main/resources/foo.txt
A maven-deploy-plugin/src/it/mdeploy-45-test/src/main/webapp
A maven-deploy-plugin/src/it/mdeploy-45-test/src/main/webapp/WEB-INF
AU maven-deploy-plugin/src/it/mdeploy-45-test/src/main/webapp/WEB-INF/web.xml
AU maven-deploy-plugin/src/it/mdeploy-45-test/src/main/webapp/index.html
A maven-deploy-plugin/src/it/mdeploy-45-test/src/main/java
A maven-deploy-plugin/src/it/3rd-party-jar-with-extras
AU maven-deploy-plugin/src/it/3rd-party-jar-with-extras/test-0.1.tar.gz
AU maven-deploy-plugin/src/it/3rd-party-jar-with-extras/verify.bsh
AU maven-deploy-plugin/src/it/3rd-party-jar-with-extras/test-0.1-src.tar.gz
AU maven-deploy-plugin/src/it/3rd-party-jar-with-extras/test-0.1.jar
AU maven-deploy-plugin/src/it/3rd-party-jar-with-extras/invoker.properties
AU maven-deploy-plugin/src/it/3rd-party-jar-with-extras/pom.xml
AU maven-deploy-plugin/src/it/3rd-party-jar-with-extras/test.properties
AU maven-deploy-plugin/src/it/3rd-party-jar-with-extras/setup.bsh
AU maven-deploy-plugin/src/it/3rd-party-jar-with-extras/test-0.1.zip
A maven-deploy-plugin/src/it/MDEPLOY-181
A maven-deploy-plugin/src/it/MDEPLOY-181/module1
A maven-deploy-plugin/src/it/MDEPLOY-181/module1/pom.xml
A maven-deploy-plugin/src/it/MDEPLOY-181/module2
A maven-deploy-plugin/src/it/MDEPLOY-181/module2/pom.xml
A maven-deploy-plugin/src/it/MDEPLOY-181/invoker.properties
A maven-deploy-plugin/src/it/MDEPLOY-181/verify.groovy
A maven-deploy-plugin/src/it/MDEPLOY-181/pom.xml
A maven-deploy-plugin/src/it/MDEPLOY-181/test.properties
A maven-deploy-plugin/src/it/alt-deploy-repo-without-dist-mgmt
AU maven-deploy-plugin/src/it/alt-deploy-repo-without-dist-mgmt/pom.xml
AU maven-deploy-plugin/src/it/alt-deploy-repo-without-dist-mgmt/test.properties
AU maven-deploy-plugin/src/it/alt-deploy-repo-without-dist-mgmt/setup.bsh
AU maven-deploy-plugin/src/it/alt-deploy-repo-without-dist-mgmt/verify.bsh
A maven-deploy-plugin/src/it/offline
AU maven-deploy-plugin/src/it/offline/invoker.properties
AU maven-deploy-plugin/src/it/offline/pom.xml
AU maven-deploy-plugin/src/it/offline/setup.bsh
A maven-deploy-plugin/src/it/alt-deploy-repo-with-dist-mgmt-snapshot
AU maven-deploy-plugin/src/it/alt-deploy-repo-with-dist-mgmt-snapshot/pom.xml
AU maven-deploy-plugin/src/it/alt-deploy-repo-with-dist-mgmt-snapshot/test.properties
AU maven-deploy-plugin/src/it/alt-deploy-repo-with-dist-mgmt-snapshot/setup.bsh
AU maven-deploy-plugin/src/it/alt-deploy-repo-with-dist-mgmt-snapshot/verify.bsh
A maven-deploy-plugin/src/it/no-main-artifact-snapshot
AU maven-deploy-plugin/src/it/no-main-artifact-snapshot/pom.xml
AU maven-deploy-plugin/src/it/no-main-artifact-snapshot/setup.bsh
AU maven-deploy-plugin/src/it/no-main-artifact-snapshot/verify.bsh
A maven-deploy-plugin/src/it/no-main-artifact-1
AU maven-deploy-plugin/src/it/no-main-artifact-1/pom.xml
AU maven-deploy-plugin/src/it/no-main-artifact-1/setup.bsh
AU maven-deploy-plugin/src/it/no-main-artifact-1/verify.bsh
A maven-deploy-plugin/src/it/deploy-attached-sources
AU maven-deploy-plugin/src/it/deploy-attached-sources/verify.bsh
A maven-deploy-plugin/src/it/deploy-attached-sources/src
A maven-deploy-plugin/src/it/deploy-attached-sources/src/main
A maven-deploy-plugin/src/it/deploy-attached-sources/src/main/java
A maven-deploy-plugin/src/it/deploy-attached-sources/src/main/java/org
A maven-deploy-plugin/src/it/deploy-attached-sources/src/main/java/org/apache
A maven-deploy-plugin/src/it/deploy-attached-sources/src/main/java/org/apache/maven
A maven-deploy-plugin/src/it/deploy-attached-sources/src/main/java/org/apache/maven/test
AU maven-deploy-plugin/src/it/deploy-attached-sources/src/main/java/org/apache/maven/test/HelloWorld.java
A maven-deploy-plugin/src/it/deploy-attached-sources/src/main/resources
AU maven-deploy-plugin/src/it/deploy-attached-sources/src/main/resources/foo.txt
AU maven-deploy-plugin/src/it/deploy-attached-sources/invoker.properties
AU maven-deploy-plugin/src/it/deploy-attached-sources/pom.xml
AU maven-deploy-plugin/src/it/deploy-attached-sources/test.properties
AU maven-deploy-plugin/src/it/deploy-attached-sources/setup.bsh
A maven-deploy-plugin/src/it/MDEPLOY-169_deploy-at-end-multithread
A maven-deploy-plugin/src/it/MDEPLOY-169_deploy-at-end-multithread/module1
A maven-deploy-plugin/src/it/MDEPLOY-169_deploy-at-end-multithread/module1/pom.xml
A maven-deploy-plugin/src/it/MDEPLOY-169_deploy-at-end-multithread/module2
A maven-deploy-plugin/src/it/MDEPLOY-169_deploy-at-end-multithread/module2/pom.xml
A maven-deploy-plugin/src/it/MDEPLOY-169_deploy-at-end-multithread/invoker.properties
A maven-deploy-plugin/src/it/MDEPLOY-169_deploy-at-end-multithread/verify.groovy
A maven-deploy-plugin/src/it/MDEPLOY-169_deploy-at-end-multithread/pom.xml
A maven-deploy-plugin/src/it/no-main-artifact-2
AU maven-deploy-plugin/src/it/no-main-artifact-2/pom.xml
AU maven-deploy-plugin/src/it/no-main-artifact-2/setup.bsh
AU maven-deploy-plugin/src/it/no-main-artifact-2/verify.bsh
A maven-deploy-plugin/src/it/snapshot-pom
AU maven-deploy-plugin/src/it/snapshot-pom/pom.xml
AU maven-deploy-plugin/src/it/snapshot-pom/setup.bsh
AU maven-deploy-plugin/src/it/snapshot-pom/verify.bsh
A maven-deploy-plugin/src/it/alt-deploy-repo-with-dist-mgmt
AU maven-deploy-plugin/src/it/alt-deploy-repo-with-dist-mgmt/pom.xml
AU maven-deploy-plugin/src/it/alt-deploy-repo-with-dist-mgmt/test.properties
AU maven-deploy-plugin/src/it/alt-deploy-repo-with-dist-mgmt/setup.bsh
AU maven-deploy-plugin/src/it/alt-deploy-repo-with-dist-mgmt/verify.bsh
A maven-deploy-plugin/src/it/3rd-party-jar-without-pom
AU maven-deploy-plugin/src/it/3rd-party-jar-without-pom/verify.bsh
AU maven-deploy-plugin/src/it/3rd-party-jar-without-pom/test-0.1.jar
AU maven-deploy-plugin/src/it/3rd-party-jar-without-pom/invoker.properties
AU maven-deploy-plugin/src/it/3rd-party-jar-without-pom/pom.xml
AU maven-deploy-plugin/src/it/3rd-party-jar-without-pom/test.properties
AU maven-deploy-plugin/src/it/3rd-party-jar-without-pom/setup.bsh
A maven-deploy-plugin/src/it/release-jar
AU maven-deploy-plugin/src/it/release-jar/pom.xml
AU maven-deploy-plugin/src/it/release-jar/setup.bsh
AU maven-deploy-plugin/src/it/release-jar/verify.bsh
A maven-deploy-plugin/src/it/MDEPLOY-178_deployfile-with-embedded-pom
A maven-deploy-plugin/src/it/MDEPLOY-178_deployfile-with-embedded-pom/invoker.properties
A maven-deploy-plugin/src/it/MDEPLOY-178_deployfile-with-embedded-pom/verify.groovy
A maven-deploy-plugin/src/it/MDEPLOY-178_deployfile-with-embedded-pom/pom.xml
A maven-deploy-plugin/src/it/MDEPLOY-178_deployfile-with-embedded-pom/test.properties
A maven-deploy-plugin/src/it/attach-release-jar
AU maven-deploy-plugin/src/it/attach-release-jar/verify.bsh
AU maven-deploy-plugin/src/it/attach-release-jar/pom.xml
AU maven-deploy-plugin/src/it/attach-release-jar/setup.bsh
A maven-deploy-plugin/src/it/MDEPLOY-184_deployfile-with-javadoc-and-sources
A maven-deploy-plugin/src/it/MDEPLOY-184_deployfile-with-javadoc-and-sources/invoker.properties
A maven-deploy-plugin/src/it/MDEPLOY-184_deployfile-with-javadoc-and-sources/verify.groovy
A maven-deploy-plugin/src/it/MDEPLOY-184_deployfile-with-javadoc-and-sources/test.properties
A maven-deploy-plugin/src/it/MDEPLOY-184_deployfile-with-javadoc-and-sources/path
A maven-deploy-plugin/src/it/MDEPLOY-184_deployfile-with-javadoc-and-sources/path/to
AU maven-deploy-plugin/src/it/MDEPLOY-184_deployfile-with-javadoc-and-sources/path/to/artifact-name-1.0.jar
AU maven-deploy-plugin/src/it/MDEPLOY-184_deployfile-with-javadoc-and-sources/path/to/artifact-name-1.0-sources.jar
AU maven-deploy-plugin/src/it/MDEPLOY-184_deployfile-with-javadoc-and-sources/path/to/artifact-name-1.0-javadoc.jar
A maven-deploy-plugin/src/it/MDEPLOY-184_deployfile-with-javadoc-and-sources/path/to/pom.xml
AU maven-deploy-plugin/src/it/settings.xml
A maven-deploy-plugin/src/test
A maven-deploy-plugin/src/test/resources
A maven-deploy-plugin/src/test/resources/unit
A maven-deploy-plugin/src/test/resources/unit/deploy-file-classifier
A maven-deploy-plugin/src/test/resources/unit/deploy-file-classifier/target
AU maven-deploy-plugin/src/test/resources/unit/deploy-file-classifier/target/deploy-test-file-1.0-SNAPSHOT.jar
AU maven-deploy-plugin/src/test/resources/unit/deploy-file-classifier/plugin-config.xml
A maven-deploy-plugin/src/test/resources/unit/deploy-file-artifact-not-jar
AU maven-deploy-plugin/src/test/resources/unit/deploy-file-artifact-not-jar/plugin-config.xml
A maven-deploy-plugin/src/test/resources/unit/deploy-file-artifact-not-jar/target
AU maven-deploy-plugin/src/test/resources/unit/deploy-file-artifact-not-jar/target/deploy-test-file.zip
A maven-deploy-plugin/src/test/resources/unit/basic-deploy-with-attached-artifacts
AU maven-deploy-plugin/src/test/resources/unit/basic-deploy-with-attached-artifacts/plugin-config.xml
A maven-deploy-plugin/src/test/resources/unit/basic-deploy-with-attached-artifacts/target
AU maven-deploy-plugin/src/test/resources/unit/basic-deploy-with-attached-artifacts/target/deploy-test-file-1.0-SNAPSHOT.jar
A maven-deploy-plugin/src/test/resources/unit/basic-deploy-scp
A maven-deploy-plugin/src/test/resources/unit/basic-deploy-scp/target
AU maven-deploy-plugin/src/test/resources/unit/basic-deploy-scp/target/deploy-test-file-1.0-SNAPSHOT.jar
AU maven-deploy-plugin/src/test/resources/unit/basic-deploy-scp/plugin-config.xml
A maven-deploy-plugin/src/test/resources/unit/deploy-file-pom-file
A maven-deploy-plugin/src/test/resources/unit/deploy-file-pom-file/plugin-config.xml
A maven-deploy-plugin/src/test/resources/unit/deploy-file-pom-file/target
AU maven-deploy-plugin/src/test/resources/unit/deploy-file-pom-file/target/deploy-test-file-1.0-SNAPSHOT.jar
A maven-deploy-plugin/src/test/resources/unit/deploy-file-legacy-repository-layout
A maven-deploy-plugin/src/test/resources/unit/deploy-file-legacy-repository-layout/target
AU maven-deploy-plugin/src/test/resources/unit/deploy-file-legacy-repository-layout/target/deploy-test-file-1.0-SNAPSHOT.jar
AU maven-deploy-plugin/src/test/resources/unit/deploy-file-legacy-repository-layout/plugin-config.xml
A maven-deploy-plugin/src/test/resources/unit/basic-deploy-pom
AU maven-deploy-plugin/src/test/resources/unit/basic-deploy-pom/plugin-config.xml
A maven-deploy-plugin/src/test/resources/unit/basic-deploy-pom/target
AU maven-deploy-plugin/src/test/resources/unit/basic-deploy-pom/target/deploy-test-file-1.0-SNAPSHOT.jar
A maven-deploy-plugin/src/test/resources/unit/deploy-file-test
AU maven-deploy-plugin/src/test/resources/unit/deploy-file-test/plugin-config.xml
A maven-deploy-plugin/src/test/resources/unit/deploy-file-test/target
AU maven-deploy-plugin/src/test/resources/unit/deploy-file-test/target/deploy-test-file-1.0-SNAPSHOT.jar
A maven-deploy-plugin/src/test/resources/unit/basic-deploy-test
A maven-deploy-plugin/src/test/resources/unit/basic-deploy-test/plugin-config.xml
A maven-deploy-plugin/src/test/resources/unit/basic-deploy-test/target
AU maven-deploy-plugin/src/test/resources/unit/basic-deploy-test/target/deploy-test-file-1.0-SNAPSHOT.jar
A maven-deploy-plugin/src/test/java
A maven-deploy-plugin/src/test/java/org
A maven-deploy-plugin/src/test/java/org/apache
A maven-deploy-plugin/src/test/java/org/apache/maven
A maven-deploy-plugin/src/test/java/org/apache/maven/plugin
A maven-deploy-plugin/src/test/java/org/apache/maven/plugin/deploy
A maven-deploy-plugin/src/test/java/org/apache/maven/plugin/deploy/stubs
AU maven-deploy-plugin/src/test/java/org/apache/maven/plugin/deploy/stubs/DeployArtifactStub.java
AU maven-deploy-plugin/src/test/java/org/apache/maven/plugin/deploy/stubs/AttachedArtifactStub.java
AU maven-deploy-plugin/src/test/java/org/apache/maven/plugin/deploy/stubs/ArtifactRepositoryStub.java
AU maven-deploy-plugin/src/test/java/org/apache/maven/plugin/deploy/stubs/MavenProjectStub.java
AU maven-deploy-plugin/src/test/java/org/apache/maven/plugin/deploy/stubs/ArtifactRepositoryStub2.java
AU maven-deploy-plugin/src/test/java/org/apache/maven/plugin/deploy/stubs/ArtifactDeployerStub.java
AU maven-deploy-plugin/src/test/java/org/apache/maven/plugin/deploy/DeployFileMojoTest.java
AU maven-deploy-plugin/src/test/java/org/apache/maven/plugin/deploy/DeployFileMojoUnitTest.java
AU maven-deploy-plugin/src/test/java/org/apache/maven/plugin/deploy/DeployMojoTest.java
A maven-deploy-plugin/src/main
A maven-deploy-plugin/src/main/java
A maven-deploy-plugin/src/main/java/org
A maven-deploy-plugin/src/main/java/org/apache
A maven-deploy-plugin/src/main/java/org/apache/maven
A maven-deploy-plugin/src/main/java/org/apache/maven/plugin
A maven-deploy-plugin/src/main/java/org/apache/maven/plugin/deploy
AU maven-deploy-plugin/src/main/java/org/apache/maven/plugin/deploy/AbstractDeployMojo.java
A maven-deploy-plugin/src/main/java/org/apache/maven/plugin/deploy/DeployRequest.java
AU maven-deploy-plugin/src/main/java/org/apache/maven/plugin/deploy/DeployFileMojo.java
AU maven-deploy-plugin/src/main/java/org/apache/maven/plugin/deploy/DeployMojo.java
A maven-deploy-plugin/src/site
A maven-deploy-plugin/src/site/xdoc
A maven-deploy-plugin/src/site/xdoc/download.xml.vm
A maven-deploy-plugin/src/site/fml
AU maven-deploy-plugin/src/site/fml/faq.fml
AU maven-deploy-plugin/src/site/site.xml
A maven-deploy-plugin/src/site/apt
AU maven-deploy-plugin/src/site/apt/project-deployment.apt
AU maven-deploy-plugin/src/site/apt/usage.apt
AU maven-deploy-plugin/src/site/apt/index.apt.vm
A maven-deploy-plugin/src/site/apt/examples
AU maven-deploy-plugin/src/site/apt/examples/deploying-with-classifiers.apt.vm
AU maven-deploy-plugin/src/site/apt/examples/deploying-in-legacy-layout.apt.vm
AU maven-deploy-plugin/src/site/apt/examples/deploying-with-customed-pom.apt.vm
AU maven-deploy-plugin/src/site/apt/examples/disabling-generic-pom.apt.vm
AU maven-deploy-plugin/src/site/apt/examples/deploying-sources-javadoc.apt.vm
AU maven-deploy-plugin/src/site/apt/examples/deploy-ftp.apt
AU maven-deploy-plugin/src/site/apt/examples/deploy-ssh-external.apt
AU maven-deploy-plugin/src/site/apt/file-deployment.apt
A maven-deploy-plugin/src/site/resources
A maven-deploy-plugin/src/site/resources/download.cgi
AU maven-deploy-plugin/pom.xml
U .
At revision 1705231
provisoning config files...
copy managed file [simple-deploy-settings-no-mirror] to file:/tmp/config4410743773950380423tmp
[maven-plugins-ITs-m2] $ /home/jenkins/tools/maven/apache-maven-2.2.1/bin/mvn clean verify -Prun-its,!maven-3_jdk5,!maven-3_jdk6 -U -B -V -fae -s /tmp/config4410743773950380423tmp -e
+ Error stacktraces are turned on.
Apache Maven 2.2.1 (r801777; 2009-08-06 19:16:01+0000)
Java version: 1.6.0_45
Java home: /home/jenkins/tools/java/jdk1.6.0_45-32/jre
Default locale: en_US, platform encoding: UTF-8
OS name: "linux" version: "3.13.0-30-generic" arch: "i386" Family: "unix"
[INFO] Scanning for projects...
[INFO] ------------------------------------------------------------------------
[ERROR] BUILD FAILURE
[INFO] ------------------------------------------------------------------------
[INFO] The projects in the reactor contain a cyclic reference: Edge between 'Vertex{label='org.apache.maven.plugins:maven-invoker-plugin'}' and 'Vertex{label='org.apache.maven.plugins:maven-site-plugin'}' introduces to cycle in the graph org.apache.maven.plugins:maven-site-plugin --> org.apache.maven.plugins:maven-invoker-plugin --> org.apache.maven.plugins:maven-site-plugin
[INFO] ------------------------------------------------------------------------
[INFO] Trace
org.apache.maven.BuildFailureException: The projects in the reactor contain a cyclic reference: Edge between 'Vertex{label='org.apache.maven.plugins:maven-invoker-plugin'}' and 'Vertex{label='org.apache.maven.plugins:maven-site-plugin'}' introduces to cycle in the graph org.apache.maven.plugins:maven-site-plugin --> org.apache.maven.plugins:maven-invoker-plugin --> org.apache.maven.plugins:maven-site-plugin
at org.apache.maven.DefaultMaven.doExecute(DefaultMaven.java:295)
at org.apache.maven.DefaultMaven.execute(DefaultMaven.java:138)
at org.apache.maven.cli.MavenCli.main(MavenCli.java:362)
at org.apache.maven.cli.compat.CompatibleMain.main(CompatibleMain.java:60)
at sun.reflect.NativeMethodAccessorImpl.invoke0(Native Method)
at sun.reflect.NativeMethodAccessorImpl.invoke(NativeMethodAccessorImpl.java:39)
at sun.reflect.DelegatingMethodAccessorImpl.invoke(DelegatingMethodAccessorImpl.java:25)
at java.lang.reflect.Method.invoke(Method.java:597)
at org.codehaus.classworlds.Launcher.launchEnhanced(Launcher.java:315)
at org.codehaus.classworlds.Launcher.launch(Launcher.java:255)
at org.codehaus.classworlds.Launcher.mainWithExitCode(Launcher.java:430)
at org.codehaus.classworlds.Launcher.main(Launcher.java:375)
Caused by: hidden.org.codehaus.plexus.util.dag.CycleDetectedException: Edge between 'Vertex{label='org.apache.maven.plugins:maven-invoker-plugin'}' and 'Vertex{label='org.apache.maven.plugins:maven-site-plugin'}' introduces to cycle in the graph org.apache.maven.plugins:maven-site-plugin --> org.apache.maven.plugins:maven-invoker-plugin --> org.apache.maven.plugins:maven-site-plugin
at hidden.org.codehaus.plexus.util.dag.DAG.addEdge(DAG.java:143)
at hidden.org.codehaus.plexus.util.dag.DAG.addEdge(DAG.java:123)
at org.apache.maven.project.ProjectSorter.addEdgeWithParentCheck(ProjectSorter.java:362)
at org.apache.maven.project.ProjectSorter.<init>(ProjectSorter.java:146)
at org.apache.maven.execution.ReactorManager.<init>(ReactorManager.java:99)
at org.apache.maven.DefaultMaven.doExecute(DefaultMaven.java:288)
... 11 more
[INFO] ------------------------------------------------------------------------
[INFO] Total time: 1 second
[INFO] Finished at: Fri Sep 25 07:16:52 UTC 2015
[INFO] Final Memory: 10M/77M
[INFO] ------------------------------------------------------------------------
Build step 'Invoke top-level Maven targets' marked build as failure