You are viewing a plain text version of this content. The canonical link for it is here.
Posted to builds@beam.apache.org by Apache Jenkins Server <je...@builds.apache.org> on 2019/05/02 06:24:44 UTC

Build failed in Jenkins: beam_PerformanceTests_TextIOIT #1948

See <https://builds.apache.org/job/beam_PerformanceTests_TextIOIT/1948/display/redirect?page=changes>

Changes:

[juta.staes] [BEAM-6769] write bytes to bigquery in python 2

[iemejia] [BEAM-6526] Remove unneeded methods in AvroIO ReadFiles and ParseFiles

[iemejia] [BEAM-6526] Refactor AvroIO Read/Parse to use FileIO +

[iemejia] [BEAM-6526] Add populateDisplayData on AvroIO.ReadFiles

[pabloem] Fixing fileio tests for windows

------------------------------------------
[...truncated 23.14 KB...]

> Task :buildSrc:spotlessGroovyCheck UP-TO-DATE
Skipping task ':buildSrc:spotlessGroovyCheck' as it has no actions.
:buildSrc:spotlessGroovyCheck (Thread[Execution worker for ':buildSrc' Thread 14,5,main]) completed. Took 0.0 secs.
:buildSrc:spotlessGroovyGradle (Thread[Execution worker for ':buildSrc',5,main]) started.

> Task :buildSrc:spotlessGroovyGradle UP-TO-DATE
Caching disabled for task ':buildSrc:spotlessGroovyGradle': Caching has not been enabled for the task
Skipping task ':buildSrc:spotlessGroovyGradle' as it is up-to-date.
:buildSrc:spotlessGroovyGradle (Thread[Execution worker for ':buildSrc',5,main]) completed. Took 0.005 secs.
:buildSrc:spotlessGroovyGradleCheck (Thread[Execution worker for ':buildSrc',5,main]) started.

> Task :buildSrc:spotlessGroovyGradleCheck UP-TO-DATE
Skipping task ':buildSrc:spotlessGroovyGradleCheck' as it has no actions.
:buildSrc:spotlessGroovyGradleCheck (Thread[Execution worker for ':buildSrc',5,main]) completed. Took 0.0 secs.
:buildSrc:spotlessCheck (Thread[Execution worker for ':buildSrc',5,main]) started.

> Task :buildSrc:spotlessCheck UP-TO-DATE
Skipping task ':buildSrc:spotlessCheck' as it has no actions.
:buildSrc:spotlessCheck (Thread[Execution worker for ':buildSrc',5,main]) completed. Took 0.0 secs.
:buildSrc:pluginUnderTestMetadata (Thread[Execution worker for ':buildSrc',5,main]) started.

> Task :buildSrc:pluginUnderTestMetadata UP-TO-DATE
Build cache key for task ':buildSrc:pluginUnderTestMetadata' is c06cfb41c20235161490b86fb6aa4bda
Caching disabled for task ':buildSrc:pluginUnderTestMetadata': Caching has not been enabled for the task
Skipping task ':buildSrc:pluginUnderTestMetadata' as it is up-to-date.
:buildSrc:pluginUnderTestMetadata (Thread[Execution worker for ':buildSrc',5,main]) completed. Took 0.07 secs.
:buildSrc:compileTestJava (Thread[Execution worker for ':buildSrc',5,main]) started.

> Task :buildSrc:compileTestJava NO-SOURCE
file or directory '<https://builds.apache.org/job/beam_PerformanceTests_TextIOIT/ws/src/buildSrc/src/test/java',> not found
Skipping task ':buildSrc:compileTestJava' as it has no source files and no previous output files.
:buildSrc:compileTestJava (Thread[Execution worker for ':buildSrc',5,main]) completed. Took 0.001 secs.
:buildSrc:compileTestGroovy (Thread[Execution worker for ':buildSrc',5,main]) started.

> Task :buildSrc:compileTestGroovy NO-SOURCE
file or directory '<https://builds.apache.org/job/beam_PerformanceTests_TextIOIT/ws/src/buildSrc/src/test/groovy',> not found
Skipping task ':buildSrc:compileTestGroovy' as it has no source files and no previous output files.
:buildSrc:compileTestGroovy (Thread[Execution worker for ':buildSrc',5,main]) completed. Took 0.001 secs.
:buildSrc:processTestResources (Thread[Execution worker for ':buildSrc' Thread 14,5,main]) started.

> Task :buildSrc:processTestResources NO-SOURCE
file or directory '<https://builds.apache.org/job/beam_PerformanceTests_TextIOIT/ws/src/buildSrc/src/test/resources',> not found
Skipping task ':buildSrc:processTestResources' as it has no source files and no previous output files.
:buildSrc:processTestResources (Thread[Execution worker for ':buildSrc' Thread 14,5,main]) completed. Took 0.0 secs.
:buildSrc:testClasses (Thread[Execution worker for ':buildSrc' Thread 14,5,main]) started.

> Task :buildSrc:testClasses UP-TO-DATE
Skipping task ':buildSrc:testClasses' as it has no actions.
:buildSrc:testClasses (Thread[Execution worker for ':buildSrc' Thread 14,5,main]) completed. Took 0.0 secs.
:buildSrc:test (Thread[Execution worker for ':buildSrc' Thread 14,5,main]) started.

> Task :buildSrc:test NO-SOURCE
Skipping task ':buildSrc:test' as it has no source files and no previous output files.
:buildSrc:test (Thread[Execution worker for ':buildSrc' Thread 14,5,main]) completed. Took 0.001 secs.
:buildSrc:validateTaskProperties (Thread[Execution worker for ':buildSrc' Thread 14,5,main]) started.

> Task :buildSrc:validateTaskProperties UP-TO-DATE
Build cache key for task ':buildSrc:validateTaskProperties' is c7655b6fd31578ee015c876b750cfa47
Skipping task ':buildSrc:validateTaskProperties' as it is up-to-date.
:buildSrc:validateTaskProperties (Thread[Execution worker for ':buildSrc' Thread 14,5,main]) completed. Took 0.004 secs.
:buildSrc:check (Thread[Execution worker for ':buildSrc' Thread 14,5,main]) started.

> Task :buildSrc:check UP-TO-DATE
Skipping task ':buildSrc:check' as it has no actions.
:buildSrc:check (Thread[Execution worker for ':buildSrc' Thread 14,5,main]) completed. Took 0.0 secs.
:buildSrc:build (Thread[Execution worker for ':buildSrc' Thread 14,5,main]) started.

> Task :buildSrc:build UP-TO-DATE
Skipping task ':buildSrc:build' as it has no actions.
:buildSrc:build (Thread[Execution worker for ':buildSrc' Thread 14,5,main]) completed. Took 0.0 secs.
Settings evaluated using settings file '<https://builds.apache.org/job/beam_PerformanceTests_TextIOIT/ws/src/settings.gradle'.>
Using local directory build cache for the root build (location = /home/jenkins/.gradle/caches/build-cache-1, removeUnusedEntriesAfter = 7 days).
Projects loaded. Root project using build file '<https://builds.apache.org/job/beam_PerformanceTests_TextIOIT/ws/src/build.gradle'.>
Included projects: [root project 'beam', project ':beam-examples-java', project ':beam-examples-kotlin', project ':beam-model-fn-execution', project ':beam-model-job-management', project ':beam-model-pipeline', project ':beam-runners-apex', project ':beam-runners-core-construction-java', project ':beam-runners-core-java', project ':beam-runners-direct-java', project ':beam-runners-extensions-java-metrics', project ':beam-runners-flink-1.6', project ':beam-runners-flink-1.6-job-server', project ':beam-runners-flink-1.6-job-server-container', project ':beam-runners-flink-1.7', project ':beam-runners-flink-1.7-job-server', project ':beam-runners-flink-1.7-job-server-container', project ':beam-runners-flink_2.11', project ':beam-runners-flink_2.11-job-server', project ':beam-runners-flink_2.11-job-server-container', project ':beam-runners-gearpump', project ':beam-runners-google-cloud-dataflow-java', project ':beam-runners-google-cloud-dataflow-java-examples', project ':beam-runners-google-cloud-dataflow-java-examples-streaming', project ':beam-runners-google-cloud-dataflow-java-fn-api-worker', project ':beam-runners-google-cloud-dataflow-java-legacy-worker', project ':beam-runners-google-cloud-dataflow-java-windmill', project ':beam-runners-java-fn-execution', project ':beam-runners-local-java-core', project ':beam-runners-reference-java', project ':beam-runners-reference-job-server', project ':beam-runners-samza', project ':beam-runners-samza-job-server', project ':beam-runners-spark', project ':beam-runners-spark-job-server', project ':beam-sdks-go', project ':beam-sdks-go-container', project ':beam-sdks-go-examples', project ':beam-sdks-go-test', project ':beam-sdks-java-bom', project ':beam-sdks-java-build-tools', project ':beam-sdks-java-container', project ':beam-sdks-java-core', project ':beam-sdks-java-extensions-euphoria', project ':beam-sdks-java-extensions-google-cloud-platform-core', project ':beam-sdks-java-extensions-join-library', project ':beam-sdks-java-extensions-json-jackson', project ':beam-sdks-java-extensions-kryo', project ':beam-sdks-java-extensions-protobuf', project ':beam-sdks-java-extensions-sketching', project ':beam-sdks-java-extensions-sorter', project ':beam-sdks-java-extensions-sql', project ':beam-sdks-java-extensions-sql-datacatalog', project ':beam-sdks-java-extensions-sql-hcatalog', project ':beam-sdks-java-extensions-sql-jdbc', project ':beam-sdks-java-extensions-sql-shell', project ':beam-sdks-java-fn-execution', project ':beam-sdks-java-harness', project ':beam-sdks-java-io-amazon-web-services', project ':beam-sdks-java-io-amqp', project ':beam-sdks-java-io-cassandra', project ':beam-sdks-java-io-clickhouse', project ':beam-sdks-java-io-common', project ':beam-sdks-java-io-elasticsearch', project ':beam-sdks-java-io-elasticsearch-tests-2', project ':beam-sdks-java-io-elasticsearch-tests-5', project ':beam-sdks-java-io-elasticsearch-tests-6', project ':beam-sdks-java-io-elasticsearch-tests-common', project ':beam-sdks-java-io-file-based-io-tests', project ':beam-sdks-java-io-google-cloud-platform', project ':beam-sdks-java-io-hadoop-common', project ':beam-sdks-java-io-hadoop-file-system', project ':beam-sdks-java-io-hadoop-format', project ':beam-sdks-java-io-hadoop-input-format', project ':beam-sdks-java-io-hbase', project ':beam-sdks-java-io-hcatalog', project ':beam-sdks-java-io-jdbc', project ':beam-sdks-java-io-jms', project ':beam-sdks-java-io-kafka', project ':beam-sdks-java-io-kinesis', project ':beam-sdks-java-io-kudu', project ':beam-sdks-java-io-mongodb', project ':beam-sdks-java-io-mqtt', project ':beam-sdks-java-io-parquet', project ':beam-sdks-java-io-rabbitmq', project ':beam-sdks-java-io-redis', project ':beam-sdks-java-io-solr', project ':beam-sdks-java-io-synthetic', project ':beam-sdks-java-io-tika', project ':beam-sdks-java-io-xml', project ':beam-sdks-java-javadoc', project ':beam-sdks-java-load-tests', project ':beam-sdks-java-maven-archetypes-examples', project ':beam-sdks-java-maven-archetypes-starter', project ':beam-sdks-java-nexmark', project ':beam-sdks-java-test-utils', project ':beam-sdks-python', project ':beam-sdks-python-container', project ':beam-sdks-python-container-py3', project ':beam-sdks-python-load-tests', project ':beam-sdks-python-test-suites-dataflow', project ':beam-sdks-python-test-suites-dataflow-py35', project ':beam-sdks-python-test-suites-dataflow-py36', project ':beam-sdks-python-test-suites-direct-py35', project ':beam-sdks-python-test-suites-direct-py36', project ':beam-sdks-python-test-suites-tox-py35', project ':beam-sdks-python-test-suites-tox-py36', project ':beam-sdks-python-test-suites-tox-py37', project ':beam-test-infra-metrics', project ':beam-test-tools', project ':beam-vendor-grpc-1_13_1', project ':beam-vendor-guava-20_0', project ':beam-vendor-sdks-java-extensions-protobuf', project ':beam-website', project ':release']
Configuration on demand is an incubating feature.

> Configure project :
Evaluating root project 'beam' using build file '<https://builds.apache.org/job/beam_PerformanceTests_TextIOIT/ws/src/build.gradle'.>
Offline dependencies root configured at 'offline-repository'

> Configure project :beam-runners-google-cloud-dataflow-java-fn-api-worker
Evaluating project ':beam-runners-google-cloud-dataflow-java-fn-api-worker' using build file '<https://builds.apache.org/job/beam_PerformanceTests_TextIOIT/ws/src/runners/google-cloud-dataflow-java/worker/build.gradle'.>
Offline dependencies root configured at 'offline-repository'
Apply OSS Index Plugin

> Configure project :beam-runners-google-cloud-dataflow-java-legacy-worker
Evaluating project ':beam-runners-google-cloud-dataflow-java-legacy-worker' using build file '<https://builds.apache.org/job/beam_PerformanceTests_TextIOIT/ws/src/runners/google-cloud-dataflow-java/worker/legacy-worker/build.gradle'.>
Offline dependencies root configured at 'offline-repository'
Apply OSS Index Plugin

> Configure project :beam-sdks-java-io-file-based-io-tests
Evaluating project ':beam-sdks-java-io-file-based-io-tests' using build file '<https://builds.apache.org/job/beam_PerformanceTests_TextIOIT/ws/src/sdks/java/io/file-based-io-tests/build.gradle'.>
Offline dependencies root configured at 'offline-repository'
Apply OSS Index Plugin
Selected primary task 'integrationTest' from project :beam-sdks-java-io-file-based-io-tests

> Configure project :beam-sdks-java-core
Evaluating project ':beam-sdks-java-core' using build file '<https://builds.apache.org/job/beam_PerformanceTests_TextIOIT/ws/src/sdks/java/core/build.gradle'.>
Offline dependencies root configured at 'offline-repository'
Apply OSS Index Plugin

> Configure project :beam-sdks-java-io-common
Evaluating project ':beam-sdks-java-io-common' using build file '<https://builds.apache.org/job/beam_PerformanceTests_TextIOIT/ws/src/sdks/java/io/common/build.gradle'.>
Offline dependencies root configured at 'offline-repository'
Apply OSS Index Plugin

> Configure project :beam-sdks-java-io-xml
Evaluating project ':beam-sdks-java-io-xml' using build file '<https://builds.apache.org/job/beam_PerformanceTests_TextIOIT/ws/src/sdks/java/io/xml/build.gradle'.>
Offline dependencies root configured at 'offline-repository'
Apply OSS Index Plugin

> Configure project :beam-sdks-java-io-parquet
Evaluating project ':beam-sdks-java-io-parquet' using build file '<https://builds.apache.org/job/beam_PerformanceTests_TextIOIT/ws/src/sdks/java/io/parquet/build.gradle'.>
Offline dependencies root configured at 'offline-repository'
Apply OSS Index Plugin

> Configure project :beam-sdks-java-test-utils
Evaluating project ':beam-sdks-java-test-utils' using build file '<https://builds.apache.org/job/beam_PerformanceTests_TextIOIT/ws/src/sdks/java/testing/test-utils/build.gradle'.>
Offline dependencies root configured at 'offline-repository'
Apply OSS Index Plugin

> Configure project :beam-sdks-java-io-google-cloud-platform
Evaluating project ':beam-sdks-java-io-google-cloud-platform' using build file '<https://builds.apache.org/job/beam_PerformanceTests_TextIOIT/ws/src/sdks/java/io/google-cloud-platform/build.gradle'.>
Offline dependencies root configured at 'offline-repository'
Apply OSS Index Plugin

> Configure project :beam-examples-java
Evaluating project ':beam-examples-java' using build file '<https://builds.apache.org/job/beam_PerformanceTests_TextIOIT/ws/src/examples/java/build.gradle'.>
Offline dependencies root configured at 'offline-repository'
Apply OSS Index Plugin

> Configure project :beam-runners-google-cloud-dataflow-java
Evaluating project ':beam-runners-google-cloud-dataflow-java' using build file '<https://builds.apache.org/job/beam_PerformanceTests_TextIOIT/ws/src/runners/google-cloud-dataflow-java/build.gradle'.>
Offline dependencies root configured at 'offline-repository'
Apply OSS Index Plugin

> Configure project :beam-sdks-java-container
Evaluating project ':beam-sdks-java-container' using build file '<https://builds.apache.org/job/beam_PerformanceTests_TextIOIT/ws/src/sdks/java/container/build.gradle'.>
Offline dependencies root configured at 'offline-repository'

STDERR: The message received from the daemon indicates that the daemon has disappeared.
Build request sent: Build{id=bc9cf9a2-91e9-4a20-be60-a67529bf086c, currentDir=<https://builds.apache.org/job/beam_PerformanceTests_TextIOIT/ws/src}>
Attempting to read last messages from the daemon log...
Daemon pid: 1342
  log file: /home/jenkins/.gradle/daemon/5.2.1/daemon-1342.out.log
----- Last  20 lines from daemon log file - daemon-1342.out.log -----
Offline dependencies root configured at 'offline-repository'
Apply OSS Index Plugin
Evaluating project ':beam-sdks-java-io-parquet' using build file '<https://builds.apache.org/job/beam_PerformanceTests_TextIOIT/ws/src/sdks/java/io/parquet/build.gradle'.>
Offline dependencies root configured at 'offline-repository'
Apply OSS Index Plugin
Evaluating project ':beam-sdks-java-test-utils' using build file '<https://builds.apache.org/job/beam_PerformanceTests_TextIOIT/ws/src/sdks/java/testing/test-utils/build.gradle'.>
Offline dependencies root configured at 'offline-repository'
Apply OSS Index Plugin
Evaluating project ':beam-runners-google-cloud-dataflow-java' using build file '<https://builds.apache.org/job/beam_PerformanceTests_TextIOIT/ws/src/runners/google-cloud-dataflow-java/build.gradle'.>
Offline dependencies root configured at 'offline-repository'
Apply OSS Index Plugin
Evaluating project ':beam-sdks-java-io-google-cloud-platform' using build file '<https://builds.apache.org/job/beam_PerformanceTests_TextIOIT/ws/src/sdks/java/io/google-cloud-platform/build.gradle'.>
Offline dependencies root configured at 'offline-repository'
Apply OSS Index Plugin
Evaluating project ':beam-examples-java' using build file '<https://builds.apache.org/job/beam_PerformanceTests_TextIOIT/ws/src/examples/java/build.gradle'.>
Offline dependencies root configured at 'offline-repository'
Apply OSS Index Plugin
Evaluating project ':beam-sdks-java-container' using build file '<https://builds.apache.org/job/beam_PerformanceTests_TextIOIT/ws/src/sdks/java/container/build.gradle'.>
Offline dependencies root configured at 'offline-repository'
Daemon vm is shutting down... The daemon has exited normally or was terminated in response to a user interrupt.
----- End of the daemon log -----


FAILURE: Build failed with an exception.

* What went wrong:
Gradle build daemon disappeared unexpectedly (it may have been killed or may have crashed)

* Try:
Run with --debug option to get more log output. Run with --scan to get full insights.

* Exception is:
org.gradle.launcher.daemon.client.DaemonDisappearedException: Gradle build daemon disappeared unexpectedly (it may have been killed or may have crashed)
	at org.gradle.launcher.daemon.client.DaemonClient.handleDaemonDisappearance(DaemonClient.java:241)
	at org.gradle.launcher.daemon.client.DaemonClient.monitorBuild(DaemonClient.java:217)
	at org.gradle.launcher.daemon.client.DaemonClient.executeBuild(DaemonClient.java:179)
	at org.gradle.launcher.daemon.client.DaemonClient.execute(DaemonClient.java:142)
	at org.gradle.launcher.daemon.client.DaemonClient.execute(DaemonClient.java:94)
	at org.gradle.launcher.cli.RunBuildAction.run(RunBuildAction.java:55)
	at org.gradle.internal.Actions$RunnableActionAdapter.execute(Actions.java:207)
	at org.gradle.launcher.cli.CommandLineActionFactory$ParseAndBuildAction.execute(CommandLineActionFactory.java:403)
	at org.gradle.launcher.cli.CommandLineActionFactory$ParseAndBuildAction.execute(CommandLineActionFactory.java:376)
	at org.gradle.launcher.cli.ExceptionReportingAction.execute(ExceptionReportingAction.java:37)
	at org.gradle.launcher.cli.ExceptionReportingAction.execute(ExceptionReportingAction.java:23)
	at org.gradle.launcher.cli.CommandLineActionFactory$WithLogging.execute(CommandLineActionFactory.java:369)
	at org.gradle.launcher.cli.CommandLineActionFactory$WithLogging.execute(CommandLineActionFactory.java:299)
	at org.gradle.launcher.Main.doAction(Main.java:36)
	at org.gradle.launcher.bootstrap.EntryPoint.run(EntryPoint.java:45)
	at sun.reflect.NativeMethodAccessorImpl.invoke0(Native Method)
	at sun.reflect.NativeMethodAccessorImpl.invoke(NativeMethodAccessorImpl.java:62)
	at sun.reflect.DelegatingMethodAccessorImpl.invoke(DelegatingMethodAccessorImpl.java:43)
	at java.lang.reflect.Method.invoke(Method.java:498)
	at org.gradle.launcher.bootstrap.ProcessBootstrap.runNoExit(ProcessBootstrap.java:60)
	at org.gradle.launcher.bootstrap.ProcessBootstrap.run(ProcessBootstrap.java:37)
	at org.gradle.launcher.GradleMain.main(GradleMain.java:23)
	at sun.reflect.NativeMethodAccessorImpl.invoke0(Native Method)
	at sun.reflect.NativeMethodAccessorImpl.invoke(NativeMethodAccessorImpl.java:62)
	at sun.reflect.DelegatingMethodAccessorImpl.invoke(DelegatingMethodAccessorImpl.java:43)
	at java.lang.reflect.Method.invoke(Method.java:498)
	at org.gradle.wrapper.BootstrapMainStarter.start(BootstrapMainStarter.java:31)
	at org.gradle.wrapper.WrapperExecutor.execute(WrapperExecutor.java:108)
	at org.gradle.wrapper.GradleWrapperMain.main(GradleWrapperMain.java:61)


* Get more help at https://help.gradle.org

2019-05-02 06:24:42,282 0bb076f1 MainThread beam_integration_benchmark(1/1) ERROR    Error during benchmark beam_integration_benchmark
Traceback (most recent call last):
  File "<https://builds.apache.org/job/beam_PerformanceTests_TextIOIT/ws/PerfKitBenchmarker/perfkitbenchmarker/pkb.py",> line 760, in RunBenchmark
    DoRunPhase(spec, collector, detailed_timer)
  File "<https://builds.apache.org/job/beam_PerformanceTests_TextIOIT/ws/PerfKitBenchmarker/perfkitbenchmarker/pkb.py",> line 609, in DoRunPhase
    samples = spec.BenchmarkRun(spec)
  File "<https://builds.apache.org/job/beam_PerformanceTests_TextIOIT/ws/PerfKitBenchmarker/perfkitbenchmarker/linux_benchmarks/beam_integration_benchmark.py",> line 160, in Run
    job_type=job_type)
  File "<https://builds.apache.org/job/beam_PerformanceTests_TextIOIT/ws/PerfKitBenchmarker/perfkitbenchmarker/providers/gcp/gcp_dpb_dataflow.py",> line 90, in SubmitJob
    assert retcode == 0, "Integration Test Failed."
AssertionError: Integration Test Failed.
2019-05-02 06:24:42,284 0bb076f1 MainThread beam_integration_benchmark(1/1) INFO     Cleaning up benchmark beam_integration_benchmark
2019-05-02 06:24:42,285 0bb076f1 MainThread beam_integration_benchmark(1/1) ERROR    Exception running benchmark
Traceback (most recent call last):
  File "<https://builds.apache.org/job/beam_PerformanceTests_TextIOIT/ws/PerfKitBenchmarker/perfkitbenchmarker/pkb.py",> line 903, in RunBenchmarkTask
    RunBenchmark(spec, collector)
  File "<https://builds.apache.org/job/beam_PerformanceTests_TextIOIT/ws/PerfKitBenchmarker/perfkitbenchmarker/pkb.py",> line 760, in RunBenchmark
    DoRunPhase(spec, collector, detailed_timer)
  File "<https://builds.apache.org/job/beam_PerformanceTests_TextIOIT/ws/PerfKitBenchmarker/perfkitbenchmarker/pkb.py",> line 609, in DoRunPhase
    samples = spec.BenchmarkRun(spec)
  File "<https://builds.apache.org/job/beam_PerformanceTests_TextIOIT/ws/PerfKitBenchmarker/perfkitbenchmarker/linux_benchmarks/beam_integration_benchmark.py",> line 160, in Run
    job_type=job_type)
  File "<https://builds.apache.org/job/beam_PerformanceTests_TextIOIT/ws/PerfKitBenchmarker/perfkitbenchmarker/providers/gcp/gcp_dpb_dataflow.py",> line 90, in SubmitJob
    assert retcode == 0, "Integration Test Failed."
AssertionError: Integration Test Failed.
2019-05-02 06:24:42,286 0bb076f1 MainThread beam_integration_benchmark(1/1) ERROR    Benchmark 1/1 beam_integration_benchmark (UID: beam_integration_benchmark0) failed. Execution will continue.
2019-05-02 06:24:42,286 0bb076f1 MainThread beam_integration_benchmark(1/1) INFO     Benchmark run statuses:
---------------------------------------------------------------------------------
Name                        UID                          Status  Failed Substatus
---------------------------------------------------------------------------------
beam_integration_benchmark  beam_integration_benchmark0  FAILED                  
---------------------------------------------------------------------------------
Success rate: 0.00% (0/1)
2019-05-02 06:24:42,286 0bb076f1 MainThread beam_integration_benchmark(1/1) INFO     Complete logs can be found at: <https://builds.apache.org/job/beam_PerformanceTests_TextIOIT/ws/runs/0bb076f1/pkb.log>
2019-05-02 06:24:42,286 0bb076f1 MainThread beam_integration_benchmark(1/1) INFO     Completion statuses can be found at: <https://builds.apache.org/job/beam_PerformanceTests_TextIOIT/ws/runs/0bb076f1/completion_statuses.json>
Build step 'Execute shell' marked build as failure

---------------------------------------------------------------------
To unsubscribe, e-mail: builds-unsubscribe@beam.apache.org
For additional commands, e-mail: builds-help@beam.apache.org


Jenkins build is back to normal : beam_PerformanceTests_TextIOIT #1949

Posted by Apache Jenkins Server <je...@builds.apache.org>.
See <https://builds.apache.org/job/beam_PerformanceTests_TextIOIT/1949/display/redirect>


---------------------------------------------------------------------
To unsubscribe, e-mail: builds-unsubscribe@beam.apache.org
For additional commands, e-mail: builds-help@beam.apache.org