You are viewing a plain text version of this content. The canonical link for it is here.
Posted to notifications@maven.apache.org by Apache Jenkins Server <je...@builds.apache.org> on 2014/07/26 11:57:25 UTC

Build failed in Jenkins: dist-tool-plugin #533

See <https://builds.apache.org/job/dist-tool-plugin/533/>

------------------------------------------
[...truncated 3020 lines...]
Downloading: http://repo.maven.apache.org/maven2/org/apache/maven/plugins/maven-linkcheck-plugin/1.1/maven-linkcheck-plugin-1.1.pom
Downloaded: http://repo.maven.apache.org/maven2/org/apache/maven/plugins/maven-linkcheck-plugin/1.1/maven-linkcheck-plugin-1.1.pom (7 KB at 126.0 KB/sec)
Downloading: http://repo.maven.apache.org/maven2/org/apache/maven/plugins/maven-one-plugin/1.3/maven-one-plugin-1.3.pom
Downloaded: http://repo.maven.apache.org/maven2/org/apache/maven/plugins/maven-one-plugin/1.3/maven-one-plugin-1.3.pom (6 KB at 96.2 KB/sec)
Downloading: http://repo.maven.apache.org/maven2/org/apache/maven/plugins/maven-patch-plugin/1.1.1/maven-patch-plugin-1.1.1.pom
Downloaded: http://repo.maven.apache.org/maven2/org/apache/maven/plugins/maven-patch-plugin/1.1.1/maven-patch-plugin-1.1.1.pom (4 KB at 71.2 KB/sec)
Downloading: http://repo.maven.apache.org/maven2/org/apache/maven/plugins/maven-pdf-plugin/1.2/maven-pdf-plugin-1.2.pom
Downloaded: http://repo.maven.apache.org/maven2/org/apache/maven/plugins/maven-pdf-plugin/1.2/maven-pdf-plugin-1.2.pom (17 KB at 311.7 KB/sec)
Downloading: http://repo.maven.apache.org/maven2/org/apache/maven/plugins/maven-rar-plugin/2.3/maven-rar-plugin-2.3.pom
Downloaded: http://repo.maven.apache.org/maven2/org/apache/maven/plugins/maven-rar-plugin/2.3/maven-rar-plugin-2.3.pom (6 KB at 109.3 KB/sec)
Downloading: http://repo.maven.apache.org/maven2/org/apache/maven/plugins/maven-repository-plugin/2.3.1/maven-repository-plugin-2.3.1.pom
Downloaded: http://repo.maven.apache.org/maven2/org/apache/maven/plugins/maven-repository-plugin/2.3.1/maven-repository-plugin-2.3.1.pom (9 KB at 162.4 KB/sec)
Downloading: http://repo.maven.apache.org/maven2/org/apache/maven/plugins/maven-scm-publish-plugin/1.1/maven-scm-publish-plugin-1.1.pom
Downloaded: http://repo.maven.apache.org/maven2/org/apache/maven/plugins/maven-scm-publish-plugin/1.1/maven-scm-publish-plugin-1.1.pom (7 KB at 127.2 KB/sec)
Downloading: http://repo.maven.apache.org/maven2/org/apache/maven/plugins/maven-shade-plugin/2.3/maven-shade-plugin-2.3.pom
Downloaded: http://repo.maven.apache.org/maven2/org/apache/maven/plugins/maven-shade-plugin/2.3/maven-shade-plugin-2.3.pom (8 KB at 132.8 KB/sec)
Downloading: http://repo.maven.apache.org/maven2/org/apache/maven/plugins/maven-site-plugin/3.4/maven-site-plugin-3.4.pom
Downloaded: http://repo.maven.apache.org/maven2/org/apache/maven/plugins/maven-site-plugin/3.4/maven-site-plugin-3.4.pom (20 KB at 365.2 KB/sec)
Downloading: http://repo.maven.apache.org/maven2/org/apache/maven/plugins/maven-source-plugin/2.3/maven-source-plugin-2.3.pom
Downloaded: http://repo.maven.apache.org/maven2/org/apache/maven/plugins/maven-source-plugin/2.3/maven-source-plugin-2.3.pom (7 KB at 122.4 KB/sec)
Downloading: http://repo.maven.apache.org/maven2/org/apache/maven/plugins/maven-stage-plugin/1.0-alpha-2/maven-stage-plugin-1.0-alpha-2.pom
Downloaded: http://repo.maven.apache.org/maven2/org/apache/maven/plugins/maven-stage-plugin/1.0-alpha-2/maven-stage-plugin-1.0-alpha-2.pom (8 KB at 134.7 KB/sec)
Downloading: http://repo.maven.apache.org/maven2/org/apache/maven/plugins/maven-plugins/13/maven-plugins-13.pom
Downloaded: http://repo.maven.apache.org/maven2/org/apache/maven/plugins/maven-plugins/13/maven-plugins-13.pom (12 KB at 217.1 KB/sec)
Downloading: http://repo.maven.apache.org/maven2/org/apache/maven/plugins/maven-toolchains-plugin/1.0/maven-toolchains-plugin-1.0.pom
Downloaded: http://repo.maven.apache.org/maven2/org/apache/maven/plugins/maven-toolchains-plugin/1.0/maven-toolchains-plugin-1.0.pom (4 KB at 66.3 KB/sec)
Downloading: http://repo.maven.apache.org/maven2/org/apache/maven/plugins/maven-plugins/14/maven-plugins-14.pom
Downloaded: http://repo.maven.apache.org/maven2/org/apache/maven/plugins/maven-plugins/14/maven-plugins-14.pom (13 KB at 226.7 KB/sec)
Downloading: http://repo.maven.apache.org/maven2/org/apache/maven/plugins/maven-verifier-plugin/1.0/maven-verifier-plugin-1.0.pom
Downloaded: http://repo.maven.apache.org/maven2/org/apache/maven/plugins/maven-verifier-plugin/1.0/maven-verifier-plugin-1.0.pom (5 KB at 92.7 KB/sec)
Downloading: http://repo.maven.apache.org/maven2/org/apache/maven/plugins/maven-war-plugin/2.4/maven-war-plugin-2.4.pom
Downloaded: http://repo.maven.apache.org/maven2/org/apache/maven/plugins/maven-war-plugin/2.4/maven-war-plugin-2.4.pom (10 KB at 170.0 KB/sec)
Downloading: http://repo.maven.apache.org/maven2/org/apache/maven/reporting/maven-reporting-exec/1.2/maven-reporting-exec-1.2.pom
Downloaded: http://repo.maven.apache.org/maven2/org/apache/maven/reporting/maven-reporting-exec/1.2/maven-reporting-exec-1.2.pom (11 KB at 192.9 KB/sec)
Downloading: http://repo.maven.apache.org/maven2/org/apache/maven/shared/maven-shared-components/20/maven-shared-components-20.pom
Downloaded: http://repo.maven.apache.org/maven2/org/apache/maven/shared/maven-shared-components/20/maven-shared-components-20.pom (5 KB at 94.1 KB/sec)
Downloading: http://repo.maven.apache.org/maven2/org/apache/apache/resources/apache-resource-bundles/4/apache-resource-bundles-4.pom
Downloaded: http://repo.maven.apache.org/maven2/org/apache/apache/resources/apache-resource-bundles/4/apache-resource-bundles-4.pom (3 KB at 48.1 KB/sec)
Downloading: http://repo.maven.apache.org/maven2/org/apache/apache/resources/apache-source-release-assembly-descriptor/1.0.4/apache-source-release-assembly-descriptor-1.0.4.pom
Downloaded: http://repo.maven.apache.org/maven2/org/apache/apache/resources/apache-source-release-assembly-descriptor/1.0.4/apache-source-release-assembly-descriptor-1.0.4.pom (8 KB at 147.0 KB/sec)
Downloading: http://repo.maven.apache.org/maven2/org/apache/apache-incubator-disclaimer-resource-bundle/1.1/apache-incubator-disclaimer-resource-bundle-1.1.pom
[WARNING] Checksum validation failed, expected da39a3ee5e6b4b0d3255bfef95601890afd80709 but is 6e0b74ff3d2da9bfe1126608f7e937537e628a5f for http://repo.maven.apache.org/maven2/org/apache/apache-incubator-disclaimer-resource-bundle/1.1/apache-incubator-disclaimer-resource-bundle-1.1.pom
[WARNING] Checksum validation failed, expected da39a3ee5e6b4b0d3255bfef95601890afd80709 but is 6e0b74ff3d2da9bfe1126608f7e937537e628a5f for http://repo.maven.apache.org/maven2/org/apache/apache-incubator-disclaimer-resource-bundle/1.1/apache-incubator-disclaimer-resource-bundle-1.1.pom
Downloaded: http://repo.maven.apache.org/maven2/org/apache/apache-incubator-disclaimer-resource-bundle/1.1/apache-incubator-disclaimer-resource-bundle-1.1.pom (722 B at 2.9 KB/sec)
Downloading: http://repo.maven.apache.org/maven2/org/apache/apache-resource-bundles/2/apache-resource-bundles-2.pom
[WARNING] Checksum validation failed, expected da39a3ee5e6b4b0d3255bfef95601890afd80709 but is bfadc7db5b215805d531144732c80692de9780e1 for http://repo.maven.apache.org/maven2/org/apache/apache-resource-bundles/2/apache-resource-bundles-2.pom
[WARNING] Checksum validation failed, expected da39a3ee5e6b4b0d3255bfef95601890afd80709 but is bfadc7db5b215805d531144732c80692de9780e1 for http://repo.maven.apache.org/maven2/org/apache/apache-resource-bundles/2/apache-resource-bundles-2.pom
Downloaded: http://repo.maven.apache.org/maven2/org/apache/apache-resource-bundles/2/apache-resource-bundles-2.pom (2 KB at 18.1 KB/sec)
Downloading: http://repo.maven.apache.org/maven2/org/apache/apache-jar-resource-bundle/1.4/apache-jar-resource-bundle-1.4.pom
Downloaded: http://repo.maven.apache.org/maven2/org/apache/apache-jar-resource-bundle/1.4/apache-jar-resource-bundle-1.4.pom (2 KB at 20.2 KB/sec)
Downloading: http://repo.maven.apache.org/maven2/org/apache/apache-license-header-resource-bundle/1.1/apache-license-header-resource-bundle-1.1.pom
[WARNING] Checksum validation failed, expected da39a3ee5e6b4b0d3255bfef95601890afd80709 but is 923c05b225d7a5a8a614b5fca846b1776e18b98a for http://repo.maven.apache.org/maven2/org/apache/apache-license-header-resource-bundle/1.1/apache-license-header-resource-bundle-1.1.pom
[WARNING] Checksum validation failed, expected da39a3ee5e6b4b0d3255bfef95601890afd80709 but is 923c05b225d7a5a8a614b5fca846b1776e18b98a for http://repo.maven.apache.org/maven2/org/apache/apache-license-header-resource-bundle/1.1/apache-license-header-resource-bundle-1.1.pom
Downloaded: http://repo.maven.apache.org/maven2/org/apache/apache-license-header-resource-bundle/1.1/apache-license-header-resource-bundle-1.1.pom (694 B at 6.3 KB/sec)
Downloading: http://repo.maven.apache.org/maven2/org/apache/maven/scm/maven-scm/1.9.1/maven-scm-1.9.1.pom
Downloaded: http://repo.maven.apache.org/maven2/org/apache/maven/scm/maven-scm/1.9.1/maven-scm-1.9.1.pom (22 KB at 404.4 KB/sec)
Downloading: http://repo.maven.apache.org/maven2/org/apache/maven/shared/maven-filtering/1.2/maven-filtering-1.2.pom
Downloaded: http://repo.maven.apache.org/maven2/org/apache/maven/shared/maven-filtering/1.2/maven-filtering-1.2.pom (7 KB at 115.6 KB/sec)
Downloading: http://repo.maven.apache.org/maven2/org/apache/maven/shared/maven-invoker/2.1.1/maven-invoker-2.1.1.pom
Downloaded: http://repo.maven.apache.org/maven2/org/apache/maven/shared/maven-invoker/2.1.1/maven-invoker-2.1.1.pom (6 KB at 100.6 KB/sec)
Downloading: http://repo.maven.apache.org/maven2/org/apache/maven/shared/maven-jarsigner/1.3.2/maven-jarsigner-1.3.2.pom
Downloaded: http://repo.maven.apache.org/maven2/org/apache/maven/shared/maven-jarsigner/1.3.2/maven-jarsigner-1.3.2.pom (6 KB at 95.6 KB/sec)
Downloading: http://repo.maven.apache.org/maven2/org/apache/maven/shared/maven-mapping/1.0/maven-mapping-1.0.pom
Downloaded: http://repo.maven.apache.org/maven2/org/apache/maven/shared/maven-mapping/1.0/maven-mapping-1.0.pom (5 KB at 80.6 KB/sec)
Downloading: http://repo.maven.apache.org/maven2/org/apache/maven/shared/maven-model-converter/2.3/maven-model-converter-2.3.pom
Downloaded: http://repo.maven.apache.org/maven2/org/apache/maven/shared/maven-model-converter/2.3/maven-model-converter-2.3.pom (5 KB at 76.3 KB/sec)
Downloading: http://repo.maven.apache.org/maven2/org/apache/maven/shared/maven-repository-builder/1.0-alpha-2/maven-repository-builder-1.0-alpha-2.pom
Downloaded: http://repo.maven.apache.org/maven2/org/apache/maven/shared/maven-repository-builder/1.0-alpha-2/maven-repository-builder-1.0-alpha-2.pom (4 KB at 58.4 KB/sec)
Downloading: http://repo.maven.apache.org/maven2/org/apache/maven/shared/maven-runtime/1.0-alpha-3/maven-runtime-1.0-alpha-3.pom
Downloaded: http://repo.maven.apache.org/maven2/org/apache/maven/shared/maven-runtime/1.0-alpha-3/maven-runtime-1.0-alpha-3.pom (6 KB at 104.1 KB/sec)
Downloading: http://repo.maven.apache.org/maven2/org/apache/maven/shared/maven-script-interpreter/1.1/maven-script-interpreter-1.1.pom
Downloaded: http://repo.maven.apache.org/maven2/org/apache/maven/shared/maven-script-interpreter/1.1/maven-script-interpreter-1.1.pom (4 KB at 67.1 KB/sec)
Downloading: http://repo.maven.apache.org/maven2/org/apache/maven/shared/maven-shared-resources/1/maven-shared-resources-1.pom
Downloaded: http://repo.maven.apache.org/maven2/org/apache/maven/shared/maven-shared-resources/1/maven-shared-resources-1.pom (3 KB at 17.0 KB/sec)
Downloading: http://repo.maven.apache.org/maven2/org/apache/maven/shared/maven-shared-utils/0.6/maven-shared-utils-0.6.pom
Downloaded: http://repo.maven.apache.org/maven2/org/apache/maven/shared/maven-shared-utils/0.6/maven-shared-utils-0.6.pom (5 KB at 88.2 KB/sec)
Downloading: http://repo.maven.apache.org/maven2/org/apache/maven/shared/maven-verifier/1.5/maven-verifier-1.5.pom
Downloaded: http://repo.maven.apache.org/maven2/org/apache/maven/shared/maven-verifier/1.5/maven-verifier-1.5.pom (4 KB at 60.3 KB/sec)
Downloading: http://repo.maven.apache.org/maven2/org/apache/maven/skins/maven-skins/9/maven-skins-9.pom
Downloaded: http://repo.maven.apache.org/maven2/org/apache/maven/skins/maven-skins/9/maven-skins-9.pom (4 KB at 15.2 KB/sec)
Downloading: http://repo.maven.apache.org/maven2/org/apache/maven/skins/maven-application-skin/1.0/maven-application-skin-1.0.pom
Downloaded: http://repo.maven.apache.org/maven2/org/apache/maven/skins/maven-application-skin/1.0/maven-application-skin-1.0.pom (5 KB at 14.8 KB/sec)
Downloading: http://repo.maven.apache.org/maven2/org/apache/maven/skins/maven-skins/6/maven-skins-6.pom
Downloaded: http://repo.maven.apache.org/maven2/org/apache/maven/skins/maven-skins/6/maven-skins-6.pom (4 KB at 15.8 KB/sec)
Downloading: http://repo.maven.apache.org/maven2/org/apache/maven/skins/maven-classic-skin/1.1/maven-classic-skin-1.1.pom
Downloaded: http://repo.maven.apache.org/maven2/org/apache/maven/skins/maven-classic-skin/1.1/maven-classic-skin-1.1.pom (5 KB at 36.3 KB/sec)
Downloading: http://repo.maven.apache.org/maven2/org/apache/maven/skins/maven-default-skin/1.1/maven-default-skin-1.1.pom
Downloaded: http://repo.maven.apache.org/maven2/org/apache/maven/skins/maven-default-skin/1.1/maven-default-skin-1.1.pom (5 KB at 48.4 KB/sec)
Downloading: http://repo.maven.apache.org/maven2/org/apache/maven/skins/maven-fluido-skin/1.3.1/maven-fluido-skin-1.3.1.pom
Downloaded: http://repo.maven.apache.org/maven2/org/apache/maven/skins/maven-fluido-skin/1.3.1/maven-fluido-skin-1.3.1.pom (28 KB at 491.3 KB/sec)
Downloading: http://repo.maven.apache.org/maven2/org/apache/maven/skins/maven-skins/8/maven-skins-8.pom
Downloaded: http://repo.maven.apache.org/maven2/org/apache/maven/skins/maven-skins/8/maven-skins-8.pom (5 KB at 73.3 KB/sec)
Downloading: http://repo.maven.apache.org/maven2/org/apache/maven/skins/maven-stylus-skin/1.5/maven-stylus-skin-1.5.pom
Downloaded: http://repo.maven.apache.org/maven2/org/apache/maven/skins/maven-stylus-skin/1.5/maven-stylus-skin-1.5.pom (6 KB at 101.8 KB/sec)
Downloading: http://repo.maven.apache.org/maven2/org/apache/maven/surefire/surefire/2.17/surefire-2.17.pom
Downloaded: http://repo.maven.apache.org/maven2/org/apache/maven/surefire/surefire/2.17/surefire-2.17.pom (17 KB at 313.0 KB/sec)
Downloading: http://repo.maven.apache.org/maven2/org/apache/maven/wagon/wagon/2.6/wagon-2.6.pom
Downloaded: http://repo.maven.apache.org/maven2/org/apache/maven/wagon/wagon/2.6/wagon-2.6.pom (20 KB at 361.9 KB/sec)
[INFO] Generating "Dist Tool> Source Release" report    --- dist-tool-plugin:1.0-SNAPSHOT
[WARNING] Missing file for doxia-linkcheck in http://repo.maven.apache.org/maven2/org/apache/maven/doxia/doxia-linkcheck/1.2
[WARNING]  > doxia-linkcheck-1.2-source-release.zip <
[WARNING]  > doxia-linkcheck-1.2-source-release.zip.asc <
[WARNING]  > doxia-linkcheck-1.2-source-release.zip.md5 <
[WARNING] Missing file for doxia-linkcheck in http://www.apache.org/dist/maven/doxia
[WARNING]  > doxia-linkcheck-1.2-source-release.zip <
[WARNING]  > doxia-linkcheck-1.2-source-release.zip.asc <
[WARNING]  > doxia-linkcheck-1.2-source-release.zip.md5 <
[WARNING] Missing file for maven-docck-plugin in http://repo.maven.apache.org/maven2/org/apache/maven/plugins/maven-docck-plugin/1.0
[WARNING]  > maven-docck-plugin-1.0-source-release.zip <
[WARNING]  > maven-docck-plugin-1.0-source-release.zip.asc <
[WARNING]  > maven-docck-plugin-1.0-source-release.zip.md5 <
[WARNING] Missing file for maven-docck-plugin in http://www.apache.org/dist/maven/plugins
[WARNING]  > maven-docck-plugin-1.0-source-release.zip <
[WARNING]  > maven-docck-plugin-1.0-source-release.zip.asc <
[WARNING]  > maven-docck-plugin-1.0-source-release.zip.md5 <
[WARNING] Missing file for apache-incubator-disclaimer-resource-bundle in http://repo.maven.apache.org/maven2/org/apache/apache-incubator-disclaimer-resource-bundle/1.1
[WARNING]  > apache-incubator-disclaimer-resource-bundle-1.1-source-release.zip <
[WARNING]  > apache-incubator-disclaimer-resource-bundle-1.1-source-release.zip.asc <
[WARNING]  > apache-incubator-disclaimer-resource-bundle-1.1-source-release.zip.md5 <
[WARNING] Missing file for apache-incubator-disclaimer-resource-bundle in http://www.apache.org/dist/maven/resources
[WARNING]  > apache-incubator-disclaimer-resource-bundle-1.1-source-release.zip <
[WARNING]  > apache-incubator-disclaimer-resource-bundle-1.1-source-release.zip.asc <
[WARNING]  > apache-incubator-disclaimer-resource-bundle-1.1-source-release.zip.md5 <
[WARNING] Missing file for apache-jar-resource-bundle in http://repo.maven.apache.org/maven2/org/apache/apache-jar-resource-bundle/1.4
[WARNING]  > apache-jar-resource-bundle-1.4-source-release.zip <
[WARNING]  > apache-jar-resource-bundle-1.4-source-release.zip.asc <
[WARNING]  > apache-jar-resource-bundle-1.4-source-release.zip.md5 <
[WARNING] Missing file for apache-jar-resource-bundle in http://www.apache.org/dist/maven/resources
[WARNING]  > apache-jar-resource-bundle-1.4-source-release.zip <
[WARNING]  > apache-jar-resource-bundle-1.4-source-release.zip.asc <
[WARNING]  > apache-jar-resource-bundle-1.4-source-release.zip.md5 <
[WARNING] Missing file for apache-license-header-resource-bundle in http://repo.maven.apache.org/maven2/org/apache/apache-license-header-resource-bundle/1.1
[WARNING]  > apache-license-header-resource-bundle-1.1-source-release.zip <
[WARNING]  > apache-license-header-resource-bundle-1.1-source-release.zip.asc <
[WARNING]  > apache-license-header-resource-bundle-1.1-source-release.zip.md5 <
[WARNING] Missing file for apache-license-header-resource-bundle in http://www.apache.org/dist/maven/resources
[WARNING]  > apache-license-header-resource-bundle-1.1-source-release.zip <
[WARNING]  > apache-license-header-resource-bundle-1.1-source-release.zip.asc <
[WARNING]  > apache-license-header-resource-bundle-1.1-source-release.zip.md5 <
[ERROR] Missing file for maven-scm in http://www.apache.org/dist/maven/scm
[ERROR]  > maven-scm-1.9.1-source-release.zip <
[ERROR]  > maven-scm-1.9.1-source-release.zip.asc <
[ERROR]  > maven-scm-1.9.1-source-release.zip.md5 <
[ERROR] Different version than 1.9.1 for maven-scm available in http://www.apache.org/dist/maven/scm
[ERROR]  > maven-scm-1.9-source-release.zip <
[ERROR]  > maven-scm-1.9-source-release.zip.asc <
[ERROR]  > maven-scm-1.9-source-release.zip.md5 <
[WARNING] Missing file for file-management in http://repo.maven.apache.org/maven2/org/apache/maven/shared/file-management/1.2.1
[WARNING]  > file-management-1.2.1-source-release.zip <
[WARNING]  > file-management-1.2.1-source-release.zip.asc <
[WARNING]  > file-management-1.2.1-source-release.zip.md5 <
[WARNING] Missing file for file-management in http://www.apache.org/dist/maven/shared
[WARNING]  > file-management-1.2.1-source-release.zip <
[WARNING]  > file-management-1.2.1-source-release.zip.asc <
[WARNING]  > file-management-1.2.1-source-release.zip.md5 <
[WARNING] Missing file for maven-repository-builder in http://repo.maven.apache.org/maven2/org/apache/maven/shared/maven-repository-builder/1.0-alpha-2
[WARNING]  > maven-repository-builder-1.0-alpha-2-source-release.zip <
[WARNING]  > maven-repository-builder-1.0-alpha-2-source-release.zip.asc <
[WARNING]  > maven-repository-builder-1.0-alpha-2-source-release.zip.md5 <
[WARNING] Missing file for maven-repository-builder in http://www.apache.org/dist/maven/shared
[WARNING]  > maven-repository-builder-1.0-alpha-2-source-release.zip <
[WARNING]  > maven-repository-builder-1.0-alpha-2-source-release.zip.asc <
[WARNING]  > maven-repository-builder-1.0-alpha-2-source-release.zip.md5 <
[INFO] Generating "Dist Tool> Index Pages" report    --- dist-tool-plugin:1.0-SNAPSHOT
[INFO] Generating "Failure Hack" report    --- dist-tool-plugin:1.0-SNAPSHOT
[ERROR] check-source-release.log error log not empty:
Missing file for maven-scm in http://www.apache.org/dist/maven/scm
 > maven-scm-1.9.1-source-release.zip <
 > maven-scm-1.9.1-source-release.zip.asc <
 > maven-scm-1.9.1-source-release.zip.md5 <
Different version than 1.9.1 for maven-scm available in http://www.apache.org/dist/maven/scm
 > maven-scm-1.9-source-release.zip <
 > maven-scm-1.9-source-release.zip.asc <
 > maven-scm-1.9-source-release.zip.md5 <

[JENKINS] Archiving site from <https://builds.apache.org/job/dist-tool-plugin/ws/target/site> to /x1/jenkins/jenkins-home/jobs/dist-tool-plugin/site
[INFO] ------------------------------------------------------------------------
[INFO] BUILD FAILURE
[INFO] ------------------------------------------------------------------------
[INFO] Total time: 4:43.171s
[INFO] Finished at: Sat Jul 26 09:56:45 UTC 2014
[INFO] Final Memory: 57M/449M
[INFO] ------------------------------------------------------------------------
Waiting for Jenkins to finish collecting data
[ERROR] Failed to execute goal org.apache.maven.plugins:maven-site-plugin:3.3:site (default-site) on project dist-tool-plugin: Error during page generation: Error rendering Maven report: Dist tools report non empty please check: https://builds.apache.org/job/dist-tool-plugin/site/ -> [Help 1]
org.apache.maven.lifecycle.LifecycleExecutionException: Failed to execute goal org.apache.maven.plugins:maven-site-plugin:3.3:site (default-site) on project dist-tool-plugin: Error during page generation
	at org.apache.maven.lifecycle.internal.MojoExecutor.execute(MojoExecutor.java:217)
	at org.apache.maven.lifecycle.internal.MojoExecutor.execute(MojoExecutor.java:153)
	at org.apache.maven.lifecycle.internal.MojoExecutor.execute(MojoExecutor.java:145)
	at org.apache.maven.lifecycle.internal.LifecycleModuleBuilder.buildProject(LifecycleModuleBuilder.java:84)
	at org.apache.maven.lifecycle.internal.LifecycleModuleBuilder.buildProject(LifecycleModuleBuilder.java:59)
	at org.apache.maven.lifecycle.internal.LifecycleStarter.singleThreadedBuild(LifecycleStarter.java:183)
	at org.apache.maven.lifecycle.internal.LifecycleStarter.execute(LifecycleStarter.java:161)
	at org.apache.maven.DefaultMaven.doExecute(DefaultMaven.java:320)
	at org.apache.maven.DefaultMaven.execute(DefaultMaven.java:156)
	at org.jvnet.hudson.maven3.launcher.Maven3Launcher.main(Maven3Launcher.java:117)
	at sun.reflect.NativeMethodAccessorImpl.invoke0(Native Method)
	at sun.reflect.NativeMethodAccessorImpl.invoke(NativeMethodAccessorImpl.java:57)
	at sun.reflect.DelegatingMethodAccessorImpl.invoke(DelegatingMethodAccessorImpl.java:43)
	at java.lang.reflect.Method.invoke(Method.java:606)
	at org.codehaus.plexus.classworlds.launcher.Launcher.launchStandard(Launcher.java:329)
	at org.codehaus.plexus.classworlds.launcher.Launcher.launch(Launcher.java:239)
	at org.jvnet.hudson.maven3.agent.Maven3Main.launch(Maven3Main.java:178)
	at sun.reflect.NativeMethodAccessorImpl.invoke0(Native Method)
	at sun.reflect.NativeMethodAccessorImpl.invoke(NativeMethodAccessorImpl.java:57)
	at sun.reflect.DelegatingMethodAccessorImpl.invoke(DelegatingMethodAccessorImpl.java:43)
	at java.lang.reflect.Method.invoke(Method.java:606)
	at hudson.maven.Maven3Builder.call(Maven3Builder.java:134)
	at hudson.maven.Maven3Builder.call(Maven3Builder.java:69)
	at hudson.remoting.UserRequest.perform(UserRequest.java:118)
	at hudson.remoting.UserRequest.perform(UserRequest.java:48)
	at hudson.remoting.Request$2.run(Request.java:328)
	at hudson.remoting.InterceptingExecutorService$1.call(InterceptingExecutorService.java:72)
	at java.util.concurrent.FutureTask$Sync.innerRun(FutureTask.java:334)
	at java.util.concurrent.FutureTask.run(FutureTask.java:166)
	at java.util.concurrent.ThreadPoolExecutor.runWorker(ThreadPoolExecutor.java:1145)
	at java.util.concurrent.ThreadPoolExecutor$Worker.run(ThreadPoolExecutor.java:615)
	at java.lang.Thread.run(Thread.java:724)
Caused by: org.apache.maven.plugin.MojoExecutionException: Error during page generation
	at org.apache.maven.plugins.site.SiteMojo.execute(SiteMojo.java:143)
	at org.apache.maven.plugin.DefaultBuildPluginManager.executeMojo(DefaultBuildPluginManager.java:101)
	at org.apache.maven.lifecycle.internal.MojoExecutor.execute(MojoExecutor.java:209)
	... 31 more
Caused by: org.apache.maven.doxia.siterenderer.RendererException: Error rendering Maven report: Dist tools report non empty please check: https://builds.apache.org/job/dist-tool-plugin/site/
	at org.apache.maven.plugins.site.ReportDocumentRenderer.renderDocument(ReportDocumentRenderer.java:233)
	at org.apache.maven.doxia.siterenderer.DefaultSiteRenderer.renderModule(DefaultSiteRenderer.java:319)
	at org.apache.maven.doxia.siterenderer.DefaultSiteRenderer.render(DefaultSiteRenderer.java:135)
	at org.apache.maven.plugins.site.SiteMojo.renderLocale(SiteMojo.java:175)
	at org.apache.maven.plugins.site.SiteMojo.execute(SiteMojo.java:138)
	... 33 more
Caused by: org.apache.maven.reporting.MavenReportException: Dist tools report non empty please check: https://builds.apache.org/job/dist-tool-plugin/site/
	at org.apache.maven.dist.tools.DummyFailureMojo.executeReport(DummyFailureMojo.java:123)
	at org.apache.maven.reporting.AbstractMavenReport.generate(AbstractMavenReport.java:196)
	at org.apache.maven.plugins.site.ReportDocumentRenderer.renderDocument(ReportDocumentRenderer.java:219)
	... 37 more
[ERROR] 
[ERROR] Re-run Maven using the -X switch to enable full debug logging.
[ERROR] 
[ERROR] For more information about the errors and possible solutions, please read the following articles:
[ERROR] [Help 1] http://cwiki.apache.org/confluence/display/MAVEN/MojoExecutionException
[JENKINS] Archiving <https://builds.apache.org/job/dist-tool-plugin/ws/pom.xml> to org.apache.maven.dist.tools/dist-tool-plugin/1.0-SNAPSHOT/dist-tool-plugin-1.0-SNAPSHOT.pom
[JENKINS] Archiving <https://builds.apache.org/job/dist-tool-plugin/ws/target/dist-tool-plugin-1.0-SNAPSHOT.jar> to org.apache.maven.dist.tools/dist-tool-plugin/1.0-SNAPSHOT/dist-tool-plugin-1.0-SNAPSHOT.jar
Sending artifact delta relative to dist-tool-plugin ? dist-tool-plugin #532
Archived 2 artifacts
Archive block size is 32768
Received 0 blocks and 73467 bytes
Compression is 0.0%
Took 0.14 sec
channel stopped

Jenkins build is back to normal : dist-tool-plugin #534

Posted by Apache Jenkins Server <je...@builds.apache.org>.
See <https://builds.apache.org/job/dist-tool-plugin/534/changes>