You are viewing a plain text version of this content. The canonical link for it is here.
Posted to yarn-dev@hadoop.apache.org by Apache Jenkins Server <je...@builds.apache.org> on 2015/05/28 12:54:25 UTC
Failed: YARN-3732 PreCommit Build #8112
Jira: https://issues.apache.org/jira/browse/YARN-3732
Build: https://builds.apache.org/job/PreCommit-YARN-Build/8112/
###################################################################################
########################## LAST 60 LINES OF THE CONSOLE ###########################
[...truncated 270 lines...]
| | | | warnings.
| +1 | checkstyle | 0m 33s | There were no new checkstyle
| | | | issues.
| -1 | whitespace | 0m 1s | The patch has 2 line(s) that end in
| | | | whitespace. Use git apply
| | | | --whitespace=fix.
| +1 | install | 1m 35s | mvn install still works.
| +1 | eclipse:eclipse | 0m 32s | The patch built with
| | | | eclipse:eclipse.
| +1 | findbugs | 0m 52s | The patch does not introduce any
| | | | new Findbugs (version 3.0.0)
| | | | warnings.
| +1 | yarn tests | 0m 25s | Tests passed in
| | | | hadoop-yarn-server-common.
| | | 37m 18s |
|| Subsystem || Report/Notes ||
============================================================================
| Patch URL | http://issues.apache.org/jira/secure/attachment/12735838/YARN-3732.patch |
| Optional Tests | javadoc javac unit findbugs checkstyle |
| git revision | trunk / 7e509f5 |
| whitespace | /home/jenkins/jenkins-slave/workspace/PreCommit-YARN-Build/patchprocess/whitespace.txt |
| hadoop-yarn-server-common test log | /home/jenkins/jenkins-slave/workspace/PreCommit-YARN-Build/patchprocess/testrun_hadoop-yarn-server-common.txt |
| Test Results | https://builds.apache.org/job/PreCommit-YARN-Build/8112/testReport/ |
| Java | 1.7.0_55 |
| uname | Linux asf904.gq1.ygridcore.net 3.13.0-36-lowlatency #63-Ubuntu SMP PREEMPT Wed Sep 3 21:56:12 UTC 2014 x86_64 x86_64 x86_64 GNU/Linux |
============================================================================
============================================================================
Adding comment to JIRA
============================================================================
============================================================================
Comment added.
e8e49a535133219649775aa2f7b91504f29378e6 logged out
============================================================================
============================================================================
Finished build.
============================================================================
============================================================================
Build step 'Execute shell' marked build as failure
Archiving artifacts
Sending artifact delta relative to PreCommit-YARN-Build #8110
Archived 24 artifacts
Archive block size is 32768
Received 58 blocks and 10464711 bytes
Compression is 15.4%
Took 4.4 sec
[description-setter] Could not determine description.
Recording test results
Email was triggered for: Failure
Sending email for trigger: Failure
###################################################################################
############################## FAILED TESTS (if any) ##############################
All tests passed
Failed: YARN-2556 PreCommit Build #8116
Posted by Apache Jenkins Server <je...@builds.apache.org>.
Jira: https://issues.apache.org/jira/browse/YARN-2556
Build: https://builds.apache.org/job/PreCommit-YARN-Build/8116/
###################################################################################
########################## LAST 60 LINES OF THE CONSOLE ###########################
[...truncated 267 lines...]
| +1 | findbugs | 0m 55s | The patch does not introduce any
| | | | new Findbugs (version 3.0.0)
| | | | warnings.
| -1 | mapreduce tests | 86m 41s | Tests failed in
| | | | hadoop-mapreduce-client-jobclient.
| | | 106m 46s |
Reason | Tests
Failed unit tests | hadoop.mapred.join.TestDatamerge
| hadoop.mapred.TestLazyOutput
| hadoop.mapred.TestReduceFetch
| hadoop.mapred.TestJobName
Timed out tests | org.apache.hadoop.mapreduce.v2.TestMRJobs
| org.apache.hadoop.mapred.TestMRIntermediateDataEncryption
|| Subsystem || Report/Notes ||
============================================================================
| Patch URL | http://issues.apache.org/jira/secure/attachment/12735924/YARN-2556.11.patch |
| Optional Tests | javac unit findbugs checkstyle |
| git revision | trunk / 246cefa |
| whitespace | /home/jenkins/jenkins-slave/workspace/PreCommit-YARN-Build/patchprocess/whitespace.txt |
| hadoop-mapreduce-client-jobclient test log | /home/jenkins/jenkins-slave/workspace/PreCommit-YARN-Build/patchprocess/testrun_hadoop-mapreduce-client-jobclient.txt |
| Test Results | https://builds.apache.org/job/PreCommit-YARN-Build/8116/testReport/ |
| Java | 1.7.0_55 |
| uname | Linux asf904.gq1.ygridcore.net 3.13.0-36-lowlatency #63-Ubuntu SMP PREEMPT Wed Sep 3 21:56:12 UTC 2014 x86_64 x86_64 x86_64 GNU/Linux |
============================================================================
============================================================================
Adding comment to JIRA
============================================================================
============================================================================
Comment added.
4d9f92a2e275228c7607fc5e9362739ee54dae89 logged out
============================================================================
============================================================================
Finished build.
============================================================================
============================================================================
Build step 'Execute shell' marked build as failure
Archiving artifacts
Sending artifact delta relative to PreCommit-YARN-Build #8110
Archived 27 artifacts
Archive block size is 32768
Received 41 blocks and 3215809 bytes
Compression is 29.5%
Took 0.87 sec
[description-setter] Could not determine description.
Recording test results
Email was triggered for: Failure
Sending email for trigger: Failure
###################################################################################
############################## FAILED TESTS (if any) ##############################
9 tests failed.
FAILED: org.apache.hadoop.mapred.TestJobName.testComplexNameWithRegex
Error Message:
org/apache/hadoop/util/ShutdownThreadsHelper
Stack Trace:
java.lang.NoClassDefFoundError: org/apache/hadoop/util/ShutdownThreadsHelper
at org.apache.hadoop.mapreduce.v2.hs.HistoryFileManager.serviceStop(HistoryFileManager.java:635)
at org.apache.hadoop.service.AbstractService.stop(AbstractService.java:221)
at org.apache.hadoop.mapreduce.v2.hs.JobHistory.serviceStop(JobHistory.java:171)
at org.apache.hadoop.service.AbstractService.stop(AbstractService.java:221)
at org.apache.hadoop.service.ServiceOperations.stop(ServiceOperations.java:52)
at org.apache.hadoop.service.ServiceOperations.stopQuietly(ServiceOperations.java:80)
at org.apache.hadoop.service.CompositeService.stop(CompositeService.java:157)
at org.apache.hadoop.service.CompositeService.serviceStop(CompositeService.java:131)
at org.apache.hadoop.mapreduce.v2.hs.JobHistoryServer.serviceStop(JobHistoryServer.java:201)
at org.apache.hadoop.service.AbstractService.stop(AbstractService.java:221)
at org.apache.hadoop.mapreduce.v2.MiniMRYarnCluster$JobHistoryServerWrapper.serviceStop(MiniMRYarnCluster.java:248)
at org.apache.hadoop.service.AbstractService.stop(AbstractService.java:221)
at org.apache.hadoop.service.ServiceOperations.stop(ServiceOperations.java:52)
at org.apache.hadoop.service.ServiceOperations.stopQuietly(ServiceOperations.java:80)
at org.apache.hadoop.service.CompositeService.stop(CompositeService.java:157)
at org.apache.hadoop.service.CompositeService.serviceStop(CompositeService.java:131)
at org.apache.hadoop.service.AbstractService.stop(AbstractService.java:221)
at org.apache.hadoop.mapred.MiniMRYarnClusterAdapter.stop(MiniMRYarnClusterAdapter.java:55)
at org.apache.hadoop.mapred.MiniMRCluster.shutdown(MiniMRCluster.java:267)
at org.apache.hadoop.mapred.ClusterMapReduceTestCase.stopCluster(ClusterMapReduceTestCase.java:128)
at org.apache.hadoop.mapred.ClusterMapReduceTestCase.tearDown(ClusterMapReduceTestCase.java:143)
at junit.framework.TestCase.runBare(TestCase.java:146)
at junit.framework.TestResult$1.protect(TestResult.java:122)
at junit.framework.TestResult.runProtected(TestResult.java:142)
at junit.framework.TestResult.run(TestResult.java:125)
at junit.framework.TestCase.run(TestCase.java:129)
at junit.framework.TestSuite.runTest(TestSuite.java:255)
at junit.framework.TestSuite.run(TestSuite.java:250)
at org.junit.internal.runners.JUnit38ClassRunner.run(JUnit38ClassRunner.java:84)
at org.apache.maven.surefire.junit4.JUnit4Provider.execute(JUnit4Provider.java:264)
at org.apache.maven.surefire.junit4.JUnit4Provider.executeTestSet(JUnit4Provider.java:153)
at org.apache.maven.surefire.junit4.JUnit4Provider.invoke(JUnit4Provider.java:124)
at org.apache.maven.surefire.booter.ForkedBooter.invokeProviderInSameClassLoader(ForkedBooter.java:200)
at org.apache.maven.surefire.booter.ForkedBooter.runSuitesInProcess(ForkedBooter.java:153)
at org.apache.maven.surefire.booter.ForkedBooter.main(ForkedBooter.java:103)
Caused by: java.lang.ClassNotFoundException: org.apache.hadoop.util.ShutdownThreadsHelper
at java.net.URLClassLoader$1.run(URLClassLoader.java:366)
at java.net.URLClassLoader$1.run(URLClassLoader.java:355)
at java.security.AccessController.doPrivileged(Native Method)
at java.net.URLClassLoader.findClass(URLClassLoader.java:354)
at java.lang.ClassLoader.loadClass(ClassLoader.java:425)
at sun.misc.Launcher$AppClassLoader.loadClass(Launcher.java:308)
at java.lang.ClassLoader.loadClass(ClassLoader.java:358)
at org.apache.hadoop.mapreduce.v2.hs.HistoryFileManager.serviceStop(HistoryFileManager.java:635)
at org.apache.hadoop.service.AbstractService.stop(AbstractService.java:221)
at org.apache.hadoop.mapreduce.v2.hs.JobHistory.serviceStop(JobHistory.java:171)
at org.apache.hadoop.service.AbstractService.stop(AbstractService.java:221)
at org.apache.hadoop.service.ServiceOperations.stop(ServiceOperations.java:52)
at org.apache.hadoop.service.ServiceOperations.stopQuietly(ServiceOperations.java:80)
at org.apache.hadoop.service.CompositeService.stop(CompositeService.java:157)
at org.apache.hadoop.service.CompositeService.serviceStop(CompositeService.java:131)
at org.apache.hadoop.mapreduce.v2.hs.JobHistoryServer.serviceStop(JobHistoryServer.java:201)
at org.apache.hadoop.service.AbstractService.stop(AbstractService.java:221)
at org.apache.hadoop.mapreduce.v2.MiniMRYarnCluster$JobHistoryServerWrapper.serviceStop(MiniMRYarnCluster.java:248)
at org.apache.hadoop.service.AbstractService.stop(AbstractService.java:221)
at org.apache.hadoop.service.ServiceOperations.stop(ServiceOperations.java:52)
at org.apache.hadoop.service.ServiceOperations.stopQuietly(ServiceOperations.java:80)
at org.apache.hadoop.service.CompositeService.stop(CompositeService.java:157)
at org.apache.hadoop.service.CompositeService.serviceStop(CompositeService.java:131)
at org.apache.hadoop.service.AbstractService.stop(AbstractService.java:221)
at org.apache.hadoop.mapred.MiniMRYarnClusterAdapter.stop(MiniMRYarnClusterAdapter.java:55)
at org.apache.hadoop.mapred.MiniMRCluster.shutdown(MiniMRCluster.java:267)
at org.apache.hadoop.mapred.ClusterMapReduceTestCase.stopCluster(ClusterMapReduceTestCase.java:128)
at org.apache.hadoop.mapred.ClusterMapReduceTestCase.tearDown(ClusterMapReduceTestCase.java:143)
at junit.framework.TestCase.runBare(TestCase.java:146)
at junit.framework.TestResult$1.protect(TestResult.java:122)
at junit.framework.TestResult.runProtected(TestResult.java:142)
at junit.framework.TestResult.run(TestResult.java:125)
at junit.framework.TestCase.run(TestCase.java:129)
at junit.framework.TestSuite.runTest(TestSuite.java:255)
at junit.framework.TestSuite.run(TestSuite.java:250)
at org.junit.internal.runners.JUnit38ClassRunner.run(JUnit38ClassRunner.java:84)
at org.apache.maven.surefire.junit4.JUnit4Provider.execute(JUnit4Provider.java:264)
at org.apache.maven.surefire.junit4.JUnit4Provider.executeTestSet(JUnit4Provider.java:153)
at org.apache.maven.surefire.junit4.JUnit4Provider.invoke(JUnit4Provider.java:124)
at org.apache.maven.surefire.booter.ForkedBooter.invokeProviderInSameClassLoader(ForkedBooter.java:200)
at org.apache.maven.surefire.booter.ForkedBooter.runSuitesInProcess(ForkedBooter.java:153)
at org.apache.maven.surefire.booter.ForkedBooter.main(ForkedBooter.java:103)
FAILED: org.apache.hadoop.mapred.TestJobName.testComplexName
Error Message:
could not cleanup test dir: org.apache.hadoop.fs.UnsupportedFileSystemException: fs.AbstractFileSystem.file.impl=null: No AbstractFileSystem configured for scheme: file
Stack Trace:
org.apache.hadoop.yarn.exceptions.YarnRuntimeException: could not cleanup test dir: org.apache.hadoop.fs.UnsupportedFileSystemException: fs.AbstractFileSystem.file.impl=null: No AbstractFileSystem configured for scheme: file
at org.apache.hadoop.yarn.server.MiniYARNCluster.<init>(MiniYARNCluster.java:148)
at org.apache.hadoop.mapreduce.v2.MiniMRYarnCluster.<init>(MiniMRYarnCluster.java:79)
at org.apache.hadoop.mapreduce.v2.MiniMRYarnCluster.<init>(MiniMRYarnCluster.java:75)
at org.apache.hadoop.mapred.MiniMRClientClusterFactory.create(MiniMRClientClusterFactory.java:73)
at org.apache.hadoop.mapred.MiniMRCluster.<init>(MiniMRCluster.java:187)
at org.apache.hadoop.mapred.MiniMRCluster.<init>(MiniMRCluster.java:175)
at org.apache.hadoop.mapred.MiniMRCluster.<init>(MiniMRCluster.java:167)
at org.apache.hadoop.mapred.ClusterMapReduceTestCase$ConfigurableMiniMRCluster.<init>(ClusterMapReduceTestCase.java:101)
at org.apache.hadoop.mapred.ClusterMapReduceTestCase.startCluster(ClusterMapReduceTestCase.java:86)
at org.apache.hadoop.mapred.ClusterMapReduceTestCase.setUp(ClusterMapReduceTestCase.java:56)
at junit.framework.TestCase.runBare(TestCase.java:139)
at junit.framework.TestResult$1.protect(TestResult.java:122)
at junit.framework.TestResult.runProtected(TestResult.java:142)
at junit.framework.TestResult.run(TestResult.java:125)
at junit.framework.TestCase.run(TestCase.java:129)
at junit.framework.TestSuite.runTest(TestSuite.java:255)
at junit.framework.TestSuite.run(TestSuite.java:250)
at org.junit.internal.runners.JUnit38ClassRunner.run(JUnit38ClassRunner.java:84)
at org.apache.maven.surefire.junit4.JUnit4Provider.execute(JUnit4Provider.java:264)
at org.apache.maven.surefire.junit4.JUnit4Provider.executeTestSet(JUnit4Provider.java:153)
at org.apache.maven.surefire.junit4.JUnit4Provider.invoke(JUnit4Provider.java:124)
at org.apache.maven.surefire.booter.ForkedBooter.invokeProviderInSameClassLoader(ForkedBooter.java:200)
at org.apache.maven.surefire.booter.ForkedBooter.runSuitesInProcess(ForkedBooter.java:153)
at org.apache.maven.surefire.booter.ForkedBooter.main(ForkedBooter.java:103)
Caused by: org.apache.hadoop.fs.UnsupportedFileSystemException: fs.AbstractFileSystem.file.impl=null: No AbstractFileSystem configured for scheme: file
at org.apache.hadoop.fs.AbstractFileSystem.createFileSystem(AbstractFileSystem.java:161)
at org.apache.hadoop.fs.AbstractFileSystem.get(AbstractFileSystem.java:250)
at org.apache.hadoop.fs.FileContext$2.run(FileContext.java:325)
at org.apache.hadoop.fs.FileContext$2.run(FileContext.java:322)
at java.security.AccessController.doPrivileged(Native Method)
at javax.security.auth.Subject.doAs(Subject.java:415)
at org.apache.hadoop.security.UserGroupInformation.doAs(UserGroupInformation.java:1666)
at org.apache.hadoop.fs.FileContext.getAbstractFileSystem(FileContext.java:322)
at org.apache.hadoop.fs.FileContext.getFileContext(FileContext.java:439)
at org.apache.hadoop.fs.FileContext.getFileContext(FileContext.java:416)
at org.apache.hadoop.fs.FileContext.getLocalFSFileContext(FileContext.java:402)
at org.apache.hadoop.yarn.server.MiniYARNCluster.<init>(MiniYARNCluster.java:144)
at org.apache.hadoop.mapreduce.v2.MiniMRYarnCluster.<init>(MiniMRYarnCluster.java:79)
at org.apache.hadoop.mapreduce.v2.MiniMRYarnCluster.<init>(MiniMRYarnCluster.java:75)
at org.apache.hadoop.mapred.MiniMRClientClusterFactory.create(MiniMRClientClusterFactory.java:73)
at org.apache.hadoop.mapred.MiniMRCluster.<init>(MiniMRCluster.java:187)
at org.apache.hadoop.mapred.MiniMRCluster.<init>(MiniMRCluster.java:175)
at org.apache.hadoop.mapred.MiniMRCluster.<init>(MiniMRCluster.java:167)
at org.apache.hadoop.mapred.ClusterMapReduceTestCase$ConfigurableMiniMRCluster.<init>(ClusterMapReduceTestCase.java:101)
at org.apache.hadoop.mapred.ClusterMapReduceTestCase.startCluster(ClusterMapReduceTestCase.java:86)
at org.apache.hadoop.mapred.ClusterMapReduceTestCase.setUp(ClusterMapReduceTestCase.java:56)
at junit.framework.TestCase.runBare(TestCase.java:139)
at junit.framework.TestResult$1.protect(TestResult.java:122)
at junit.framework.TestResult.runProtected(TestResult.java:142)
at junit.framework.TestResult.run(TestResult.java:125)
at junit.framework.TestCase.run(TestCase.java:129)
at junit.framework.TestSuite.runTest(TestSuite.java:255)
at junit.framework.TestSuite.run(TestSuite.java:250)
at org.junit.internal.runners.JUnit38ClassRunner.run(JUnit38ClassRunner.java:84)
at org.apache.maven.surefire.junit4.JUnit4Provider.execute(JUnit4Provider.java:264)
at org.apache.maven.surefire.junit4.JUnit4Provider.executeTestSet(JUnit4Provider.java:153)
at org.apache.maven.surefire.junit4.JUnit4Provider.invoke(JUnit4Provider.java:124)
at org.apache.maven.surefire.booter.ForkedBooter.invokeProviderInSameClassLoader(ForkedBooter.java:200)
at org.apache.maven.surefire.booter.ForkedBooter.runSuitesInProcess(ForkedBooter.java:153)
at org.apache.maven.surefire.booter.ForkedBooter.main(ForkedBooter.java:103)
FAILED: org.apache.hadoop.mapred.TestLazyOutput.testLazyOutput
Error Message:
org/apache/hadoop/mapred/Clock
Stack Trace:
java.lang.NoClassDefFoundError: org/apache/hadoop/mapred/Clock
at java.net.URLClassLoader$1.run(URLClassLoader.java:366)
at java.net.URLClassLoader$1.run(URLClassLoader.java:355)
at java.security.AccessController.doPrivileged(Native Method)
at java.net.URLClassLoader.findClass(URLClassLoader.java:354)
at java.lang.ClassLoader.loadClass(ClassLoader.java:425)
at sun.misc.Launcher$AppClassLoader.loadClass(Launcher.java:308)
at java.lang.ClassLoader.loadClass(ClassLoader.java:358)
at org.apache.hadoop.mapred.MiniMRCluster.<init>(MiniMRCluster.java:175)
at org.apache.hadoop.mapred.MiniMRCluster.<init>(MiniMRCluster.java:167)
at org.apache.hadoop.mapred.MiniMRCluster.<init>(MiniMRCluster.java:159)
at org.apache.hadoop.mapred.MiniMRCluster.<init>(MiniMRCluster.java:152)
at org.apache.hadoop.mapred.MiniMRCluster.<init>(MiniMRCluster.java:145)
at org.apache.hadoop.mapred.MiniMRCluster.<init>(MiniMRCluster.java:138)
at org.apache.hadoop.mapred.MiniMRCluster.<init>(MiniMRCluster.java:133)
at org.apache.hadoop.mapred.TestLazyOutput.testLazyOutput(TestLazyOutput.java:147)
FAILED: org.apache.hadoop.mapred.TestReduceFetchFromPartialMem$1.org.apache.hadoop.mapred.TestReduceFetchFromPartialMem
Error Message:
org/apache/hadoop/yarn/event/EventHandler
Stack Trace:
java.lang.NoClassDefFoundError: org/apache/hadoop/yarn/event/EventHandler
at java.net.URLClassLoader$1.run(URLClassLoader.java:366)
at java.net.URLClassLoader$1.run(URLClassLoader.java:355)
at java.security.AccessController.doPrivileged(Native Method)
at java.net.URLClassLoader.findClass(URLClassLoader.java:354)
at java.lang.ClassLoader.loadClass(ClassLoader.java:425)
at sun.misc.Launcher$AppClassLoader.loadClass(Launcher.java:308)
at java.lang.ClassLoader.loadClass(ClassLoader.java:358)
at java.lang.ClassLoader.defineClass1(Native Method)
at java.lang.ClassLoader.defineClass(ClassLoader.java:800)
at java.security.SecureClassLoader.defineClass(SecureClassLoader.java:142)
at java.net.URLClassLoader.defineClass(URLClassLoader.java:449)
at java.net.URLClassLoader.access$100(URLClassLoader.java:71)
at java.net.URLClassLoader$1.run(URLClassLoader.java:361)
at java.net.URLClassLoader$1.run(URLClassLoader.java:355)
at java.security.AccessController.doPrivileged(Native Method)
at java.net.URLClassLoader.findClass(URLClassLoader.java:354)
at java.lang.ClassLoader.loadClass(ClassLoader.java:425)
at sun.misc.Launcher$AppClassLoader.loadClass(Launcher.java:308)
at java.lang.ClassLoader.loadClass(ClassLoader.java:358)
at java.lang.ClassLoader.defineClass1(Native Method)
at java.lang.ClassLoader.defineClass(ClassLoader.java:800)
at java.security.SecureClassLoader.defineClass(SecureClassLoader.java:142)
at java.net.URLClassLoader.defineClass(URLClassLoader.java:449)
at java.net.URLClassLoader.access$100(URLClassLoader.java:71)
at java.net.URLClassLoader$1.run(URLClassLoader.java:361)
at java.net.URLClassLoader$1.run(URLClassLoader.java:355)
at java.security.AccessController.doPrivileged(Native Method)
at java.net.URLClassLoader.findClass(URLClassLoader.java:354)
at java.lang.ClassLoader.loadClass(ClassLoader.java:425)
at sun.misc.Launcher$AppClassLoader.loadClass(Launcher.java:308)
at java.lang.ClassLoader.loadClass(ClassLoader.java:358)
at org.apache.hadoop.mapred.MiniMRClientClusterFactory.create(MiniMRClientClusterFactory.java:58)
at org.apache.hadoop.mapred.MiniMRCluster.<init>(MiniMRCluster.java:187)
at org.apache.hadoop.mapred.MiniMRCluster.<init>(MiniMRCluster.java:175)
at org.apache.hadoop.mapred.MiniMRCluster.<init>(MiniMRCluster.java:167)
at org.apache.hadoop.mapred.MiniMRCluster.<init>(MiniMRCluster.java:159)
at org.apache.hadoop.mapred.MiniMRCluster.<init>(MiniMRCluster.java:152)
at org.apache.hadoop.mapred.MiniMRCluster.<init>(MiniMRCluster.java:145)
at org.apache.hadoop.mapred.MiniMRCluster.<init>(MiniMRCluster.java:138)
at org.apache.hadoop.mapred.MiniMRCluster.<init>(MiniMRCluster.java:133)
at org.apache.hadoop.mapred.TestReduceFetchFromPartialMem$1.setUp(TestReduceFetchFromPartialMem.java:61)
FAILED: org.apache.hadoop.mapred.join.TestDatamerge.testNestedJoin
Error Message:
org/apache/hadoop/yarn/exceptions/YarnRuntimeException
Stack Trace:
java.lang.NoClassDefFoundError: org/apache/hadoop/yarn/exceptions/YarnRuntimeException
at java.net.URLClassLoader$1.run(URLClassLoader.java:366)
at java.net.URLClassLoader$1.run(URLClassLoader.java:355)
at java.security.AccessController.doPrivileged(Native Method)
at java.net.URLClassLoader.findClass(URLClassLoader.java:354)
at java.lang.ClassLoader.loadClass(ClassLoader.java:425)
at sun.misc.Launcher$AppClassLoader.loadClass(Launcher.java:308)
at java.lang.ClassLoader.loadClass(ClassLoader.java:358)
at org.apache.hadoop.mapred.LocalDistributedCacheManager.setup(LocalDistributedCacheManager.java:93)
at org.apache.hadoop.mapred.LocalJobRunner$Job.<init>(LocalJobRunner.java:164)
at org.apache.hadoop.mapred.LocalJobRunner.submitJob(LocalJobRunner.java:759)
at org.apache.hadoop.mapreduce.JobSubmitter.submitJobInternal(JobSubmitter.java:241)
at org.apache.hadoop.mapreduce.Job$10.run(Job.java:1290)
at org.apache.hadoop.mapreduce.Job$10.run(Job.java:1287)
at java.security.AccessController.doPrivileged(Native Method)
at javax.security.auth.Subject.doAs(Subject.java:415)
at org.apache.hadoop.security.UserGroupInformation.doAs(UserGroupInformation.java:1666)
at org.apache.hadoop.mapreduce.Job.submit(Job.java:1287)
at org.apache.hadoop.mapred.JobClient$1.run(JobClient.java:575)
at org.apache.hadoop.mapred.JobClient$1.run(JobClient.java:570)
at java.security.AccessController.doPrivileged(Native Method)
at javax.security.auth.Subject.doAs(Subject.java:415)
at org.apache.hadoop.security.UserGroupInformation.doAs(UserGroupInformation.java:1666)
at org.apache.hadoop.mapred.JobClient.submitJobInternal(JobClient.java:570)
at org.apache.hadoop.mapred.JobClient.submitJob(JobClient.java:561)
at org.apache.hadoop.mapred.JobClient.runJob(JobClient.java:864)
at org.apache.hadoop.mapred.join.TestDatamerge.testNestedJoin(TestDatamerge.java:319)
FAILED: org.apache.hadoop.mapred.join.TestDatamerge.testEmptyJoin
Error Message:
org/apache/hadoop/yarn/exceptions/YarnRuntimeException
Stack Trace:
java.lang.NoClassDefFoundError: org/apache/hadoop/yarn/exceptions/YarnRuntimeException
at java.net.URLClassLoader$1.run(URLClassLoader.java:366)
at java.net.URLClassLoader$1.run(URLClassLoader.java:355)
at java.security.AccessController.doPrivileged(Native Method)
at java.net.URLClassLoader.findClass(URLClassLoader.java:354)
at java.lang.ClassLoader.loadClass(ClassLoader.java:425)
at sun.misc.Launcher$AppClassLoader.loadClass(Launcher.java:308)
at java.lang.ClassLoader.loadClass(ClassLoader.java:358)
at org.apache.hadoop.mapred.LocalDistributedCacheManager.setup(LocalDistributedCacheManager.java:93)
at org.apache.hadoop.mapred.LocalJobRunner$Job.<init>(LocalJobRunner.java:164)
at org.apache.hadoop.mapred.LocalJobRunner.submitJob(LocalJobRunner.java:759)
at org.apache.hadoop.mapreduce.JobSubmitter.submitJobInternal(JobSubmitter.java:241)
at org.apache.hadoop.mapreduce.Job$10.run(Job.java:1290)
at org.apache.hadoop.mapreduce.Job$10.run(Job.java:1287)
at java.security.AccessController.doPrivileged(Native Method)
at javax.security.auth.Subject.doAs(Subject.java:415)
at org.apache.hadoop.security.UserGroupInformation.doAs(UserGroupInformation.java:1666)
at org.apache.hadoop.mapreduce.Job.submit(Job.java:1287)
at org.apache.hadoop.mapred.JobClient$1.run(JobClient.java:575)
at org.apache.hadoop.mapred.JobClient$1.run(JobClient.java:570)
at java.security.AccessController.doPrivileged(Native Method)
at javax.security.auth.Subject.doAs(Subject.java:415)
at org.apache.hadoop.security.UserGroupInformation.doAs(UserGroupInformation.java:1666)
at org.apache.hadoop.mapred.JobClient.submitJobInternal(JobClient.java:570)
at org.apache.hadoop.mapred.JobClient.submitJob(JobClient.java:561)
at org.apache.hadoop.mapred.JobClient.runJob(JobClient.java:864)
at org.apache.hadoop.mapred.join.TestDatamerge.testEmptyJoin(TestDatamerge.java:367)
FAILED: org.apache.hadoop.mapred.join.TestDatamerge.testSimpleOuterJoin
Error Message:
org/apache/hadoop/yarn/exceptions/YarnRuntimeException
Stack Trace:
java.lang.NoClassDefFoundError: org/apache/hadoop/yarn/exceptions/YarnRuntimeException
at java.net.URLClassLoader$1.run(URLClassLoader.java:366)
at java.net.URLClassLoader$1.run(URLClassLoader.java:355)
at java.security.AccessController.doPrivileged(Native Method)
at java.net.URLClassLoader.findClass(URLClassLoader.java:354)
at java.lang.ClassLoader.loadClass(ClassLoader.java:425)
at sun.misc.Launcher$AppClassLoader.loadClass(Launcher.java:308)
at java.lang.ClassLoader.loadClass(ClassLoader.java:358)
at org.apache.hadoop.mapred.LocalDistributedCacheManager.setup(LocalDistributedCacheManager.java:93)
at org.apache.hadoop.mapred.LocalJobRunner$Job.<init>(LocalJobRunner.java:164)
at org.apache.hadoop.mapred.LocalJobRunner.submitJob(LocalJobRunner.java:759)
at org.apache.hadoop.mapreduce.JobSubmitter.submitJobInternal(JobSubmitter.java:241)
at org.apache.hadoop.mapreduce.Job$10.run(Job.java:1290)
at org.apache.hadoop.mapreduce.Job$10.run(Job.java:1287)
at java.security.AccessController.doPrivileged(Native Method)
at javax.security.auth.Subject.doAs(Subject.java:415)
at org.apache.hadoop.security.UserGroupInformation.doAs(UserGroupInformation.java:1666)
at org.apache.hadoop.mapreduce.Job.submit(Job.java:1287)
at org.apache.hadoop.mapred.JobClient$1.run(JobClient.java:575)
at org.apache.hadoop.mapred.JobClient$1.run(JobClient.java:570)
at java.security.AccessController.doPrivileged(Native Method)
at javax.security.auth.Subject.doAs(Subject.java:415)
at org.apache.hadoop.security.UserGroupInformation.doAs(UserGroupInformation.java:1666)
at org.apache.hadoop.mapred.JobClient.submitJobInternal(JobClient.java:570)
at org.apache.hadoop.mapred.JobClient.submitJob(JobClient.java:561)
at org.apache.hadoop.mapred.JobClient.runJob(JobClient.java:864)
at org.apache.hadoop.mapred.join.TestDatamerge.joinAs(TestDatamerge.java:245)
at org.apache.hadoop.mapred.join.TestDatamerge.testSimpleOuterJoin(TestDatamerge.java:254)
FAILED: org.apache.hadoop.mapred.join.TestDatamerge.testSimpleOverride
Error Message:
org/apache/hadoop/yarn/exceptions/YarnRuntimeException
Stack Trace:
java.lang.NoClassDefFoundError: org/apache/hadoop/yarn/exceptions/YarnRuntimeException
at java.net.URLClassLoader$1.run(URLClassLoader.java:366)
at java.net.URLClassLoader$1.run(URLClassLoader.java:355)
at java.security.AccessController.doPrivileged(Native Method)
at java.net.URLClassLoader.findClass(URLClassLoader.java:354)
at java.lang.ClassLoader.loadClass(ClassLoader.java:425)
at sun.misc.Launcher$AppClassLoader.loadClass(Launcher.java:308)
at java.lang.ClassLoader.loadClass(ClassLoader.java:358)
at org.apache.hadoop.mapred.LocalDistributedCacheManager.setup(LocalDistributedCacheManager.java:93)
at org.apache.hadoop.mapred.LocalJobRunner$Job.<init>(LocalJobRunner.java:164)
at org.apache.hadoop.mapred.LocalJobRunner.submitJob(LocalJobRunner.java:759)
at org.apache.hadoop.mapreduce.JobSubmitter.submitJobInternal(JobSubmitter.java:241)
at org.apache.hadoop.mapreduce.Job$10.run(Job.java:1290)
at org.apache.hadoop.mapreduce.Job$10.run(Job.java:1287)
at java.security.AccessController.doPrivileged(Native Method)
at javax.security.auth.Subject.doAs(Subject.java:415)
at org.apache.hadoop.security.UserGroupInformation.doAs(UserGroupInformation.java:1666)
at org.apache.hadoop.mapreduce.Job.submit(Job.java:1287)
at org.apache.hadoop.mapred.JobClient$1.run(JobClient.java:575)
at org.apache.hadoop.mapred.JobClient$1.run(JobClient.java:570)
at java.security.AccessController.doPrivileged(Native Method)
at javax.security.auth.Subject.doAs(Subject.java:415)
at org.apache.hadoop.security.UserGroupInformation.doAs(UserGroupInformation.java:1666)
at org.apache.hadoop.mapred.JobClient.submitJobInternal(JobClient.java:570)
at org.apache.hadoop.mapred.JobClient.submitJob(JobClient.java:561)
at org.apache.hadoop.mapred.JobClient.runJob(JobClient.java:864)
at org.apache.hadoop.mapred.join.TestDatamerge.joinAs(TestDatamerge.java:245)
at org.apache.hadoop.mapred.join.TestDatamerge.testSimpleOverride(TestDatamerge.java:258)
FAILED: org.apache.hadoop.mapred.join.TestDatamerge.testSimpleInnerJoin
Error Message:
org/apache/hadoop/yarn/exceptions/YarnRuntimeException
Stack Trace:
java.lang.NoClassDefFoundError: org/apache/hadoop/yarn/exceptions/YarnRuntimeException
at java.net.URLClassLoader$1.run(URLClassLoader.java:366)
at java.net.URLClassLoader$1.run(URLClassLoader.java:355)
at java.security.AccessController.doPrivileged(Native Method)
at java.net.URLClassLoader.findClass(URLClassLoader.java:354)
at java.lang.ClassLoader.loadClass(ClassLoader.java:425)
at sun.misc.Launcher$AppClassLoader.loadClass(Launcher.java:308)
at java.lang.ClassLoader.loadClass(ClassLoader.java:358)
at org.apache.hadoop.mapred.LocalDistributedCacheManager.setup(LocalDistributedCacheManager.java:93)
at org.apache.hadoop.mapred.LocalJobRunner$Job.<init>(LocalJobRunner.java:164)
at org.apache.hadoop.mapred.LocalJobRunner.submitJob(LocalJobRunner.java:759)
at org.apache.hadoop.mapreduce.JobSubmitter.submitJobInternal(JobSubmitter.java:241)
at org.apache.hadoop.mapreduce.Job$10.run(Job.java:1290)
at org.apache.hadoop.mapreduce.Job$10.run(Job.java:1287)
at java.security.AccessController.doPrivileged(Native Method)
at javax.security.auth.Subject.doAs(Subject.java:415)
at org.apache.hadoop.security.UserGroupInformation.doAs(UserGroupInformation.java:1666)
at org.apache.hadoop.mapreduce.Job.submit(Job.java:1287)
at org.apache.hadoop.mapred.JobClient$1.run(JobClient.java:575)
at org.apache.hadoop.mapred.JobClient$1.run(JobClient.java:570)
at java.security.AccessController.doPrivileged(Native Method)
at javax.security.auth.Subject.doAs(Subject.java:415)
at org.apache.hadoop.security.UserGroupInformation.doAs(UserGroupInformation.java:1666)
at org.apache.hadoop.mapred.JobClient.submitJobInternal(JobClient.java:570)
at org.apache.hadoop.mapred.JobClient.submitJob(JobClient.java:561)
at org.apache.hadoop.mapred.JobClient.runJob(JobClient.java:864)
at org.apache.hadoop.mapred.join.TestDatamerge.joinAs(TestDatamerge.java:245)
at org.apache.hadoop.mapred.join.TestDatamerge.testSimpleInnerJoin(TestDatamerge.java:250)
Failed: YARN-3585 PreCommit Build #8115
Posted by Apache Jenkins Server <je...@builds.apache.org>.
Jira: https://issues.apache.org/jira/browse/YARN-3585
Build: https://builds.apache.org/job/PreCommit-YARN-Build/8115/
###################################################################################
########################## LAST 60 LINES OF THE CONSOLE ###########################
[...truncated 289 lines...]
| | | | whitespace.
| +1 | install | 2m 9s | mvn install still works.
| +1 | eclipse:eclipse | 1m 2s | The patch built with
| | | | eclipse:eclipse.
| -1 | findbugs | 1m 35s | The patch appears to introduce 1
| | | | new Findbugs (version 3.0.0)
| | | | warnings.
| -1 | yarn tests | 6m 40s | Tests failed in
| | | | hadoop-yarn-server-nodemanager.
| | | 49m 27s |
Reason | Tests
FindBugs | module:hadoop-yarn-server-nodemanager
Failed unit tests | hadoop.yarn.server.nodemanager.TestNodeStatusUpdaterForLabels
|| Subsystem || Report/Notes ||
============================================================================
| Patch URL | http://issues.apache.org/jira/secure/attachment/12735922/YARN-3585.patch |
| Optional Tests | javadoc javac unit findbugs checkstyle |
| git revision | trunk / 5df1fad |
| Findbugs warnings | /home/jenkins/jenkins-slave/workspace/PreCommit-YARN-Build/patchprocess/newPatchFindbugsWarningshadoop-yarn-server-nodemanager.html |
| hadoop-yarn-server-nodemanager test log | /home/jenkins/jenkins-slave/workspace/PreCommit-YARN-Build/patchprocess/testrun_hadoop-yarn-server-nodemanager.txt |
| Test Results | https://builds.apache.org/job/PreCommit-YARN-Build/8115/testReport/ |
| Java | 1.7.0_55 |
| uname | Linux asf904.gq1.ygridcore.net 3.13.0-36-lowlatency #63-Ubuntu SMP PREEMPT Wed Sep 3 21:56:12 UTC 2014 x86_64 x86_64 x86_64 GNU/Linux |
============================================================================
============================================================================
Adding comment to JIRA
============================================================================
============================================================================
Comment added.
4871e02f5f7b6090d504af94ded56c1bff00470d logged out
============================================================================
============================================================================
Finished build.
============================================================================
============================================================================
Build step 'Execute shell' marked build as failure
Archiving artifacts
Sending artifact delta relative to PreCommit-YARN-Build #8110
Archived 27 artifacts
Archive block size is 32768
Received 55 blocks and 7887896 bytes
Compression is 18.6%
Took 3.4 sec
[description-setter] Could not determine description.
Recording test results
Email was triggered for: Failure
Sending email for trigger: Failure
###################################################################################
############################## FAILED TESTS (if any) ##############################
1 tests failed.
REGRESSION: org.apache.hadoop.yarn.server.nodemanager.TestNodeStatusUpdaterForLabels.testNodeStatusUpdaterForNodeLabels
Error Message:
null
Stack Trace:
java.lang.NullPointerException: null
at java.util.HashSet.<init>(HashSet.java:116)
at org.apache.hadoop.yarn.nodelabels.NodeLabelTestBase.assertNLCollectionEquals(NodeLabelTestBase.java:103)
at org.apache.hadoop.yarn.server.nodemanager.TestNodeStatusUpdaterForLabels.testNodeStatusUpdaterForNodeLabels(TestNodeStatusUpdaterForLabels.java:261)
Failed: YARN-3518 PreCommit Build #8114
Posted by Apache Jenkins Server <je...@builds.apache.org>.
Jira: https://issues.apache.org/jira/browse/YARN-3518
Build: https://builds.apache.org/job/PreCommit-YARN-Build/8114/
###################################################################################
########################## LAST 60 LINES OF THE CONSOLE ###########################
[...truncated 303 lines...]
| +1 | install | 2m 2s | mvn install still works.
| +1 | eclipse:eclipse | 0m 40s | The patch built with
| | | | eclipse:eclipse.
| +1 | findbugs | 5m 34s | The patch does not introduce any
| | | | new Findbugs (version 3.0.0)
| | | | warnings.
| +1 | yarn tests | 0m 27s | Tests passed in hadoop-yarn-api.
| +1 | yarn tests | 7m 14s | Tests passed in hadoop-yarn-client.
| +1 | yarn tests | 2m 18s | Tests passed in hadoop-yarn-common.
| +1 | yarn tests | 6m 37s | Tests passed in
| | | | hadoop-yarn-server-nodemanager.
| | | 68m 54s |
|| Subsystem || Report/Notes ||
============================================================================
| Patch URL | http://issues.apache.org/jira/secure/attachment/12735899/YARN-3518.004.patch |
| Optional Tests | javadoc javac unit findbugs checkstyle |
| git revision | trunk / f1cea9c |
| checkstyle | /home/jenkins/jenkins-slave/workspace/PreCommit-YARN-Build/patchprocess/diffcheckstylehadoop-yarn-api.txt |
| hadoop-yarn-api test log | /home/jenkins/jenkins-slave/workspace/PreCommit-YARN-Build/patchprocess/testrun_hadoop-yarn-api.txt |
| hadoop-yarn-client test log | /home/jenkins/jenkins-slave/workspace/PreCommit-YARN-Build/patchprocess/testrun_hadoop-yarn-client.txt |
| hadoop-yarn-common test log | /home/jenkins/jenkins-slave/workspace/PreCommit-YARN-Build/patchprocess/testrun_hadoop-yarn-common.txt |
| hadoop-yarn-server-nodemanager test log | /home/jenkins/jenkins-slave/workspace/PreCommit-YARN-Build/patchprocess/testrun_hadoop-yarn-server-nodemanager.txt |
| Test Results | https://builds.apache.org/job/PreCommit-YARN-Build/8114/testReport/ |
| Java | 1.7.0_55 |
| uname | Linux asf904.gq1.ygridcore.net 3.13.0-36-lowlatency #63-Ubuntu SMP PREEMPT Wed Sep 3 21:56:12 UTC 2014 x86_64 x86_64 x86_64 GNU/Linux |
============================================================================
============================================================================
Adding comment to JIRA
============================================================================
============================================================================
Comment added.
2c98860bfaa90e36a15efae671dc472a7a8b30bc logged out
============================================================================
============================================================================
Finished build.
============================================================================
============================================================================
Build step 'Execute shell' marked build as failure
Archiving artifacts
Sending artifact delta relative to PreCommit-YARN-Build #8110
Archived 52 artifacts
Archive block size is 32768
Received 73 blocks and 27702693 bytes
Compression is 7.9%
Took 8.1 sec
[description-setter] Could not determine description.
Recording test results
Email was triggered for: Failure
Sending email for trigger: Failure
###################################################################################
############################## FAILED TESTS (if any) ##############################
All tests passed
Failed: YARN-3732 PreCommit Build #8113
Posted by Apache Jenkins Server <je...@builds.apache.org>.
Jira: https://issues.apache.org/jira/browse/YARN-3732
Build: https://builds.apache.org/job/PreCommit-YARN-Build/8113/
###################################################################################
########################## LAST 60 LINES OF THE CONSOLE ###########################
[...truncated 268 lines...]
| +1 | release audit | 0m 22s | The applied patch does not increase
| | | | the total number of release audit
| | | | warnings.
| +1 | checkstyle | 0m 30s | There were no new checkstyle
| | | | issues.
| +1 | whitespace | 0m 2s | The patch has no lines that end in
| | | | whitespace.
| +1 | install | 1m 37s | mvn install still works.
| +1 | eclipse:eclipse | 0m 34s | The patch built with
| | | | eclipse:eclipse.
| +1 | findbugs | 0m 52s | The patch does not introduce any
| | | | new Findbugs (version 3.0.0)
| | | | warnings.
| +1 | yarn tests | 0m 25s | Tests passed in
| | | | hadoop-yarn-server-common.
| | | 37m 11s |
|| Subsystem || Report/Notes ||
============================================================================
| Patch URL | http://issues.apache.org/jira/secure/attachment/12735852/YARN-3732-1.patch |
| Optional Tests | javadoc javac unit findbugs checkstyle |
| git revision | trunk / 7e509f5 |
| hadoop-yarn-server-common test log | /home/jenkins/jenkins-slave/workspace/PreCommit-YARN-Build/patchprocess/testrun_hadoop-yarn-server-common.txt |
| Test Results | https://builds.apache.org/job/PreCommit-YARN-Build/8113/testReport/ |
| Java | 1.7.0_55 |
| uname | Linux asf903.gq1.ygridcore.net 3.13.0-36-lowlatency #63-Ubuntu SMP PREEMPT Wed Sep 3 21:56:12 UTC 2014 x86_64 x86_64 x86_64 GNU/Linux |
============================================================================
============================================================================
Adding comment to JIRA
============================================================================
============================================================================
Comment added.
b0b7510823b98e60de701c369e464540f0714a39 logged out
============================================================================
============================================================================
Finished build.
============================================================================
============================================================================
Build step 'Execute shell' marked build as failure
Archiving artifacts
Sending artifact delta relative to PreCommit-YARN-Build #8110
Archived 24 artifacts
Archive block size is 32768
Received 56 blocks and 10545662 bytes
Compression is 14.8%
Took 4.4 sec
[description-setter] Could not determine description.
Recording test results
Email was triggered for: Failure
Sending email for trigger: Failure
###################################################################################
############################## FAILED TESTS (if any) ##############################
All tests passed