You are viewing a plain text version of this content. The canonical link for it is here.
Posted to issues@tez.apache.org by Apache Jenkins Server <je...@builds.apache.org> on 2015/03/25 15:03:43 UTC
Failed: TEZ-714 PreCommit Build #345
Jira: https://issues.apache.org/jira/browse/TEZ-714
Build: https://builds.apache.org/job/PreCommit-TEZ-Build/345/
###################################################################################
########################## LAST 60 LINES OF THE CONSOLE ###########################
[...truncated 2532 lines...]
{color:red}-1 overall{color}. Here are the results of testing the latest attachment
http://issues.apache.org/jira/secure/attachment/12707199/TEZ-714-3.patch
against master revision 60ddcba.
{color:green}+1 @author{color}. The patch does not contain any @author tags.
{color:green}+1 tests included{color}. The patch appears to include 2 new or modified test files.
{color:green}+1 javac{color}. The applied patch does not increase the total number of javac compiler warnings.
{color:green}+1 javadoc{color}. There were no new javadoc warning messages.
{color:green}+1 findbugs{color}. The patch does not introduce any new Findbugs (version 2.0.3) warnings.
{color:green}+1 release audit{color}. The applied patch does not increase the total number of release audit warnings.
{color:red}-1 core tests{color}. The patch failed these unit tests in :
org.apache.tez.test.TestTezJobs
org.apache.tez.mapreduce.TestMRRJobsDAGApi
Test results: https://builds.apache.org/job/PreCommit-TEZ-Build/345//testReport/
Console output: https://builds.apache.org/job/PreCommit-TEZ-Build/345//console
This message is automatically generated.
======================================================================
======================================================================
Adding comment to Jira.
======================================================================
======================================================================
Comment added.
ebe71b2173110526859381e9bdcee0ec01d52f37 logged out
======================================================================
======================================================================
Finished build.
======================================================================
======================================================================
Build step 'Execute shell' marked build as failure
Archiving artifacts
Sending artifact delta relative to PreCommit-TEZ-Build #343
Archived 44 artifacts
Archive block size is 32768
Received 4 blocks and 2585916 bytes
Compression is 4.8%
Took 9.6 sec
[description-setter] Could not determine description.
Recording test results
Email was triggered for: Failure
Sending email for trigger: Failure
###################################################################################
############################## FAILED TESTS (if any) ##############################
2 tests failed.
REGRESSION: org.apache.tez.mapreduce.TestMRRJobsDAGApi.testVertexGroups
Error Message:
Unsupported value for DAGStatus.State : DAG_COMMITTING
Stack Trace:
org.apache.tez.dag.api.TezUncheckedException: Unsupported value for DAGStatus.State : DAG_COMMITTING
at org.apache.tez.dag.api.client.DAGStatus.getState(DAGStatus.java:83)
at org.apache.tez.dag.api.client.DAGStatus.isCompleted(DAGStatus.java:89)
at org.apache.tez.dag.api.client.DAGClientImpl._waitForCompletionWithStatusUpdates(DAGClientImpl.java:436)
at org.apache.tez.dag.api.client.DAGClientImpl.waitForCompletionWithStatusUpdates(DAGClientImpl.java:298)
at org.apache.tez.mapreduce.examples.UnionExample.run(UnionExample.java:280)
at org.apache.tez.mapreduce.TestMRRJobsDAGApi.testVertexGroups(TestMRRJobsDAGApi.java:850)
REGRESSION: org.apache.tez.test.TestTezJobs.testHashJoinExamplePipeline
Error Message:
Unsupported value for DAGStatus.State : DAG_COMMITTING
Stack Trace:
org.apache.tez.dag.api.TezUncheckedException: Unsupported value for DAGStatus.State : DAG_COMMITTING
at org.apache.tez.dag.api.client.DAGStatus.getState(DAGStatus.java:83)
at org.apache.tez.dag.api.client.DAGStatus.isCompleted(DAGStatus.java:89)
at org.apache.tez.dag.api.client.DAGClientImpl._waitForCompletionWithStatusUpdates(DAGClientImpl.java:436)
at org.apache.tez.dag.api.client.DAGClientImpl.waitForCompletionWithStatusUpdates(DAGClientImpl.java:298)
at org.apache.tez.examples.TezExampleBase.runDag(TezExampleBase.java:134)
at org.apache.tez.examples.HashJoinExample.runJob(HashJoinExample.java:130)
at org.apache.tez.examples.TezExampleBase._execute(TezExampleBase.java:179)
at org.apache.tez.examples.TezExampleBase.run(TezExampleBase.java:112)
at org.apache.tez.test.TestTezJobs.testHashJoinExamplePipeline(TestTezJobs.java:404)
Success: TEZ-2196 PreCommit Build #349
Posted by Apache Jenkins Server <je...@builds.apache.org>.
Jira: https://issues.apache.org/jira/browse/TEZ-2196
Build: https://builds.apache.org/job/PreCommit-TEZ-Build/349/
###################################################################################
########################## LAST 60 LINES OF THE CONSOLE ###########################
[...truncated 2762 lines...]
[INFO] Final Memory: 73M/970M
[INFO] ------------------------------------------------------------------------
{color:green}+1 overall{color}. Here are the results of testing the latest attachment
http://issues.apache.org/jira/secure/attachment/12707434/TEZ-2196.4.patch
against master revision 2fe2d63.
{color:green}+1 @author{color}. The patch does not contain any @author tags.
{color:green}+1 tests included{color}. The patch appears to include 3 new or modified test files.
{color:green}+1 javac{color}. The applied patch does not increase the total number of javac compiler warnings.
{color:green}+1 javadoc{color}. There were no new javadoc warning messages.
{color:green}+1 findbugs{color}. The patch does not introduce any new Findbugs (version 2.0.3) warnings.
{color:green}+1 release audit{color}. The applied patch does not increase the total number of release audit warnings.
{color:green}+1 core tests{color}. The patch passed unit tests in .
Test results: https://builds.apache.org/job/PreCommit-TEZ-Build/349//testReport/
Console output: https://builds.apache.org/job/PreCommit-TEZ-Build/349//console
This message is automatically generated.
======================================================================
======================================================================
Adding comment to Jira.
======================================================================
======================================================================
Comment added.
3a56c319caec4fc6845e2093c40600ce5df14ef3 logged out
======================================================================
======================================================================
Finished build.
======================================================================
======================================================================
Archiving artifacts
Sending artifact delta relative to PreCommit-TEZ-Build #343
Archived 44 artifacts
Archive block size is 32768
Received 2 blocks and 2656212 bytes
Compression is 2.4%
Took 2 sec
Description set: TEZ-2196
Recording test results
Email was triggered for: Success
Sending email for trigger: Success
###################################################################################
############################## FAILED TESTS (if any) ##############################
All tests passed
Failed: TEZ-2217 PreCommit Build #348
Posted by Apache Jenkins Server <je...@builds.apache.org>.
Jira: https://issues.apache.org/jira/browse/TEZ-2217
Build: https://builds.apache.org/job/PreCommit-TEZ-Build/348/
###################################################################################
########################## LAST 60 LINES OF THE CONSOLE ###########################
[...truncated 2717 lines...]
{color:red}-1 overall{color}. Here are the results of testing the latest attachment
http://issues.apache.org/jira/secure/attachment/12707314/TEZ-2217.3.patch
against master revision d1b4bd4.
{color:green}+1 @author{color}. The patch does not contain any @author tags.
{color:green}+1 tests included{color}. The patch appears to include 1 new or modified test files.
{color:green}+1 javac{color}. The applied patch does not increase the total number of javac compiler warnings.
{color:green}+1 javadoc{color}. There were no new javadoc warning messages.
{color:green}+1 findbugs{color}. The patch does not introduce any new Findbugs (version 2.0.3) warnings.
{color:green}+1 release audit{color}. The applied patch does not increase the total number of release audit warnings.
{color:red}-1 core tests{color}. The patch failed these unit tests in :
org.apache.tez.dag.app.rm.TestContainerReuse
Test results: https://builds.apache.org/job/PreCommit-TEZ-Build/348//testReport/
Console output: https://builds.apache.org/job/PreCommit-TEZ-Build/348//console
This message is automatically generated.
======================================================================
======================================================================
Adding comment to Jira.
======================================================================
======================================================================
Comment added.
512fae301497059df6a11d72ea59315461b071e1 logged out
======================================================================
======================================================================
Finished build.
======================================================================
======================================================================
Build step 'Execute shell' marked build as failure
Archiving artifacts
Sending artifact delta relative to PreCommit-TEZ-Build #343
Archived 44 artifacts
Archive block size is 32768
Received 2 blocks and 2653407 bytes
Compression is 2.4%
Took 1 sec
[description-setter] Could not determine description.
Recording test results
Email was triggered for: Failure
Sending email for trigger: Failure
###################################################################################
############################## FAILED TESTS (if any) ##############################
2 tests failed.
REGRESSION: org.apache.tez.dag.app.rm.TestContainerReuse.testSimpleReuse
Error Message:
Wanted but not invoked:
aMRMClientAsyncForTest.releaseAssignedContainer(
container_1_0001_01_000002
);
-> at org.apache.tez.dag.app.rm.TestContainerReuse.testSimpleReuse(TestContainerReuse.java:488)
However, there were other interactions with this mock:
aMRMClientAsyncForTest.init(
Configuration: core-default.xml, core-site.xml, yarn-default.xml, yarn-site.xml
);
-> at org.apache.tez.dag.app.rm.TestContainerReuse.testSimpleReuse(TestContainerReuse.java:396)
aMRMClientAsyncForTest.setConfig(
Configuration: core-default.xml, core-site.xml, yarn-default.xml, yarn-site.xml
);
-> at org.apache.tez.dag.app.rm.TestContainerReuse.testSimpleReuse(TestContainerReuse.java:396)
aMRMClientAsyncForTest.serviceInit(
Configuration: core-default.xml, core-site.xml, yarn-default.xml, yarn-site.xml
);
-> at org.apache.tez.dag.app.rm.TestContainerReuse.testSimpleReuse(TestContainerReuse.java:396)
aMRMClientAsyncForTest.setHeartbeatInterval(
1000
);
-> at org.apache.tez.dag.app.rm.TestContainerReuse.testSimpleReuse(TestContainerReuse.java:396)
aMRMClientAsyncForTest.start();
-> at org.apache.tez.dag.app.rm.TestContainerReuse.testSimpleReuse(TestContainerReuse.java:396)
aMRMClientAsyncForTest.serviceStart();
-> at org.apache.tez.dag.app.rm.TestContainerReuse.testSimpleReuse(TestContainerReuse.java:396)
aMRMClientAsyncForTest.registerApplicationMaster(
"host",
0,
""
);
-> at org.apache.tez.dag.app.rm.TestContainerReuse.testSimpleReuse(TestContainerReuse.java:396)
aMRMClientAsyncForTest.addContainerRequest(
Capability[<memory:1024, vCores:1>]Priority[1]
);
-> at org.apache.tez.dag.app.rm.TestContainerReuse.testSimpleReuse(TestContainerReuse.java:433)
aMRMClientAsyncForTest.addContainerRequest(
Capability[<memory:1024, vCores:1>]Priority[1]
);
-> at org.apache.tez.dag.app.rm.TestContainerReuse.testSimpleReuse(TestContainerReuse.java:434)
aMRMClientAsyncForTest.addContainerRequest(
Capability[<memory:1024, vCores:1>]Priority[1]
);
-> at org.apache.tez.dag.app.rm.TestContainerReuse.testSimpleReuse(TestContainerReuse.java:435)
aMRMClientAsyncForTest.addContainerRequest(
Capability[<memory:1024, vCores:1>]Priority[1]
);
-> at org.apache.tez.dag.app.rm.TestContainerReuse.testSimpleReuse(TestContainerReuse.java:436)
aMRMClientAsyncForTest.getTopPriority();
-> at org.apache.tez.dag.app.rm.YarnTaskSchedulerService.assignReUsedContainerWithLocation(YarnTaskSchedulerService.java:1577)
aMRMClientAsyncForTest.getMatchingRequestsForTopPriority(
"host1",
<memory:1024, vCores:1>
);
-> at org.apache.tez.dag.app.rm.YarnTaskSchedulerService.getMatchingRequestWithoutPriority(YarnTaskSchedulerService.java:1325)
aMRMClientAsyncForTest.getMatchingRequests(
1,
"host1",
<memory:1024, vCores:1>
);
-> at org.apache.tez.dag.app.rm.YarnTaskSchedulerService.getMatchingRequestWithoutPriority(YarnTaskSchedulerService.java:1325)
aMRMClientAsyncForTest.getTopPriority();
-> at org.apache.tez.dag.app.rm.YarnTaskSchedulerService.getMatchingRequestWithoutPriority(YarnTaskSchedulerService.java:1327)
aMRMClientAsyncForTest.removeContainerRequest(
Capability[<memory:1024, vCores:1>]Priority[1]
);
-> at org.apache.tez.dag.app.rm.YarnTaskSchedulerService.removeTaskRequest(YarnTaskSchedulerService.java:1492)
aMRMClientAsyncForTest.getTopPriority();
-> at org.apache.tez.dag.app.rm.TestContainerReuse.testSimpleReuse(TestContainerReuse.java:448)
aMRMClientAsyncForTest.getMatchingRequestsForTopPriority(
"host1",
<memory:1024, vCores:1>
);
-> at org.apache.tez.dag.app.rm.TestContainerReuse.testSimpleReuse(TestContainerReuse.java:448)
aMRMClientAsyncForTest.getMatchingRequests(
1,
"host1",
<memory:1024, vCores:1>
);
-> at org.apache.tez.dag.app.rm.TestContainerReuse.testSimpleReuse(TestContainerReuse.java:448)
aMRMClientAsyncForTest.getTopPriority();
-> at org.apache.tez.dag.app.rm.TestContainerReuse.testSimpleReuse(TestContainerReuse.java:448)
aMRMClientAsyncForTest.removeContainerRequest(
Capability[<memory:1024, vCores:1>]Priority[1]
);
-> at org.apache.tez.dag.app.rm.TestContainerReuse.testSimpleReuse(TestContainerReuse.java:448)
aMRMClientAsyncForTest.getTopPriority();
-> at org.apache.tez.dag.app.rm.TestContainerReuse.testSimpleReuse(TestContainerReuse.java:458)
aMRMClientAsyncForTest.getMatchingRequestsForTopPriority(
"host1",
<memory:1024, vCores:1>
);
-> at org.apache.tez.dag.app.rm.TestContainerReuse.testSimpleReuse(TestContainerReuse.java:458)
aMRMClientAsyncForTest.getMatchingRequests(
1,
"host1",
<memory:1024, vCores:1>
);
-> at org.apache.tez.dag.app.rm.TestContainerReuse.testSimpleReuse(TestContainerReuse.java:458)
aMRMClientAsyncForTest.getTopPriority();
-> at org.apache.tez.dag.app.rm.TestContainerReuse.testSimpleReuse(TestContainerReuse.java:458)
aMRMClientAsyncForTest.getTopPriority();
-> at org.apache.tez.dag.app.rm.TestContainerReuse.testSimpleReuse(TestContainerReuse.java:458)
aMRMClientAsyncForTest.getMatchingRequestsForTopPriority(
"/default-rack",
<memory:1024, vCores:1>
);
-> at org.apache.tez.dag.app.rm.TestContainerReuse.testSimpleReuse(TestContainerReuse.java:458)
aMRMClientAsyncForTest.getMatchingRequests(
1,
"/default-rack",
<memory:1024, vCores:1>
);
-> at org.apache.tez.dag.app.rm.TestContainerReuse.testSimpleReuse(TestContainerReuse.java:458)
aMRMClientAsyncForTest.removeContainerRequest(
Capability[<memory:1024, vCores:1>]Priority[1]
);
-> at org.apache.tez.dag.app.rm.TestContainerReuse.testSimpleReuse(TestContainerReuse.java:458)
aMRMClientAsyncForTest.releaseAssignedContainer(
container_1_0001_01_000001
);
-> at org.apache.tez.dag.app.rm.TestContainerReuse.testSimpleReuse(TestContainerReuse.java:467)
aMRMClientAsyncForTest.getTopPriority();
-> at org.apache.tez.dag.app.rm.YarnTaskSchedulerService.assignReUsedContainerWithLocation(YarnTaskSchedulerService.java:1577)
aMRMClientAsyncForTest.getMatchingRequestsForTopPriority(
"host2",
<memory:1024, vCores:1>
);
-> at org.apache.tez.dag.app.rm.YarnTaskSchedulerService.getMatchingRequestWithoutPriority(YarnTaskSchedulerService.java:1325)
aMRMClientAsyncForTest.getMatchingRequests(
1,
"host2",
<memory:1024, vCores:1>
);
-> at org.apache.tez.dag.app.rm.YarnTaskSchedulerService.getMatchingRequestWithoutPriority(YarnTaskSchedulerService.java:1325)
aMRMClientAsyncForTest.getTopPriority();
-> at org.apache.tez.dag.app.rm.YarnTaskSchedulerService.getMatchingRequestWithoutPriority(YarnTaskSchedulerService.java:1327)
aMRMClientAsyncForTest.removeContainerRequest(
Capability[<memory:1024, vCores:1>]Priority[1]
);
-> at org.apache.tez.dag.app.rm.YarnTaskSchedulerService.removeTaskRequest(YarnTaskSchedulerService.java:1492)
Stack Trace:
org.mockito.exceptions.verification.WantedButNotInvoked:
Wanted but not invoked:
aMRMClientAsyncForTest.releaseAssignedContainer(
container_1_0001_01_000002
);
-> at org.apache.tez.dag.app.rm.TestContainerReuse.testSimpleReuse(TestContainerReuse.java:488)
However, there were other interactions with this mock:
aMRMClientAsyncForTest.init(
Configuration: core-default.xml, core-site.xml, yarn-default.xml, yarn-site.xml
);
-> at org.apache.tez.dag.app.rm.TestContainerReuse.testSimpleReuse(TestContainerReuse.java:396)
aMRMClientAsyncForTest.setConfig(
Configuration: core-default.xml, core-site.xml, yarn-default.xml, yarn-site.xml
);
-> at org.apache.tez.dag.app.rm.TestContainerReuse.testSimpleReuse(TestContainerReuse.java:396)
aMRMClientAsyncForTest.serviceInit(
Configuration: core-default.xml, core-site.xml, yarn-default.xml, yarn-site.xml
);
-> at org.apache.tez.dag.app.rm.TestContainerReuse.testSimpleReuse(TestContainerReuse.java:396)
aMRMClientAsyncForTest.setHeartbeatInterval(
1000
);
-> at org.apache.tez.dag.app.rm.TestContainerReuse.testSimpleReuse(TestContainerReuse.java:396)
aMRMClientAsyncForTest.start();
-> at org.apache.tez.dag.app.rm.TestContainerReuse.testSimpleReuse(TestContainerReuse.java:396)
aMRMClientAsyncForTest.serviceStart();
-> at org.apache.tez.dag.app.rm.TestContainerReuse.testSimpleReuse(TestContainerReuse.java:396)
aMRMClientAsyncForTest.registerApplicationMaster(
"host",
0,
""
);
-> at org.apache.tez.dag.app.rm.TestContainerReuse.testSimpleReuse(TestContainerReuse.java:396)
aMRMClientAsyncForTest.addContainerRequest(
Capability[<memory:1024, vCores:1>]Priority[1]
);
-> at org.apache.tez.dag.app.rm.TestContainerReuse.testSimpleReuse(TestContainerReuse.java:433)
aMRMClientAsyncForTest.addContainerRequest(
Capability[<memory:1024, vCores:1>]Priority[1]
);
-> at org.apache.tez.dag.app.rm.TestContainerReuse.testSimpleReuse(TestContainerReuse.java:434)
aMRMClientAsyncForTest.addContainerRequest(
Capability[<memory:1024, vCores:1>]Priority[1]
);
-> at org.apache.tez.dag.app.rm.TestContainerReuse.testSimpleReuse(TestContainerReuse.java:435)
aMRMClientAsyncForTest.addContainerRequest(
Capability[<memory:1024, vCores:1>]Priority[1]
);
-> at org.apache.tez.dag.app.rm.TestContainerReuse.testSimpleReuse(TestContainerReuse.java:436)
aMRMClientAsyncForTest.getTopPriority();
-> at org.apache.tez.dag.app.rm.YarnTaskSchedulerService.assignReUsedContainerWithLocation(YarnTaskSchedulerService.java:1577)
aMRMClientAsyncForTest.getMatchingRequestsForTopPriority(
"host1",
<memory:1024, vCores:1>
);
-> at org.apache.tez.dag.app.rm.YarnTaskSchedulerService.getMatchingRequestWithoutPriority(YarnTaskSchedulerService.java:1325)
aMRMClientAsyncForTest.getMatchingRequests(
1,
"host1",
<memory:1024, vCores:1>
);
-> at org.apache.tez.dag.app.rm.YarnTaskSchedulerService.getMatchingRequestWithoutPriority(YarnTaskSchedulerService.java:1325)
aMRMClientAsyncForTest.getTopPriority();
-> at org.apache.tez.dag.app.rm.YarnTaskSchedulerService.getMatchingRequestWithoutPriority(YarnTaskSchedulerService.java:1327)
aMRMClientAsyncForTest.removeContainerRequest(
Capability[<memory:1024, vCores:1>]Priority[1]
);
-> at org.apache.tez.dag.app.rm.YarnTaskSchedulerService.removeTaskRequest(YarnTaskSchedulerService.java:1492)
aMRMClientAsyncForTest.getTopPriority();
-> at org.apache.tez.dag.app.rm.TestContainerReuse.testSimpleReuse(TestContainerReuse.java:448)
aMRMClientAsyncForTest.getMatchingRequestsForTopPriority(
"host1",
<memory:1024, vCores:1>
);
-> at org.apache.tez.dag.app.rm.TestContainerReuse.testSimpleReuse(TestContainerReuse.java:448)
aMRMClientAsyncForTest.getMatchingRequests(
1,
"host1",
<memory:1024, vCores:1>
);
-> at org.apache.tez.dag.app.rm.TestContainerReuse.testSimpleReuse(TestContainerReuse.java:448)
aMRMClientAsyncForTest.getTopPriority();
-> at org.apache.tez.dag.app.rm.TestContainerReuse.testSimpleReuse(TestContainerReuse.java:448)
aMRMClientAsyncForTest.removeContainerRequest(
Capability[<memory:1024, vCores:1>]Priority[1]
);
-> at org.apache.tez.dag.app.rm.TestContainerReuse.testSimpleReuse(TestContainerReuse.java:448)
aMRMClientAsyncForTest.getTopPriority();
-> at org.apache.tez.dag.app.rm.TestContainerReuse.testSimpleReuse(TestContainerReuse.java:458)
aMRMClientAsyncForTest.getMatchingRequestsForTopPriority(
"host1",
<memory:1024, vCores:1>
);
-> at org.apache.tez.dag.app.rm.TestContainerReuse.testSimpleReuse(TestContainerReuse.java:458)
aMRMClientAsyncForTest.getMatchingRequests(
1,
"host1",
<memory:1024, vCores:1>
);
-> at org.apache.tez.dag.app.rm.TestContainerReuse.testSimpleReuse(TestContainerReuse.java:458)
aMRMClientAsyncForTest.getTopPriority();
-> at org.apache.tez.dag.app.rm.TestContainerReuse.testSimpleReuse(TestContainerReuse.java:458)
aMRMClientAsyncForTest.getTopPriority();
-> at org.apache.tez.dag.app.rm.TestContainerReuse.testSimpleReuse(TestContainerReuse.java:458)
aMRMClientAsyncForTest.getMatchingRequestsForTopPriority(
"/default-rack",
<memory:1024, vCores:1>
);
-> at org.apache.tez.dag.app.rm.TestContainerReuse.testSimpleReuse(TestContainerReuse.java:458)
aMRMClientAsyncForTest.getMatchingRequests(
1,
"/default-rack",
<memory:1024, vCores:1>
);
-> at org.apache.tez.dag.app.rm.TestContainerReuse.testSimpleReuse(TestContainerReuse.java:458)
aMRMClientAsyncForTest.removeContainerRequest(
Capability[<memory:1024, vCores:1>]Priority[1]
);
-> at org.apache.tez.dag.app.rm.TestContainerReuse.testSimpleReuse(TestContainerReuse.java:458)
aMRMClientAsyncForTest.releaseAssignedContainer(
container_1_0001_01_000001
);
-> at org.apache.tez.dag.app.rm.TestContainerReuse.testSimpleReuse(TestContainerReuse.java:467)
aMRMClientAsyncForTest.getTopPriority();
-> at org.apache.tez.dag.app.rm.YarnTaskSchedulerService.assignReUsedContainerWithLocation(YarnTaskSchedulerService.java:1577)
aMRMClientAsyncForTest.getMatchingRequestsForTopPriority(
"host2",
<memory:1024, vCores:1>
);
-> at org.apache.tez.dag.app.rm.YarnTaskSchedulerService.getMatchingRequestWithoutPriority(YarnTaskSchedulerService.java:1325)
aMRMClientAsyncForTest.getMatchingRequests(
1,
"host2",
<memory:1024, vCores:1>
);
-> at org.apache.tez.dag.app.rm.YarnTaskSchedulerService.getMatchingRequestWithoutPriority(YarnTaskSchedulerService.java:1325)
aMRMClientAsyncForTest.getTopPriority();
-> at org.apache.tez.dag.app.rm.YarnTaskSchedulerService.getMatchingRequestWithoutPriority(YarnTaskSchedulerService.java:1327)
aMRMClientAsyncForTest.removeContainerRequest(
Capability[<memory:1024, vCores:1>]Priority[1]
);
-> at org.apache.tez.dag.app.rm.YarnTaskSchedulerService.removeTaskRequest(YarnTaskSchedulerService.java:1492)
at org.apache.tez.dag.app.rm.TestContainerReuse.testSimpleReuse(TestContainerReuse.java:488)
REGRESSION: org.apache.tez.dag.app.rm.TestContainerReuse.testDelayedReuseContainerBecomesAvailable
Error Message:
containerHost2 was not released
Stack Trace:
java.lang.AssertionError: containerHost2 was not released
at org.junit.Assert.fail(Assert.java:88)
at org.junit.Assert.assertTrue(Assert.java:41)
at org.apache.tez.dag.app.rm.TestContainerReuse.testDelayedReuseContainerBecomesAvailable(TestContainerReuse.java:246)
Failed: TEZ-2205 PreCommit Build #347
Posted by Apache Jenkins Server <je...@builds.apache.org>.
Jira: https://issues.apache.org/jira/browse/TEZ-2205
Build: https://builds.apache.org/job/PreCommit-TEZ-Build/347/
###################################################################################
########################## LAST 60 LINES OF THE CONSOLE ###########################
[...truncated 2752 lines...]
{color:red}-1 overall{color}. Here are the results of testing the latest attachment
http://issues.apache.org/jira/secure/attachment/12707237/TEZ-2205.1.patch
against master revision d1b4bd4.
{color:green}+1 @author{color}. The patch does not contain any @author tags.
{color:red}-1 tests included{color}. The patch doesn't appear to include any new or modified tests.
Please justify why no new tests are needed for this patch.
Also please list what manual steps were performed to verify this patch.
{color:green}+1 javac{color}. The applied patch does not increase the total number of javac compiler warnings.
{color:green}+1 javadoc{color}. There were no new javadoc warning messages.
{color:green}+1 findbugs{color}. The patch does not introduce any new Findbugs (version 2.0.3) warnings.
{color:green}+1 release audit{color}. The applied patch does not increase the total number of release audit warnings.
{color:green}+1 core tests{color}. The patch passed unit tests in .
Test results: https://builds.apache.org/job/PreCommit-TEZ-Build/347//testReport/
Console output: https://builds.apache.org/job/PreCommit-TEZ-Build/347//console
This message is automatically generated.
======================================================================
======================================================================
Adding comment to Jira.
======================================================================
======================================================================
Comment added.
cb01236764c0e9affe953e1793bb1fec9ce79c15 logged out
======================================================================
======================================================================
Finished build.
======================================================================
======================================================================
Build step 'Execute shell' marked build as failure
Archiving artifacts
Sending artifact delta relative to PreCommit-TEZ-Build #343
Archived 44 artifacts
Archive block size is 32768
Received 4 blocks and 2597651 bytes
Compression is 4.8%
Took 1.3 sec
[description-setter] Could not determine description.
Recording test results
Email was triggered for: Failure
Sending email for trigger: Failure
###################################################################################
############################## FAILED TESTS (if any) ##############################
All tests passed
Failed: TEZ-714 PreCommit Build #346
Posted by Apache Jenkins Server <je...@builds.apache.org>.
Jira: https://issues.apache.org/jira/browse/TEZ-714
Build: https://builds.apache.org/job/PreCommit-TEZ-Build/346/
###################################################################################
########################## LAST 60 LINES OF THE CONSOLE ###########################
[...truncated 2381 lines...]
{color:red}-1 overall{color}. Here are the results of testing the latest attachment
http://issues.apache.org/jira/secure/attachment/12707217/TEZ-714-4.patch
against master revision d1b4bd4.
{color:green}+1 @author{color}. The patch does not contain any @author tags.
{color:green}+1 tests included{color}. The patch appears to include 2 new or modified test files.
{color:green}+1 javac{color}. The applied patch does not increase the total number of javac compiler warnings.
{color:green}+1 javadoc{color}. There were no new javadoc warning messages.
{color:green}+1 findbugs{color}. The patch does not introduce any new Findbugs (version 2.0.3) warnings.
{color:green}+1 release audit{color}. The applied patch does not increase the total number of release audit warnings.
{color:red}-1 core tests{color}. The patch failed these unit tests in :
org.apache.tez.dag.app.dag.impl.TestCommit
Test results: https://builds.apache.org/job/PreCommit-TEZ-Build/346//testReport/
Console output: https://builds.apache.org/job/PreCommit-TEZ-Build/346//console
This message is automatically generated.
======================================================================
======================================================================
Adding comment to Jira.
======================================================================
======================================================================
Comment added.
d097ae729e94fba50749fa203ae0f8b6d76f0a90 logged out
======================================================================
======================================================================
Finished build.
======================================================================
======================================================================
Build step 'Execute shell' marked build as failure
Archiving artifacts
Sending artifact delta relative to PreCommit-TEZ-Build #343
Archived 44 artifacts
Archive block size is 32768
Received 2 blocks and 2638094 bytes
Compression is 2.4%
Took 1 sec
[description-setter] Could not determine description.
Recording test results
Email was triggered for: Failure
Sending email for trigger: Failure
###################################################################################
############################## FAILED TESTS (if any) ##############################
1 tests failed.
REGRESSION: org.apache.tez.dag.app.dag.impl.TestCommit.testVertexGroupCommitFinishedEventFail
Error Message:
expected:<0> but was:<1>
Stack Trace:
java.lang.AssertionError: expected:<0> but was:<1>
at org.junit.Assert.fail(Assert.java:88)
at org.junit.Assert.failNotEquals(Assert.java:743)
at org.junit.Assert.assertEquals(Assert.java:118)
at org.junit.Assert.assertEquals(Assert.java:555)
at org.junit.Assert.assertEquals(Assert.java:542)
at org.apache.tez.dag.app.dag.impl.TestCommit.testVertexGroupCommitFinishedEventFail(TestCommit.java:1194)