You are viewing a plain text version of this content. The canonical link for it is here.
Posted to builds@solr.apache.org by Apache Jenkins Server <je...@builds.apache.org> on 2026/09/14 21:43:38 UTC

[JENKINS] Solr » Solr-Test-10.0 - Build # 2491 - Unstable!

Build: https://ci-builds.apache.org/job/Solr/job/Solr-Test-10.0/2491/

2 tests failed.
FAILED:  org.apache.solr.client.solrj.io.stream.StreamDecoratorTest.testParallelDaemonCommitStream

Error Message:
java.lang.Exception: Test abandoned because suite timeout was reached.

Stack Trace:
java.lang.Exception: Test abandoned because suite timeout was reached.
	at __randomizedtesting.SeedInfo.seed([CABB6CE3016848EF]:0)


FAILED:  org.apache.solr.client.solrj.io.stream.StreamDecoratorTest.classMethod

Error Message:
java.lang.Exception: Suite timeout exceeded (>= 7200000 msec).

Stack Trace:
java.lang.Exception: Suite timeout exceeded (>= 7200000 msec).
	at __randomizedtesting.SeedInfo.seed([CABB6CE3016848EF]:0)




Build Log:
[...truncated 12 lines...]
ERROR: Workspace has a .git repository, but it appears to be corrupt.
hudson.plugins.git.GitException: Command "git rev-parse --resolve-git-dir /home/jenkins/jenkins-agent/workspace/Solr/Solr-Test-10.0/.git" returned status code 128:
stdout: 
stderr: fatal: not a gitdir '/home/jenkins/jenkins-agent/workspace/Solr/Solr-Test-10.0/.git'

	at PluginClassLoader for git-client//org.jenkinsci.plugins.gitclient.CliGitAPIImpl.launchCommandIn(CliGitAPIImpl.java:2848)
	at PluginClassLoader for git-client//org.jenkinsci.plugins.gitclient.CliGitAPIImpl.launchCommandIn(CliGitAPIImpl.java:2768)
	at PluginClassLoader for git-client//org.jenkinsci.plugins.gitclient.CliGitAPIImpl.launchCommandIn(CliGitAPIImpl.java:2763)
	at PluginClassLoader for git-client//org.jenkinsci.plugins.gitclient.CliGitAPIImpl.launchCommand(CliGitAPIImpl.java:2052)
	at PluginClassLoader for git-client//org.jenkinsci.plugins.gitclient.CliGitAPIImpl.launchCommand(CliGitAPIImpl.java:2064)
	at PluginClassLoader for git-client//org.jenkinsci.plugins.gitclient.CliGitAPIImpl.hasGitRepo(CliGitAPIImpl.java:404)
	at PluginClassLoader for git-client//hudson.plugins.git.GitAPI.hasGitRepo(GitAPI.java:281)
	at jdk.internal.reflect.GeneratedMethodAccessor34.invoke(Unknown Source)
	at java.base/jdk.internal.reflect.DelegatingMethodAccessorImpl.invoke(DelegatingMethodAccessorImpl.java:43)
	at java.base/java.lang.reflect.Method.invoke(Method.java:569)
	at hudson.remoting.RemoteInvocationHandler$RPCRequest.perform(RemoteInvocationHandler.java:986)
	at hudson.remoting.RemoteInvocationHandler$RPCRequest.call(RemoteInvocationHandler.java:961)
	at hudson.remoting.RemoteInvocationHandler$RPCRequest.call(RemoteInvocationHandler.java:907)
	at hudson.remoting.UserRequest.perform(UserRequest.java:225)
	at hudson.remoting.UserRequest.perform(UserRequest.java:50)
	at hudson.remoting.Request$2.run(Request.java:391)
	at hudson.remoting.InterceptingExecutorService.lambda$wrap$0(InterceptingExecutorService.java:81)
	at java.base/java.util.concurrent.FutureTask.run(FutureTask.java:264)
	at java.base/java.util.concurrent.ThreadPoolExecutor.runWorker(ThreadPoolExecutor.java:1136)
	at java.base/java.util.concurrent.ThreadPoolExecutor$Worker.run(ThreadPoolExecutor.java:635)
	at java.base/java.lang.Thread.run(Thread.java:840)
Cloning the remote Git repository
Cloning repository https://gitbox.apache.org/repos/asf/solr.git
 > git init /home/jenkins/jenkins-agent/workspace/Solr/Solr-Test-10.0 # timeout=10
Fetching upstream changes from https://gitbox.apache.org/repos/asf/solr.git
 > git --version # timeout=10
 > git --version # 'git version 2.43.0'
 > git fetch --tags --force --progress -- https://gitbox.apache.org/repos/asf/solr.git +refs/heads/*:refs/remotes/origin/* # timeout=10
 > git config remote.origin.url https://gitbox.apache.org/repos/asf/solr.git # timeout=10
 > git config --add remote.origin.fetch +refs/heads/*:refs/remotes/origin/* # timeout=10
Avoid second fetch
 > git rev-parse refs/remotes/origin/branch_10_0^{commit} # timeout=10
Checking out Revision 93068d1dfbc48816caac29c5b3aba3bf884aea85 (refs/remotes/origin/branch_10_0)
 > git config core.sparsecheckout # timeout=10
 > git checkout -f 93068d1dfbc48816caac29c5b3aba3bf884aea85 # timeout=10
 > git branch -a -v --no-abbrev # timeout=10
 > git checkout -b branch_10_0 93068d1dfbc48816caac29c5b3aba3bf884aea85 # timeout=10
Commit message: "Ref Guide - Change component name to Apache Solr (#4521)"
 > git rev-list --no-walk 93068d1dfbc48816caac29c5b3aba3bf884aea85 # timeout=10
No emails were triggered.
provisioning config files...
copy managed file [gradle.properties] to file:/home/jenkins/jenkins-agent/workspace/Solr/Solr-Test-10.0/gradle.properties
[Gradle] - Launching build.
[Solr-Test-10.0] $ /home/jenkins/jenkins-agent/workspace/Solr/Solr-Test-10.0/gradlew -Dtests.haltonfailure=false -Dtests.badapples=false --continue test
Downloading gradle-wrapper.jar from https://raw.githubusercontent.com/gradle/gradle/v8.10.2/gradle/wrapper/gradle-wrapper.jar
To honour the JVM settings for this build a single-use Daemon process will be forked. For more on this, please refer to https://docs.gradle.org/8.10/userguide/gradle_daemon.html#sec:disabling_the_daemon in the Gradle documentation.
Daemon will be stopped at the end of the build 

> Task :build-infra:compileJava
Note: /home/jenkins/jenkins-agent/workspace/Solr/Solr-Test-10.0/build-tools/build-infra/src/main/java/org/apache/lucene/gradle/Checksum.java uses or overrides a deprecated API.
Note: Recompile with -Xlint:deprecation for details.

> Task :build-infra:pluginDescriptors
> Task :build-infra:processResources
> Task :build-infra:classes
> Task :build-infra:jar
> Task :gitStatus
> Task :checkJdkInternalsExportedToGradle

> Task :solr:api:compileJava
Note: Some input files use or override a deprecated API.
Note: Recompile with -Xlint:deprecation for details.

> Task :solr:api:processResources NO-SOURCE
> Task :solr:api:classes
> Task :solr:api:jar

> Task :randomizationInfo
Running tests with randomization seed: tests.seed=CABB6CE3016848EF

> Task :solr:api:resolve
SLF4J(W): No SLF4J providers were found.
SLF4J(W): Defaulting to no-operation (NOP) logger implementation
SLF4J(W): See https://www.slf4j.org/codes.html#noProviders for further details.

> Task :solr:solrj:openApiGenerate
Cleaned up output directory /home/jenkins/jenkins-agent/workspace/Solr/Solr-Test-10.0/solr/solrj/build/generated/ before code generation (cleanupOutput set to true).
No application/json content media type found in response. Response examples can currently only be generated for application/json media type.
############################################################################################
# Thanks for using OpenAPI Generator.                                                      #
# We appreciate your support! Please consider donation to help us maintain this project.   #
# https://opencollective.com/openapi_generator/donate                                      #
############################################################################################
Successfully generated code to /home/jenkins/jenkins-agent/workspace/Solr/Solr-Test-10.0/solr/solrj/build/generated/

> Task :spotlessInternalRegisterDependencies
> Task :solr:solrj:generatedSpotlessHelper
> Task :solr:solrj:generatedSpotless

> Task :solr:solrj:compileJava
Note: Some input files use or override a deprecated API.
Note: Recompile with -Xlint:deprecation for details.

> Task :solr:solrj-jetty:compileJava
Note: /home/jenkins/jenkins-agent/workspace/Solr/Solr-Test-10.0/solr/solrj-jetty/src/java/org/apache/solr/client/solrj/jetty/HttpJettySolrClient.java uses or overrides a deprecated API.
Note: Recompile with -Xlint:deprecation for details.

> Task :solr:solrj-streaming:compileJava
Note: Some input files use or override a deprecated API.
Note: Recompile with -Xlint:deprecation for details.

> Task :solr:solrj-zookeeper:compileJava
Note: Some input files use or override a deprecated API.
Note: Recompile with -Xlint:deprecation for details.

> Task :solr:core:compileJava
Note: Some input files use or override a deprecated API.
Note: Recompile with -Xlint:deprecation for details.

> Task :solr:test-framework:compileJava
Note: Some input files use or override a deprecated API.
Note: Recompile with -Xlint:deprecation for details.

> Task :solr:api:compileTestJava
> Task :solr:api:processTestResources
> Task :solr:api:testClasses
> Task :solr:core:processResources
> Task :solr:core:classes
> Task :solr:core:jar
> Task :solr:solrj:processResources
> Task :solr:solrj:classes
> Task :solr:solrj:jar
> Task :solr:solrj-jetty:processResources NO-SOURCE
> Task :solr:solrj-jetty:classes
> Task :solr:solrj-jetty:jar
> Task :solr:solrj-streaming:processResources
> Task :solr:solrj-streaming:classes
> Task :solr:solrj-streaming:jar
> Task :solr:solrj-zookeeper:processResources NO-SOURCE
> Task :solr:solrj-zookeeper:classes
> Task :solr:solrj-zookeeper:jar
> Task :solr:test-framework:processResources
> Task :solr:test-framework:classes
> Task :solr:test-framework:jar

> Task :solr:api:test
WARNING: Using incubator modules: jdk.incubator.vector
WARNING: Using incubator modules: jdk.incubator.vector
WARNING: A command line option has enabled the Security Manager
WARNING: The Security Manager is deprecated and will be removed in a future release
WARNING: A command line option has enabled the Security Manager
WARNING: The Security Manager is deprecated and will be removed in a future release
java.security.policy: error adding Permission, java.net.URLPermission:
	java.util.ServiceConfigurationError: Locale provider adapter "CLDR"cannot be instantiated.
java.security.policy: error adding Permission, java.net.URLPermission:
	java.util.ServiceConfigurationError: Locale provider adapter "CLDR"cannot be instantiated.
java.security.policy: error adding Permission, java.net.URLPermission:
	java.util.ServiceConfigurationError: Locale provider adapter "CLDR"cannot be instantiated.
java.security.policy: error adding Permission, java.net.URLPermission:
	java.util.ServiceConfigurationError: Locale provider adapter "CLDR"cannot be instantiated.
java.security.policy: error adding Permission, java.net.URLPermission:
	java.util.ServiceConfigurationError: Locale provider adapter "CLDR"cannot be instantiated.
java.security.policy: error adding Permission, java.net.URLPermission:
	java.util.ServiceConfigurationError: Locale provider adapter "CLDR"cannot be instantiated.
:solr:api:test (SUCCESS): 19 test(s)

> Task :solr:api:wipeTaskTemp
> Task :solr:benchmark:compileJava
> Task :solr:benchmark:processResources
> Task :solr:benchmark:classes
> Task :solr:benchmark:compileTestJava
> Task :solr:benchmark:processTestResources
> Task :solr:benchmark:testClasses

> Task :solr:benchmark:test
WARNING: Using incubator modules: jdk.incubator.vector
WARNING: Using incubator modules: jdk.incubator.vector
WARNING: Using incubator modules: jdk.incubator.vector
WARNING: A command line option has enabled the Security Manager
WARNING: The Security Manager is deprecated and will be removed in a future release
WARNING: A command line option has enabled the Security Manager
WARNING: The Security Manager is deprecated and will be removed in a future release
WARNING: A command line option has enabled the Security Manager
WARNING: The Security Manager is deprecated and will be removed in a future release
java.security.policy: error adding Permission, java.net.URLPermission:
	java.util.ServiceConfigurationError: Locale provider adapter "CLDR"cannot be instantiated.
java.security.policy: error adding Permission, java.net.URLPermission:
	java.util.ServiceConfigurationError: Locale provider adapter "CLDR"cannot be instantiated.
java.security.policy: error adding Permission, java.net.URLPermission:
	java.util.ServiceConfigurationError: Locale provider adapter "CLDR"cannot be instantiated.
java.security.policy: error adding Permission, java.net.URLPermission:
	java.util.ServiceConfigurationError: Locale provider adapter "CLDR"cannot be instantiated.
java.security.policy: error adding Permission, java.net.URLPermission:
	java.util.ServiceConfigurationError: Locale provider adapter "CLDR"cannot be instantiated.
java.security.policy: error adding Permission, java.net.URLPermission:
	java.util.ServiceConfigurationError: Locale provider adapter "CLDR"cannot be instantiated.
java.security.policy: error adding Permission, java.net.URLPermission:
	java.util.ServiceConfigurationError: Locale provider adapter "CLDR"cannot be instantiated.
java.security.policy: error adding Permission, java.net.URLPermission:
	java.util.ServiceConfigurationError: Locale provider adapter "CLDR"cannot be instantiated.
java.security.policy: error adding Permission, java.net.URLPermission:
	java.util.ServiceConfigurationError: Locale provider adapter "CLDR"cannot be instantiated.
:solr:benchmark:test (SUCCESS): 10 test(s)

> Task :solr:benchmark:wipeTaskTemp
> Task :solr:core:compileTestJava
Note: Some input files use or override a deprecated API.
Note: Recompile with -Xlint:deprecation for details.

> Task :solr:core:processTestResources
> Task :solr:core:testClasses

> Task :solr:modules:analysis-extras:compileJava
Note: /home/jenkins/jenkins-agent/workspace/Solr/Solr-Test-10.0/solr/modules/analysis-extras/src/java/org/apache/solr/schema/ICUCollationField.java uses or overrides a deprecated API.
Note: Recompile with -Xlint:deprecation for details.

> Task :solr:modules:analysis-extras:processResources NO-SOURCE
> Task :solr:modules:analysis-extras:classes
> Task :solr:modules:analysis-extras:jar

> Task :solr:core:test
WARNING: Using incubator modules: jdk.incubator.vector
WARNING: Using incubator modules: jdk.incubator.vector
WARNING: Using incubator modules: jdk.incubator.vector
WARNING: Using incubator modules: jdk.incubator.vector
WARNING: A command line option has enabled the Security Manager
WARNING: The Security Manager is deprecated and will be removed in a future release
WARNING: A command line option has enabled the Security Manager
WARNING: The Security Manager is deprecated and will be removed in a future release
WARNING: A command line option has enabled the Security Manager
WARNING: The Security Manager is deprecated and will be removed in a future release
WARNING: A command line option has enabled the Security Manager
WARNING: The Security Manager is deprecated and will be removed in a future release
java.security.policy: error adding Permission, java.net.URLPermission:
	java.util.ServiceConfigurationError: Locale provider adapter "CLDR"cannot be instantiated.
java.security.policy: error adding Permission, java.net.URLPermission:
	java.util.ServiceConfigurationError: Locale provider adapter "CLDR"cannot be instantiated.
java.security.policy: error adding Permission, java.net.URLPermission:
	java.util.ServiceConfigurationError: Locale provider adapter "CLDR"cannot be instantiated.
java.security.policy: error adding Permission, java.net.URLPermission:
	java.util.ServiceConfigurationError: Locale provider adapter "CLDR"cannot be instantiated.
java.security.policy: error adding Permission, java.net.URLPermission:
	java.util.ServiceConfigurationError: Locale provider adapter "CLDR"cannot be instantiated.
java.security.policy: error adding Permission, java.net.URLPermission:
	java.util.ServiceConfigurationError: Locale provider adapter "CLDR"cannot be instantiated.
java.security.policy: error adding Permission, java.net.URLPermission:
	java.util.ServiceConfigurationError: Locale provider adapter "CLDR"cannot be instantiated.
java.security.policy: error adding Permission, java.net.URLPermission:
	java.util.ServiceConfigurationError: Locale provider adapter "CLDR"cannot be instantiated.
java.security.policy: error adding Permission, java.net.URLPermission:
	java.util.ServiceConfigurationError: Locale provider adapter "CLDR"cannot be instantiated.
java.security.policy: error adding Permission, java.net.URLPermission:
	java.util.ServiceConfigurationError: Locale provider adapter "CLDR"cannot be instantiated.
java.security.policy: error adding Permission, java.net.URLPermission:
	java.util.ServiceConfigurationError: Locale provider adapter "CLDR"cannot be instantiated.
java.security.policy: error adding Permission, java.net.URLPermission:
	java.util.ServiceConfigurationError: Locale provider adapter "CLDR"cannot be instantiated.
WARNING: Test org.apache.solr.TestRandomDVFaceting wrote 13,984,455 bytes of output.
WARNING: Test org.apache.solr.TestRandomFaceting wrote 31,251,231 bytes of output.
WARNING: Test org.apache.solr.cloud.TestStressCloudBlindAtomicUpdates wrote 14,280,830 bytes of output.
WARNING: Test org.apache.solr.cloud.TestRandomFlRTGCloud wrote 18,557,004 bytes of output.
WARNING: Test org.apache.solr.cloud.TestStressInPlaceUpdates wrote 27,637,844 bytes of output.

[653.482s][warning][jfr,system] Could not initialize JDK events. access denied ("java.lang.RuntimePermission" "accessClassInPackage.jdk.internal.event")
[666.132s][warning][jfr,system] Could not initialize JDK events. access denied ("java.lang.RuntimePermission" "accessClassInPackage.jdk.internal.event")

> Task :solr:core:test
WARNING: Test org.apache.solr.search.TestRealTimeGet wrote 12,373,290 bytes of output.
WARNING: Test org.apache.solr.search.facet.TestCloudJSONFacetSKGEquiv wrote 21,823,389 bytes of output.

[983.921s][warning][jfr,system] Could not initialize JDK events. access denied ("java.lang.RuntimePermission" "accessClassInPackage.jdk.internal.event")

> Task :solr:core:test
WARNING: Test org.apache.solr.search.TestRandomCollapseQParserPlugin wrote 21,040,914 bytes of output.
WARNING: Test org.apache.solr.search.TestRangeQuery wrote 17,142,233 bytes of output.
WARNING: Test org.apache.solr.schema.TestPointFields wrote 21,579,844 bytes of output.
WARNING: Test org.apache.solr.search.TestStressVersions wrote 11,080,099 bytes of output.
WARNING: Test org.apache.solr.search.TestStressReorder wrote 12,223,600 bytes of output.
WARNING: Test org.apache.solr.update.TestInPlaceUpdatesStandalone wrote 27,323,657 bytes of output.
WARNING: Test org.apache.solr.search.facet.TestCloudJSONFacetSKG wrote 15,343,932 bytes of output.
:solr:core:test (SUCCESS): 5176 test(s), 194 skipped

> Task :solr:core:wipeTaskTemp

> Task :solr:modules:cross-dc:compileJava
Note: Some input files use or override a deprecated API.
Note: Recompile with -Xlint:deprecation for details.

> Task :solr:cross-dc-manager:compileJava
Note: Some input files use or override a deprecated API.
Note: Recompile with -Xlint:deprecation for details.

> Task :solr:cross-dc-manager:processResources NO-SOURCE
> Task :solr:cross-dc-manager:classes

> Task :solr:cross-dc-manager:compileTestJava
Note: Some input files use or override a deprecated API.
Note: Recompile with -Xlint:deprecation for details.

> Task :solr:cross-dc-manager:processTestResources
> Task :solr:cross-dc-manager:testClasses
> Task :solr:modules:cross-dc:processResources NO-SOURCE
> Task :solr:modules:cross-dc:classes
> Task :solr:modules:cross-dc:jar
OpenJDK 64-Bit Server VM warning: Sharing is only supported for boot loader classes because bootstrap classpath has been appended

> Task :solr:cross-dc-manager:test
WARNING: Using incubator modules: jdk.incubator.vector
WARNING: Using incubator modules: jdk.incubator.vector
WARNING: Using incubator modules: jdk.incubator.vector
WARNING: Using incubator modules: jdk.incubator.vector
WARNING: A command line option has enabled the Security Manager
WARNING: The Security Manager is deprecated and will be removed in a future release
WARNING: A command line option has enabled the Security Manager
WARNING: The Security Manager is deprecated and will be removed in a future release
WARNING: A command line option has enabled the Security Manager
WARNING: The Security Manager is deprecated and will be removed in a future release
WARNING: A command line option has enabled the Security Manager
WARNING: The Security Manager is deprecated and will be removed in a future release
java.security.policy: error adding Permission, java.net.URLPermission:
	java.util.ServiceConfigurationError: Locale provider adapter "CLDR"cannot be instantiated.
java.security.policy: error adding Permission, java.net.URLPermission:
	java.util.ServiceConfigurationError: Locale provider adapter "CLDR"cannot be instantiated.
java.security.policy: error adding Permission, java.net.URLPermission:
	java.util.ServiceConfigurationError: Locale provider adapter "CLDR"cannot be instantiated.
java.security.policy: error adding Permission, java.net.URLPermission:
	java.util.ServiceConfigurationError: Locale provider adapter "CLDR"cannot be instantiated.
java.security.policy: error adding Permission, java.net.URLPermission:
	java.util.ServiceConfigurationError: Locale provider adapter "CLDR"cannot be instantiated.
java.security.policy: error adding Permission, java.net.URLPermission:
	java.util.ServiceConfigurationError: Locale provider adapter "CLDR"cannot be instantiated.
java.security.policy: error adding Permission, java.net.URLPermission:
	java.util.ServiceConfigurationError: Locale provider adapter "CLDR"cannot be instantiated.
java.security.policy: error adding Permission, java.net.URLPermission:
	java.util.ServiceConfigurationError: Locale provider adapter "CLDR"cannot be instantiated.
java.security.policy: error adding Permission, java.net.URLPermission:
	java.util.ServiceConfigurationError: Locale provider adapter "CLDR"cannot be instantiated.
java.security.policy: error adding Permission, java.net.URLPermission:
	java.util.ServiceConfigurationError: Locale provider adapter "CLDR"cannot be instantiated.
java.security.policy: error adding Permission, java.net.URLPermission:
	java.util.ServiceConfigurationError: Locale provider adapter "CLDR"cannot be instantiated.
java.security.policy: error adding Permission, java.net.URLPermission:
	java.util.ServiceConfigurationError: Locale provider adapter "CLDR"cannot be instantiated.

OpenJDK 64-Bit Server VM warning: Sharing is only supported for boot loader classes because bootstrap classpath has been appended
OpenJDK 64-Bit Server VM warning: Sharing is only supported for boot loader classes because bootstrap classpath has been appended
OpenJDK 64-Bit Server VM warning: Sharing is only supported for boot loader classes because bootstrap classpath has been appended

> Task :solr:cross-dc-manager:test
:solr:cross-dc-manager:test (SUCCESS): 38 test(s), 7 skipped

> Task :solr:cross-dc-manager:wipeTaskTemp
> Task :solr:server:compileJava SKIPPED
> Task :solr:server:processResources NO-SOURCE
> Task :solr:server:classes UP-TO-DATE
> Task :solr:server:compileTestJava NO-SOURCE
> Task :solr:server:processTestResources NO-SOURCE
> Task :solr:server:testClasses UP-TO-DATE
> Task :solr:server:test NO-SOURCE
> Task :solr:server:wipeTaskTemp
> Task :solr:solr-ref-guide:compileJava NO-SOURCE
> Task :solr:solr-ref-guide:processResources NO-SOURCE
> Task :solr:solr-ref-guide:classes UP-TO-DATE

> Task :solr:solr-ref-guide:compileTestJava
Note: /home/jenkins/jenkins-agent/workspace/Solr/Solr-Test-10.0/solr/solr-ref-guide/modules/indexing-guide/examples/IndexingNestedDocuments.java uses or overrides a deprecated API.
Note: Recompile with -Xlint:deprecation for details.

> Task :solr:solr-ref-guide:copySolrjTestResources
> Task :solr:solr-ref-guide:processTestResources NO-SOURCE
> Task :solr:solr-ref-guide:testClasses

> Task :solr:modules:sql:compileJava
Note: Some input files use or override a deprecated API.
Note: Recompile with -Xlint:deprecation for details.

> Task :solr:modules:sql:processResources
> Task :solr:modules:sql:classes
> Task :solr:modules:sql:jar

> Task :solr:solr-ref-guide:test
WARNING: Using incubator modules: jdk.incubator.vector
WARNING: Using incubator modules: jdk.incubator.vector
WARNING: Using incubator modules: jdk.incubator.vector
WARNING: Using incubator modules: jdk.incubator.vector
WARNING: A command line option has enabled the Security Manager
WARNING: The Security Manager is deprecated and will be removed in a future release
WARNING: A command line option has enabled the Security Manager
WARNING: The Security Manager is deprecated and will be removed in a future release
WARNING: A command line option has enabled the Security Manager
WARNING: The Security Manager is deprecated and will be removed in a future release
WARNING: A command line option has enabled the Security Manager
WARNING: The Security Manager is deprecated and will be removed in a future release
java.security.policy: error adding Permission, java.net.URLPermission:
	java.util.ServiceConfigurationError: Locale provider adapter "CLDR"cannot be instantiated.
java.security.policy: error adding Permission, java.net.URLPermission:
	java.util.ServiceConfigurationError: Locale provider adapter "CLDR"cannot be instantiated.
java.security.policy: error adding Permission, java.net.URLPermission:
	java.util.ServiceConfigurationError: Locale provider adapter "CLDR"cannot be instantiated.
java.security.policy: error adding Permission, java.net.URLPermission:
	java.util.ServiceConfigurationError: Locale provider adapter "CLDR"cannot be instantiated.
java.security.policy: error adding Permission, java.net.URLPermission:
	java.util.ServiceConfigurationError: Locale provider adapter "CLDR"cannot be instantiated.
java.security.policy: error adding Permission, java.net.URLPermission:
	java.util.ServiceConfigurationError: Locale provider adapter "CLDR"cannot be instantiated.
java.security.policy: error adding Permission, java.net.URLPermission:
	java.util.ServiceConfigurationError: Locale provider adapter "CLDR"cannot be instantiated.
java.security.policy: error adding Permission, java.net.URLPermission:
	java.util.ServiceConfigurationError: Locale provider adapter "CLDR"cannot be instantiated.
java.security.policy: error adding Permission, java.net.URLPermission:
	java.util.ServiceConfigurationError: Locale provider adapter "CLDR"cannot be instantiated.
java.security.policy: error adding Permission, java.net.URLPermission:
	java.util.ServiceConfigurationError: Locale provider adapter "CLDR"cannot be instantiated.
java.security.policy: error adding Permission, java.net.URLPermission:
	java.util.ServiceConfigurationError: Locale provider adapter "CLDR"cannot be instantiated.
java.security.policy: error adding Permission, java.net.URLPermission:
	java.util.ServiceConfigurationError: Locale provider adapter "CLDR"cannot be instantiated.
:solr:solr-ref-guide:test (SUCCESS): 34 test(s)

> Task :solr:solr-ref-guide:wipeTaskTemp

> Task :solr:solrj:compileTestJava
Note: Some input files use or override a deprecated API.
Note: Recompile with -Xlint:deprecation for details.

> Task :solr:solrj:processTestResources
> Task :solr:solrj:testClasses
> Task :solr:solrj:testJar

> Task :solr:solrj:test
WARNING: Using incubator modules: jdk.incubator.vector
WARNING: Using incubator modules: jdk.incubator.vector
WARNING: Using incubator modules: jdk.incubator.vector
WARNING: Using incubator modules: jdk.incubator.vector
WARNING: A command line option has enabled the Security Manager
WARNING: The Security Manager is deprecated and will be removed in a future release
WARNING: A command line option has enabled the Security Manager
WARNING: The Security Manager is deprecated and will be removed in a future release
WARNING: A command line option has enabled the Security Manager
WARNING: The Security Manager is deprecated and will be removed in a future release
WARNING: A command line option has enabled the Security Manager
WARNING: The Security Manager is deprecated and will be removed in a future release
java.security.policy: error adding Permission, java.net.URLPermission:
	java.util.ServiceConfigurationError: Locale provider adapter "CLDR"cannot be instantiated.
java.security.policy: error adding Permission, java.net.URLPermission:
	java.util.ServiceConfigurationError: Locale provider adapter "CLDR"cannot be instantiated.
java.security.policy: error adding Permission, java.net.URLPermission:
	java.util.ServiceConfigurationError: Locale provider adapter "CLDR"cannot be instantiated.
java.security.policy: error adding Permission, java.net.URLPermission:
	java.util.ServiceConfigurationError: Locale provider adapter "CLDR"cannot be instantiated.
java.security.policy: error adding Permission, java.net.URLPermission:
	java.util.ServiceConfigurationError: Locale provider adapter "CLDR"cannot be instantiated.
java.security.policy: error adding Permission, java.net.URLPermission:
	java.util.ServiceConfigurationError: Locale provider adapter "CLDR"cannot be instantiated.
java.security.policy: error adding Permission, java.net.URLPermission:
	java.util.ServiceConfigurationError: Locale provider adapter "CLDR"cannot be instantiated.
java.security.policy: error adding Permission, java.net.URLPermission:
java.security.policy: error adding Permission, java.net.URLPermission:
	java.util.ServiceConfigurationError: Locale provider adapter "CLDR"cannot be instantiated.
	java.util.ServiceConfigurationError: Locale provider adapter "CLDR"cannot be instantiated.
java.security.policy: error adding Permission, java.net.URLPermission:
	java.util.ServiceConfigurationError: Locale provider adapter "CLDR"cannot be instantiated.
java.security.policy: error adding Permission, java.net.URLPermission:
	java.util.ServiceConfigurationError: Locale provider adapter "CLDR"cannot be instantiated.
java.security.policy: error adding Permission, java.net.URLPermission:
	java.util.ServiceConfigurationError: Locale provider adapter "CLDR"cannot be instantiated.

[1.828s][warning][jfr,system] Could not initialize JDK events. access denied ("java.lang.RuntimePermission" "accessClassInPackage.jdk.internal.event")
[21.646s][warning][jfr,system] Could not initialize JDK events. access denied ("java.lang.RuntimePermission" "accessClassInPackage.jdk.internal.event")
[22.658s][warning][jfr,system] Could not initialize JDK events. access denied ("java.lang.RuntimePermission" "accessClassInPackage.jdk.internal.event")
[34.571s][warning][jfr,system] Could not initialize JDK events. access denied ("java.lang.RuntimePermission" "accessClassInPackage.jdk.internal.event")

> Task :solr:solrj:test
:solr:solrj:test (SUCCESS): 1176 test(s), 40 skipped

> Task :solr:solrj:wipeTaskTemp

> Task :solr:solrj-jetty:compileTestJava
Note: Some input files use or override a deprecated API.
Note: Recompile with -Xlint:deprecation for details.

> Task :solr:solrj-jetty:processTestResources
> Task :solr:solrj-jetty:testClasses

> Task :solr:solrj-jetty:test
WARNING: Using incubator modules: jdk.incubator.vector
WARNING: Using incubator modules: jdk.incubator.vector
WARNING: Using incubator modules: jdk.incubator.vector
WARNING: Using incubator modules: jdk.incubator.vector
WARNING: A command line option has enabled the Security Manager
WARNING: The Security Manager is deprecated and will be removed in a future release
WARNING: A command line option has enabled the Security Manager
WARNING: The Security Manager is deprecated and will be removed in a future release
WARNING: A command line option has enabled the Security Manager
WARNING: The Security Manager is deprecated and will be removed in a future release
WARNING: A command line option has enabled the Security Manager
WARNING: The Security Manager is deprecated and will be removed in a future release
java.security.policy: error adding Permission, java.net.URLPermission:
	java.util.ServiceConfigurationError: Locale provider adapter "CLDR"cannot be instantiated.
java.security.policy: error adding Permission, java.net.URLPermission:
	java.util.ServiceConfigurationError: Locale provider adapter "CLDR"cannot be instantiated.
java.security.policy: error adding Permission, java.net.URLPermission:
	java.util.ServiceConfigurationError: Locale provider adapter "CLDR"cannot be instantiated.
java.security.policy: error adding Permission, java.net.URLPermission:
	java.util.ServiceConfigurationError: Locale provider adapter "CLDR"cannot be instantiated.
java.security.policy: error adding Permission, java.net.URLPermission:
	java.util.ServiceConfigurationError: Locale provider adapter "CLDR"cannot be instantiated.
java.security.policy: error adding Permission, java.net.URLPermission:
	java.util.ServiceConfigurationError: Locale provider adapter "CLDR"cannot be instantiated.
java.security.policy: error adding Permission, java.net.URLPermission:
	java.util.ServiceConfigurationError: Locale provider adapter "CLDR"cannot be instantiated.
java.security.policy: error adding Permission, java.net.URLPermission:
	java.util.ServiceConfigurationError: Locale provider adapter "CLDR"cannot be instantiated.
java.security.policy: error adding Permission, java.net.URLPermission:
	java.util.ServiceConfigurationError: Locale provider adapter "CLDR"cannot be instantiated.
java.security.policy: error adding Permission, java.net.URLPermission:
	java.util.ServiceConfigurationError: Locale provider adapter "CLDR"cannot be instantiated.
java.security.policy: error adding Permission, java.net.URLPermission:
	java.util.ServiceConfigurationError: Locale provider adapter "CLDR"cannot be instantiated.
java.security.policy: error adding Permission, java.net.URLPermission:
	java.util.ServiceConfigurationError: Locale provider adapter "CLDR"cannot be instantiated.
:solr:solrj-jetty:test (SUCCESS): 53 test(s), 2 skipped

> Task :solr:solrj-jetty:wipeTaskTemp

> Task :solr:solrj-streaming:compileTestJava
Note: Some input files use or override a deprecated API.
Note: Recompile with -Xlint:deprecation for details.

> Task :solr:solrj-streaming:processTestResources
> Task :solr:solrj-streaming:testClasses

> Task :solr:solrj-streaming:test
WARNING: Using incubator modules: jdk.incubator.vector
WARNING: Using incubator modules: jdk.incubator.vector
WARNING: Using incubator modules: jdk.incubator.vector
WARNING: Using incubator modules: jdk.incubator.vector
WARNING: A command line option has enabled the Security Manager
WARNING: The Security Manager is deprecated and will be removed in a future release
WARNING: A command line option has enabled the Security Manager
WARNING: The Security Manager is deprecated and will be removed in a future release
WARNING: A command line option has enabled the Security Manager
WARNING: The Security Manager is deprecated and will be removed in a future release
WARNING: A command line option has enabled the Security Manager
WARNING: The Security Manager is deprecated and will be removed in a future release
java.security.policy: error adding Permission, java.net.URLPermission:
	java.util.ServiceConfigurationError: Locale provider adapter "CLDR"cannot be instantiated.
java.security.policy: error adding Permission, java.net.URLPermission:
	java.util.ServiceConfigurationError: Locale provider adapter "CLDR"cannot be instantiated.
java.security.policy: error adding Permission, java.net.URLPermission:
	java.util.ServiceConfigurationError: Locale provider adapter "CLDR"cannot be instantiated.
java.security.policy: error adding Permission, java.net.URLPermission:
	java.util.ServiceConfigurationError: Locale provider adapter "CLDR"cannot be instantiated.
java.security.policy: error adding Permission, java.net.URLPermission:
	java.util.ServiceConfigurationError: Locale provider adapter "CLDR"cannot be instantiated.
java.security.policy: error adding Permission, java.net.URLPermission:
	java.util.ServiceConfigurationError: Locale provider adapter "CLDR"cannot be instantiated.
java.security.policy: error adding Permission, java.net.URLPermission:
java.security.policy: error adding Permission, java.net.URLPermission:
	java.util.ServiceConfigurationError: Locale provider adapter "CLDR"cannot be instantiated.
	java.util.ServiceConfigurationError: Locale provider adapter "CLDR"cannot be instantiated.
java.security.policy: error adding Permission, java.net.URLPermission:
	java.util.ServiceConfigurationError: Locale provider adapter "CLDR"cannot be instantiated.
java.security.policy: error adding Permission, java.net.URLPermission:
	java.util.ServiceConfigurationError: Locale provider adapter "CLDR"cannot be instantiated.
java.security.policy: error adding Permission, java.net.URLPermission:
	java.util.ServiceConfigurationError: Locale provider adapter "CLDR"cannot be instantiated.
java.security.policy: error adding Permission, java.net.URLPermission:
	java.util.ServiceConfigurationError: Locale provider adapter "CLDR"cannot be instantiated.

StreamDecoratorTest > testParallelDaemonCommitStream FAILED
    java.lang.Exception: Test abandoned because suite timeout was reached.
        at __randomizedtesting.SeedInfo.seed([CABB6CE3016848EF]:0)

StreamDecoratorTest > classMethod FAILED
    java.lang.Exception: Suite timeout exceeded (>= 7200000 msec).
        at __randomizedtesting.SeedInfo.seed([CABB6CE3016848EF]:0)

org.apache.solr.client.solrj.io.stream.StreamDecoratorTest > test suite's output saved to /home/jenkins/jenkins-agent/workspace/Solr/Solr-Test-10.0/solr/solrj-streaming/build/test-results/test/outputs/OUTPUT-org.apache.solr.client.solrj.io.stream.StreamDecoratorTest.txt, copied below:
  2> 7749 INFO  (SUITE-StreamDecoratorTest-seed#[CABB6CE3016848EF]-worker) [] o.a.s.SolrTestCase Setting 'solr.configset.default.confdir' system property to test-framework derived value of '/home/jenkins/jenkins-agent/workspace/Solr/Solr-Test-10.0/solr/server/solr/configsets/_default/conf'
  2> 7749 INFO  (SUITE-StreamDecoratorTest-seed#[CABB6CE3016848EF]-worker) [] o.a.s.SolrTestCaseJ4 SecureRandom sanity checks: test.solr.allowed.securerandom=null & java.security.egd=file:/dev/./urandom
  2> 7750 INFO  (SUITE-StreamDecoratorTest-seed#[CABB6CE3016848EF]-worker) [] o.a.s.u.ErrorLogMuter Closing ErrorLogMuter-regex-4 after mutting 0 log messages
  2> 7750 INFO  (SUITE-StreamDecoratorTest-seed#[CABB6CE3016848EF]-worker) [] o.a.s.u.ErrorLogMuter Creating ErrorLogMuter-regex-5 for ERROR logs matching regex: ignore_exception
  2> 7750 INFO  (SUITE-StreamDecoratorTest-seed#[CABB6CE3016848EF]-worker) [] o.a.s.SolrTestCaseJ4 Created dataDir: /home/jenkins/jenkins-agent/workspace/Solr/Solr-Test-10.0/build/tmp/tests-tmp/org.apache.solr.client.solrj.io.stream.StreamDecoratorTest_CABB6CE3016848EF-001/data-dir-3-001
  2> 7751 WARN  (SUITE-StreamDecoratorTest-seed#[CABB6CE3016848EF]-worker) [] o.a.s.SolrTestCaseJ4 startTrackingSearchers: numOpens=19 numCloses=19
  2> 7751 INFO  (SUITE-StreamDecoratorTest-seed#[CABB6CE3016848EF]-worker) [] o.a.s.SolrTestCaseJ4 Using PointFields (NUMERIC_POINTS_SYSPROP=true) w/NUMERIC_DOCVALUES_SYSPROP=false
  2> 7752 INFO  (SUITE-StreamDecoratorTest-seed#[CABB6CE3016848EF]-worker) [] o.a.s.SolrTestCaseJ4 Randomized ssl (false) and clientAuth (false) via: @org.apache.solr.SolrTestCaseJ4.SuppressSSL(bugUrl="None")
  2> 7752 INFO  (SUITE-StreamDecoratorTest-seed#[CABB6CE3016848EF]-worker) [] o.a.s.c.OpenTelemetryConfigurator OpenTelemetry tracer enabled with simple propagation only.
  2> 7752 INFO  (SUITE-StreamDecoratorTest-seed#[CABB6CE3016848EF]-worker) [] o.a.s.c.MiniSolrCloudCluster Starting cluster of 4 servers in /home/jenkins/jenkins-agent/workspace/Solr/Solr-Test-10.0/build/tmp/tests-tmp/org.apache.solr.client.solrj.io.stream.StreamDecoratorTest_CABB6CE3016848EF-001/tempDir-001
  2> 7752 INFO  (SUITE-StreamDecoratorTest-seed#[CABB6CE3016848EF]-worker) [] o.a.s.c.ZkTestServer STARTING ZK TEST SERVER
  2> 7753 INFO  (ZkTestServer Run Thread) [] o.a.s.c.ZkTestServer client port: /127.0.0.1:0
  2> 7753 INFO  (ZkTestServer Run Thread) [] o.a.s.c.ZkTestServer Starting server
  2> 7754 WARN  (ZkTestServer Run Thread) [] o.a.z.s.ServerCnxnFactory maxCnxns is not configured, using default value 0.
  2> 7853 INFO  (SUITE-StreamDecoratorTest-seed#[CABB6CE3016848EF]-worker) [] o.a.s.c.ZkTestServer start zk server on port: 36907
  2> 7854 WARN  (SUITE-StreamDecoratorTest-seed#[CABB6CE3016848EF]-worker) [] o.a.s.c.c.SolrZkClient Using default ZkCredentialsInjector. ZkCredentialsInjector is not secure, it creates an empty list of credentials which leads to 'OPEN_ACL_UNSAFE' ACLs to Zookeeper nodes
  2> 7854 WARN  (SUITE-StreamDecoratorTest-seed#[CABB6CE3016848EF]-worker) [] o.a.s.c.c.SolrZkClient Using default ZkACLProvider. DefaultZkACLProvider is not secure, it creates 'OPEN_ACL_UNSAFE' ACLs to Zookeeper nodes
  2> 7855 INFO  (SUITE-StreamDecoratorTest-seed#[CABB6CE3016848EF]-worker) [] o.a.c.f.i.CuratorFrameworkImpl Starting
  2> 7856 INFO  (SUITE-StreamDecoratorTest-seed#[CABB6CE3016848EF]-worker) [] o.a.c.f.i.CuratorFrameworkImpl Default schema
  2> 7858 INFO  (SUITE-StreamDecoratorTest-seed#[CABB6CE3016848EF]-worker-EventThread) [] o.a.c.f.s.ConnectionStateManager State change: CONNECTED
  2> 7859 INFO  (SUITE-StreamDecoratorTest-seed#[CABB6CE3016848EF]-worker-EventThread) [] o.a.c.f.i.EnsembleTracker New config event received: {}
  2> 7859 INFO  (SUITE-StreamDecoratorTest-seed#[CABB6CE3016848EF]-worker-EventThread) [] o.a.c.f.i.EnsembleTracker New config event received: {}
  2> 7860 WARN  (SUITE-StreamDecoratorTest-seed#[CABB6CE3016848EF]-worker) [] o.a.s.c.c.SolrZkClient Using default ZkCredentialsInjector. ZkCredentialsInjector is not secure, it creates an empty list of credentials which leads to 'OPEN_ACL_UNSAFE' ACLs to Zookeeper nodes
  2> 7860 WARN  (SUITE-StreamDecoratorTest-seed#[CABB6CE3016848EF]-worker) [] o.a.s.c.c.SolrZkClient Using default ZkACLProvider. DefaultZkACLProvider is not secure, it creates 'OPEN_ACL_UNSAFE' ACLs to Zookeeper nodes
  2> 7860 INFO  (SUITE-StreamDecoratorTest-seed#[CABB6CE3016848EF]-worker) [] o.a.c.f.i.CuratorFrameworkImpl Starting
  2> 7861 INFO  (SUITE-StreamDecoratorTest-seed#[CABB6CE3016848EF]-worker) [] o.a.c.f.i.CuratorFrameworkImpl Default schema
  2> 7862 INFO  (SUITE-StreamDecoratorTest-seed#[CABB6CE3016848EF]-worker-EventThread) [] o.a.c.f.s.ConnectionStateManager State change: CONNECTED
  2> 7862 WARN  (SUITE-StreamDecoratorTest-seed#[CABB6CE3016848EF]-worker) [] o.a.s.c.c.SolrZkClient Using default ZkCredentialsInjector. ZkCredentialsInjector is not secure, it creates an empty list of credentials which leads to 'OPEN_ACL_UNSAFE' ACLs to Zookeeper nodes
  2> 7862 WARN  (SUITE-StreamDecoratorTest-seed#[CABB6CE3016848EF]-worker) [] o.a.s.c.c.SolrZkClient Using default ZkACLProvider. DefaultZkACLProvider is not secure, it creates 'OPEN_ACL_UNSAFE' ACLs to Zookeeper nodes
  2> 7862 INFO  (SUITE-StreamDecoratorTest-seed#[CABB6CE3016848EF]-worker-EventThread) [] o.a.c.f.i.EnsembleTracker New config event received: {}
  2> 7862 INFO  (SUITE-StreamDecoratorTest-seed#[CABB6CE3016848EF]-worker) [] o.a.c.f.i.CuratorFrameworkImpl Starting
  2> 7862 INFO  (SUITE-StreamDecoratorTest-seed#[CABB6CE3016848EF]-worker-EventThread) [] o.a.c.f.i.EnsembleTracker New config event received: {}
  2> 7863 INFO  (SUITE-StreamDecoratorTest-seed#[CABB6CE3016848EF]-worker) [] o.a.c.f.i.CuratorFrameworkImpl Default schema
  2> 7864 INFO  (SUITE-StreamDecoratorTest-seed#[CABB6CE3016848EF]-worker-EventThread) [] o.a.c.f.s.ConnectionStateManager State change: CONNECTED
  2> 7865 INFO  (SUITE-StreamDecoratorTest-seed#[CABB6CE3016848EF]-worker-EventThread) [] o.a.c.f.i.EnsembleTracker New config event received: {}
  2> 7865 INFO  (SUITE-StreamDecoratorTest-seed#[CABB6CE3016848EF]-worker-EventThread) [] o.a.c.f.i.EnsembleTracker New config event received: {}
  2> 7866 INFO  (Curator-Framework-0) [] o.a.c.f.i.CuratorFrameworkImpl backgroundOperationsLoop exiting
  2> 7969 INFO  (jetty-launcher-180-thread-3) [] o.a.s.e.JettySolrRunner Start Jetty (configured port=0, binding port=0)
  2> 7969 INFO  (jetty-launcher-180-thread-1) [] o.a.s.e.JettySolrRunner Start Jetty (configured port=0, binding port=0)
  2> 7969 INFO  (jetty-launcher-180-thread-2) [] o.a.s.e.JettySolrRunner Start Jetty (configured port=0, binding port=0)
  2> 7969 INFO  (jetty-launcher-180-thread-4) [] o.a.s.e.JettySolrRunner Start Jetty (configured port=0, binding port=0)
  2> 7969 INFO  (jetty-launcher-180-thread-2) [] o.a.s.e.JettySolrRunner Trying to start Jetty on port 0 try number 2 ...
  2> 7969 INFO  (jetty-launcher-180-thread-1) [] o.a.s.e.JettySolrRunner Trying to start Jetty on port 0 try number 2 ...
  2> 7969 INFO  (jetty-launcher-180-thread-3) [] o.a.s.e.JettySolrRunner Trying to start Jetty on port 0 try number 2 ...
  2> 7969 INFO  (jetty-launcher-180-thread-4) [] o.a.s.e.JettySolrRunner Trying to start Jetty on port 0 try number 2 ...
  2> 7969 INFO  (jetty-launcher-180-thread-2) [] o.e.j.s.Server jetty-12.0.27; built: 2025-09-10T23:47:49.595Z; git: 3569a3e83ad136ee44e26b370b74c1c5e9f33e61; jvm 21.0.4+7-LTS
  2> 7969 INFO  (jetty-launcher-180-thread-3) [] o.e.j.s.Server jetty-12.0.27; built: 2025-09-10T23:47:49.595Z; git: 3569a3e83ad136ee44e26b370b74c1c5e9f33e61; jvm 21.0.4+7-LTS
  2> 7969 INFO  (jetty-launcher-180-thread-1) [] o.e.j.s.Server jetty-12.0.27; built: 2025-09-10T23:47:49.595Z; git: 3569a3e83ad136ee44e26b370b74c1c5e9f33e61; jvm 21.0.4+7-LTS
  2> 7969 INFO  (jetty-launcher-180-thread-4) [] o.e.j.s.Server jetty-12.0.27; built: 2025-09-10T23:47:49.595Z; git: 3569a3e83ad136ee44e26b370b74c1c5e9f33e61; jvm 21.0.4+7-LTS
  2> 7973 INFO  (jetty-launcher-180-thread-3) [] o.e.j.s.DefaultSessionIdManager Session workerName=node0
  2> 7973 INFO  (jetty-launcher-180-thread-2) [] o.e.j.s.DefaultSessionIdManager Session workerName=node0
  2> 7973 INFO  (jetty-launcher-180-thread-1) [] o.e.j.s.DefaultSessionIdManager Session workerName=node0
  2> 7973 INFO  (jetty-launcher-180-thread-4) [] o.e.j.s.DefaultSessionIdManager Session workerName=node0
  2> 7973 WARN  (jetty-launcher-180-thread-1) [] o.e.j.e.s.ServletContextHandler BaseResource file:///home/jenkins/jenkins-agent/workspace/Solr/Solr-Test-10.0/solr/solrj-streaming/build/tmp/tests-cwd/./ is aliased to file:///home/jenkins/jenkins-agent/workspace/Solr/Solr-Test-10.0/solr/solrj-streaming/build/tmp/tests-cwd/ in oeje10s.ServletContextHandler@146f7a80{/solr,/solr,b=file:///home/jenkins/jenkins-agent/workspace/Solr/Solr-Test-10.0/solr/solrj-streaming/build/tmp/tests-cwd/./,a=STOPPED,h=oeje10s.SessionHandler@69008f54{STOPPED}}. May not be supported in future releases.
  2> 7973 WARN  (jetty-launcher-180-thread-2) [] o.e.j.e.s.ServletContextHandler BaseResource file:///home/jenkins/jenkins-agent/workspace/Solr/Solr-Test-10.0/solr/solrj-streaming/build/tmp/tests-cwd/./ is aliased to file:///home/jenkins/jenkins-agent/workspace/Solr/Solr-Test-10.0/solr/solrj-streaming/build/tmp/tests-cwd/ in oeje10s.ServletContextHandler@68d83b1c{/solr,/solr,b=file:///home/jenkins/jenkins-agent/workspace/Solr/Solr-Test-10.0/solr/solrj-streaming/build/tmp/tests-cwd/./,a=STOPPED,h=oeje10s.SessionHandler@595ca2ee{STOPPED}}. May not be supported in future releases.
  2> 7973 WARN  (jetty-launcher-180-thread-3) [] o.e.j.e.s.ServletContextHandler BaseResource file:///home/jenkins/jenkins-agent/workspace/Solr/Solr-Test-10.0/solr/solrj-streaming/build/tmp/tests-cwd/./ is aliased to file:///home/jenkins/jenkins-agent/workspace/Solr/Solr-Test-10.0/solr/solrj-streaming/build/tmp/tests-cwd/ in oeje10s.ServletContextHandler@57fa4df3{/solr,/solr,b=file:///home/jenkins/jenkins-agent/workspace/Solr/Solr-Test-10.0/solr/solrj-streaming/build/tmp/tests-cwd/./,a=STOPPED,h=oeje10s.SessionHandler@4ee1558d{STOPPED}}. May not be supported in future releases.
  2> 7973 INFO  (jetty-launcher-180-thread-1) [] o.e.j.s.h.ContextHandler /solr Base Resource is an alias: file:///home/jenkins/jenkins-agent/workspace/Solr/Solr-Test-10.0/solr/solrj-streaming/build/tmp/tests-cwd/./ -> file:///home/jenkins/jenkins-agent/workspace/Solr/Solr-Test-10.0/solr/solrj-streaming/build/tmp/tests-cwd/
  2> 7973 INFO  (jetty-launcher-180-thread-2) [] o.e.j.s.h.ContextHandler /solr Base Resource is an alias: file:///home/jenkins/jenkins-agent/workspace/Solr/Solr-Test-10.0/solr/solrj-streaming/build/tmp/tests-cwd/./ -> file:///home/jenkins/jenkins-agent/workspace/Solr/Solr-Test-10.0/solr/solrj-streaming/build/tmp/tests-cwd/
  2> 7973 WARN  (jetty-launcher-180-thread-4) [] o.e.j.e.s.ServletContextHandler BaseResource file:///home/jenkins/jenkins-agent/workspace/Solr/Solr-Test-10.0/solr/solrj-streaming/build/tmp/tests-cwd/./ is aliased to file:///home/jenkins/jenkins-agent/workspace/Solr/Solr-Test-10.0/solr/solrj-streaming/build/tmp/tests-cwd/ in oeje10s.ServletContextHandler@2e3d765f{/solr,/solr,b=file:///home/jenkins/jenkins-agent/workspace/Solr/Solr-Test-10.0/solr/solrj-streaming/build/tmp/tests-cwd/./,a=STOPPED,h=oeje10s.SessionHandler@42f97990{STOPPED}}. May not be supported in future releases.
  2> 7974 INFO  (jetty-launcher-180-thread-3) [] o.e.j.s.h.ContextHandler /solr Base Resource is an alias: file:///home/jenkins/jenkins-agent/workspace/Solr/Solr-Test-10.0/solr/solrj-streaming/build/tmp/tests-cwd/./ -> file:///home/jenkins/jenkins-agent/workspace/Solr/Solr-Test-10.0/solr/solrj-streaming/build/tmp/tests-cwd/
  2> 7974 INFO  (jetty-launcher-180-thread-4) [] o.e.j.s.h.ContextHandler /solr Base Resource is an alias: file:///home/jenkins/jenkins-agent/workspace/Solr/Solr-Test-10.0/solr/solrj-streaming/build/tmp/tests-cwd/./ -> file:///home/jenkins/jenkins-agent/workspace/Solr/Solr-Test-10.0/solr/solrj-streaming/build/tmp/tests-cwd/
  2> 7974 INFO  (jetty-launcher-180-thread-1) [] o.e.j.s.h.ContextHandler Started oeje10s.ServletContextHandler@146f7a80{/solr,/solr,b=file:///home/jenkins/jenkins-agent/workspace/Solr/Solr-Test-10.0/solr/solrj-streaming/build/tmp/tests-cwd/,a=AVAILABLE,h=oeje10s.SessionHandler@69008f54{STARTED}}
  2> 7974 INFO  (jetty-launcher-180-thread-2) [] o.e.j.s.h.ContextHandler Started oeje10s.ServletContextHandler@68d83b1c{/solr,/solr,b=file:///home/jenkins/jenkins-agent/workspace/Solr/Solr-Test-10.0/solr/solrj-streaming/build/tmp/tests-cwd/,a=AVAILABLE,h=oeje10s.SessionHandler@595ca2ee{STARTED}}
  2> 7974 INFO  (jetty-launcher-180-thread-3) [] o.e.j.s.h.ContextHandler Started oeje10s.ServletContextHandler@57fa4df3{/solr,/solr,b=file:///home/jenkins/jenkins-agent/workspace/Solr/Solr-Test-10.0/solr/solrj-streaming/build/tmp/tests-cwd/,a=AVAILABLE,h=oeje10s.SessionHandler@4ee1558d{STARTED}}
  2> 7974 INFO  (jetty-launcher-180-thread-1) [] o.a.s.e.JettySolrRunner Jetty properties: {hostPort=45399, zkHost=127.0.0.1:36907/solr}
  2> 7974 INFO  (jetty-launcher-180-thread-3) [] o.a.s.e.JettySolrRunner Jetty properties: {hostPort=42991, zkHost=127.0.0.1:36907/solr}
  2> 7974 INFO  (jetty-launcher-180-thread-4) [] o.e.j.s.h.ContextHandler Started oeje10s.ServletContextHandler@2e3d765f{/solr,/solr,b=file:///home/jenkins/jenkins-agent/workspace/Solr/Solr-Test-10.0/solr/solrj-streaming/build/tmp/tests-cwd/,a=AVAILABLE,h=oeje10s.SessionHandler@42f97990{STARTED}}
  2> 7974 ERROR (jetty-launcher-180-thread-3) [] o.a.s.u.StartupLoggingUtils Missing Java Option solr.logs.dir. Logging may be missing or incomplete.
  2> 7974 INFO  (jetty-launcher-180-thread-2) [] o.a.s.e.JettySolrRunner Jetty properties: {hostPort=44081, zkHost=127.0.0.1:36907/solr}
  2> 7974 INFO  (jetty-launcher-180-thread-3) [] o.a.s.s.CoreContainerProvider Using logger factory org.apache.logging.slf4j.Log4jLoggerFactory
  2> 7974 ERROR (jetty-launcher-180-thread-1) [] o.a.s.u.StartupLoggingUtils Missing Java Option solr.logs.dir. Logging may be missing or incomplete.
  2> 7974 INFO  (jetty-launcher-180-thread-1) [] o.a.s.s.CoreContainerProvider Using logger factory org.apache.logging.slf4j.Log4jLoggerFactory
  2> 7974 INFO  (jetty-launcher-180-thread-3) [] o.a.s.s.CoreContainerProvider  ___      _       Welcome to Apache Solr™ version 10.0.1-SNAPSHOT 93068d1dfbc48816caac29c5b3aba3bf884aea85 [snapshot build, details omitted]
  2> 7974 ERROR (jetty-launcher-180-thread-2) [] o.a.s.u.StartupLoggingUtils Missing Java Option solr.logs.dir. Logging may be missing or incomplete.
  2> 7974 INFO  (jetty-launcher-180-thread-1) [] o.a.s.s.CoreContainerProvider  ___      _       Welcome to Apache Solr™ version 10.0.1-SNAPSHOT 93068d1dfbc48816caac29c5b3aba3bf884aea85 [snapshot build, details omitted]
  2> 7974 INFO  (jetty-launcher-180-thread-3) [] o.a.s.s.CoreContainerProvider / __| ___| |_ _   Starting in cloud mode on port null
  2> 7974 INFO  (jetty-launcher-180-thread-2) [] o.a.s.s.CoreContainerProvider Using logger factory org.apache.logging.slf4j.Log4jLoggerFactory
  2> 7974 INFO  (jetty-launcher-180-thread-4) [] o.a.s.e.JettySolrRunner Jetty properties: {hostPort=43521, zkHost=127.0.0.1:36907/solr}
  2> 7974 INFO  (jetty-launcher-180-thread-2) [] o.a.s.s.CoreContainerProvider  ___      _       Welcome to Apache Solr™ version 10.0.1-SNAPSHOT 93068d1dfbc48816caac29c5b3aba3bf884aea85 [snapshot build, details omitted]
  2> 7974 INFO  (jetty-launcher-180-thread-3) [] o.a.s.s.CoreContainerProvider \__ \/ _ \ | '_|  Install dir: /home/jenkins/jenkins-agent/workspace/Solr/Solr-Test-10.0/solr
  2> 7974 INFO  (jetty-launcher-180-thread-1) [] o.a.s.s.CoreContainerProvider / __| ___| |_ _   Starting in cloud mode on port null
  2> 7974 INFO  (jetty-launcher-180-thread-1) [] o.a.s.s.CoreContainerProvider \__ \/ _ \ | '_|  Install dir: /home/jenkins/jenkins-agent/workspace/Solr/Solr-Test-10.0/solr
  2> 7974 INFO  (jetty-launcher-180-thread-3) [] o.a.s.s.CoreContainerProvider |___/\___/_|_|    Start time: 2026-09-14T19:35:00.955766149Z
  2> 7974 ERROR (jetty-launcher-180-thread-4) [] o.a.s.u.StartupLoggingUtils Missing Java Option solr.logs.dir. Logging may be missing or incomplete.
  2> 7974 INFO  (jetty-launcher-180-thread-1) [] o.a.s.s.CoreContainerProvider |___/\___/_|_|    Start time: 2026-09-14T19:35:00.955815939Z
  2> 7974 INFO  (jetty-launcher-180-thread-2) [] o.a.s.s.CoreContainerProvider / __| ___| |_ _   Starting in cloud mode on port null
  2> 7974 INFO  (jetty-launcher-180-thread-4) [] o.a.s.s.CoreContainerProvider Using logger factory org.apache.logging.slf4j.Log4jLoggerFactory
  2> 7974 INFO  (jetty-launcher-180-thread-2) [] o.a.s.s.CoreContainerProvider \__ \/ _ \ | '_|  Install dir: /home/jenkins/jenkins-agent/workspace/Solr/Solr-Test-10.0/solr
  2> 7974 INFO  (jetty-launcher-180-thread-4) [] o.a.s.s.CoreContainerProvider  ___      _       Welcome to Apache Solr™ version 10.0.1-SNAPSHOT 93068d1dfbc48816caac29c5b3aba3bf884aea85 [snapshot build, details omitted]
  2> 7974 INFO  (jetty-launcher-180-thread-3) [] o.a.s.s.CoreContainerProvider Solr Home: /home/jenkins/jenkins-agent/workspace/Solr/Solr-Test-10.0/build/tmp/tests-tmp/org.apache.solr.client.solrj.io.stream.StreamDecoratorTest_CABB6CE3016848EF-001/tempDir-001/node3 (source: servlet config: solr.solr.home)
  2> 7974 INFO  (jetty-launcher-180-thread-2) [] o.a.s.s.CoreContainerProvider |___/\___/_|_|    Start time: 2026-09-14T19:35:00.955970459Z
  2> 7975 INFO  (jetty-launcher-180-thread-4) [] o.a.s.s.CoreContainerProvider / __| ___| |_ _   Starting in cloud mode on port null
  2> 7974 INFO  (jetty-launcher-180-thread-1) [] o.a.s.s.CoreContainerProvider Solr Home: /home/jenkins/jenkins-agent/workspace/Solr/Solr-Test-10.0/build/tmp/tests-tmp/org.apache.solr.client.solrj.io.stream.StreamDecoratorTest_CABB6CE3016848EF-001/tempDir-001/node1 (source: servlet config: solr.solr.home)
  2> 7975 INFO  (jetty-launcher-180-thread-4) [] o.a.s.s.CoreContainerProvider \__ \/ _ \ | '_|  Install dir: /home/jenkins/jenkins-agent/workspace/Solr/Solr-Test-10.0/solr
  2> 7975 INFO  (jetty-launcher-180-thread-4) [] o.a.s.s.CoreContainerProvider |___/\___/_|_|    Start time: 2026-09-14T19:35:00.956126746Z
  2> 7975 WARN  (jetty-launcher-180-thread-3) [] o.a.s.c.c.SolrZkClient Using default ZkCredentialsInjector. ZkCredentialsInjector is not secure, it creates an empty list of credentials which leads to 'OPEN_ACL_UNSAFE' ACLs to Zookeeper nodes
  2> 7975 INFO  (jetty-launcher-180-thread-2) [] o.a.s.s.CoreContainerProvider Solr Home: /home/jenkins/jenkins-agent/workspace/Solr/Solr-Test-10.0/build/tmp/tests-tmp/org.apache.solr.client.solrj.io.stream.StreamDecoratorTest_CABB6CE3016848EF-001/tempDir-001/node2 (source: servlet config: solr.solr.home)
  2> 7975 WARN  (jetty-launcher-180-thread-3) [] o.a.s.c.c.SolrZkClient Using default ZkACLProvider. DefaultZkACLProvider is not secure, it creates 'OPEN_ACL_UNSAFE' ACLs to Zookeeper nodes
  2> 7975 WARN  (jetty-launcher-180-thread-1) [] o.a.s.c.c.SolrZkClient Using default ZkCredentialsInjector. ZkCredentialsInjector is not secure, it creates an empty list of credentials which leads to 'OPEN_ACL_UNSAFE' ACLs to Zookeeper nodes
  2> 7975 INFO  (jetty-launcher-180-thread-4) [] o.a.s.s.CoreContainerProvider Solr Home: /home/jenkins/jenkins-agent/workspace/Solr/Solr-Test-10.0/build/tmp/tests-tmp/org.apache.solr.client.solrj.io.stream.StreamDecoratorTest_CABB6CE3016848EF-001/tempDir-001/node4 (source: servlet config: solr.solr.home)
  2> 7975 WARN  (jetty-launcher-180-thread-1) [] o.a.s.c.c.SolrZkClient Using default ZkACLProvider. DefaultZkACLProvider is not secure, it creates 'OPEN_ACL_UNSAFE' ACLs to Zookeeper nodes
  2> 7975 WARN  (jetty-launcher-180-thread-2) [] o.a.s.c.c.SolrZkClient Using default ZkCredentialsInjector. ZkCredentialsInjector is not secure, it creates an empty list of credentials which leads to 'OPEN_ACL_UNSAFE' ACLs to Zookeeper nodes
  2> 7975 WARN  (jetty-launcher-180-thread-2) [] o.a.s.c.c.SolrZkClient Using default ZkACLProvider. DefaultZkACLProvider is not secure, it creates 'OPEN_ACL_UNSAFE' ACLs to Zookeeper nodes
  2> 7975 WARN  (jetty-launcher-180-thread-4) [] o.a.s.c.c.SolrZkClient Using default ZkCredentialsInjector. ZkCredentialsInjector is not secure, it creates an empty list of credentials which leads to 'OPEN_ACL_UNSAFE' ACLs to Zookeeper nodes
  2> 7975 WARN  (jetty-launcher-180-thread-4) [] o.a.s.c.c.SolrZkClient Using default ZkACLProvider. DefaultZkACLProvider is not secure, it creates 'OPEN_ACL_UNSAFE' ACLs to Zookeeper nodes
  2> 7975 INFO  (jetty-launcher-180-thread-1) [] o.a.c.f.i.CuratorFrameworkImpl Starting
  2> 7975 INFO  (jetty-launcher-180-thread-3) [] o.a.c.f.i.CuratorFrameworkImpl Starting
  2> 7975 INFO  (jetty-launcher-180-thread-2) [] o.a.c.f.i.CuratorFrameworkImpl Starting
  2> 7975 INFO  (jetty-launcher-180-thread-4) [] o.a.c.f.i.CuratorFrameworkImpl Starting
  2> 7977 INFO  (jetty-launcher-180-thread-1) [] o.a.c.f.i.CuratorFrameworkImpl Default schema
  2> 7977 INFO  (jetty-launcher-180-thread-2) [] o.a.c.f.i.CuratorFrameworkImpl Default schema
  2> 7978 INFO  (jetty-launcher-180-thread-4) [] o.a.c.f.i.CuratorFrameworkImpl Default schema
  2> 7978 INFO  (jetty-launcher-180-thread-3) [] o.a.c.f.i.CuratorFrameworkImpl Default schema
  2> 7978 INFO  (jetty-launcher-180-thread-1-EventThread) [] o.a.c.f.s.ConnectionStateManager State change: CONNECTED
  2> 7978 INFO  (jetty-launcher-180-thread-2-EventThread) [] o.a.c.f.s.ConnectionStateManager State change: CONNECTED
  2> 7979 INFO  (jetty-launcher-180-thread-4-EventThread) [] o.a.c.f.s.ConnectionStateManager State change: CONNECTED
  2> 7979 INFO  (jetty-launcher-180-thread-3-EventThread) [] o.a.c.f.s.ConnectionStateManager State change: CONNECTED
  2> 7979 INFO  (jetty-launcher-180-thread-1-EventThread) [] o.a.c.f.i.EnsembleTracker New config event received: {}
  2> 7979 INFO  (jetty-launcher-180-thread-1-EventThread) [] o.a.c.f.i.EnsembleTracker New config event received: {}
  2> 7979 INFO  (jetty-launcher-180-thread-2-EventThread) [] o.a.c.f.i.EnsembleTracker New config event received: {}
  2> 7979 INFO  (jetty-launcher-180-thread-2-EventThread) [] o.a.c.f.i.EnsembleTracker New config event received: {}
  2> 7979 INFO  (jetty-launcher-180-thread-4-EventThread) [] o.a.c.f.i.EnsembleTracker New config event received: {}
  2> 7979 INFO  (jetty-launcher-180-thread-4-EventThread) [] o.a.c.f.i.EnsembleTracker New config event received: {}
  2> 7979 INFO  (jetty-launcher-180-thread-3-EventThread) [] o.a.c.f.i.EnsembleTracker New config event received: {}
  2> 7979 INFO  (jetty-launcher-180-thread-3-EventThread) [] o.a.c.f.i.EnsembleTracker New config event received: {}
  2> 7980 INFO  (Curator-Framework-0) [] o.a.c.f.i.CuratorFrameworkImpl backgroundOperationsLoop exiting
  2> 7980 INFO  (Curator-Framework-0) [] o.a.c.f.i.CuratorFrameworkImpl backgroundOperationsLoop exiting
  2> 7980 INFO  (Curator-Framework-0) [] o.a.c.f.i.CuratorFrameworkImpl backgroundOperationsLoop exiting
  2> 7980 INFO  (Curator-Framework-0) [] o.a.c.f.i.CuratorFrameworkImpl backgroundOperationsLoop exiting
  2> 8081 INFO  (jetty-launcher-180-thread-1) [] o.a.s.c.SolrXmlConfig Loading solr.xml from /home/jenkins/jenkins-agent/workspace/Solr/Solr-Test-10.0/build/tmp/tests-tmp/org.apache.solr.client.solrj.io.stream.StreamDecoratorTest_CABB6CE3016848EF-001/tempDir-001/node1/solr.xml
  2> 8081 INFO  (jetty-launcher-180-thread-2) [] o.a.s.c.SolrXmlConfig Loading solr.xml from /home/jenkins/jenkins-agent/workspace/Solr/Solr-Test-10.0/build/tmp/tests-tmp/org.apache.solr.client.solrj.io.stream.StreamDecoratorTest_CABB6CE3016848EF-001/tempDir-001/node2/solr.xml
  2> 8081 INFO  (jetty-launcher-180-thread-4) [] o.a.s.c.SolrXmlConfig Loading solr.xml from /home/jenkins/jenkins-agent/workspace/Solr/Solr-Test-10.0/build/tmp/tests-tmp/org.apache.solr.client.solrj.io.stream.StreamDecoratorTest_CABB6CE3016848EF-001/tempDir-001/node4/solr.xml
  2> 8082 INFO  (jetty-launcher-180-thread-3) [] o.a.s.c.SolrXmlConfig Loading solr.xml from /home/jenkins/jenkins-agent/workspace/Solr/Solr-Test-10.0/build/tmp/tests-tmp/org.apache.solr.client.solrj.io.stream.StreamDecoratorTest_CABB6CE3016848EF-001/tempDir-001/node3/solr.xml
  2> 8085 INFO  (jetty-launcher-180-thread-3) [] o.a.s.c.SolrXmlConfig Metrics collection is disabled.
  2> 8085 INFO  (jetty-launcher-180-thread-1) [] o.a.s.c.SolrXmlConfig Metrics collection is disabled.
  2> 8085 INFO  (jetty-launcher-180-thread-2) [] o.a.s.c.SolrXmlConfig Metrics collection is disabled.
  2> 8085 INFO  (jetty-launcher-180-thread-4) [] o.a.s.c.SolrXmlConfig Metrics collection is disabled.
  2> 8094 INFO  (jetty-launcher-180-thread-3) [] o.a.s.c.ZkContainer Zookeeper client=127.0.0.1:36907/solr
  2> 8095 WARN  (jetty-launcher-180-thread-3) [] o.a.s.c.c.SolrZkClient Using default ZkCredentialsInjector. ZkCredentialsInjector is not secure, it creates an empty list of credentials which leads to 'OPEN_ACL_UNSAFE' ACLs to Zookeeper nodes
  2> 8095 WARN  (jetty-launcher-180-thread-3) [] o.a.s.c.c.SolrZkClient Using default ZkACLProvider. DefaultZkACLProvider is not secure, it creates 'OPEN_ACL_UNSAFE' ACLs to Zookeeper nodes
  2> 8095 INFO  (jetty-launcher-180-thread-3) [] o.a.c.f.i.CuratorFrameworkImpl Starting
  2> 8096 INFO  (jetty-launcher-180-thread-2) [] o.a.s.c.ZkContainer Zookeeper client=127.0.0.1:36907/solr
  2> 8096 WARN  (jetty-launcher-180-thread-2) [] o.a.s.c.c.SolrZkClient Using default ZkCredentialsInjector. ZkCredentialsInjector is not secure, it creates an empty list of credentials which leads to 'OPEN_ACL_UNSAFE' ACLs to Zookeeper nodes
  2> 8096 WARN  (jetty-launcher-180-thread-2) [] o.a.s.c.c.SolrZkClient Using default ZkACLProvider. DefaultZkACLProvider is not secure, it creates 'OPEN_ACL_UNSAFE' ACLs to Zookeeper nodes
  2> 8096 INFO  (jetty-launcher-180-thread-1) [] o.a.s.c.ZkContainer Zookeeper client=127.0.0.1:36907/solr
  2> 8096 WARN  (jetty-launcher-180-thread-1) [] o.a.s.c.c.SolrZkClient Using default ZkCredentialsInjector. ZkCredentialsInjector is not secure, it creates an empty list of credentials which leads to 'OPEN_ACL_UNSAFE' ACLs to Zookeeper nodes
  2> 8096 WARN  (jetty-launcher-180-thread-1) [] o.a.s.c.c.SolrZkClient Using default ZkACLProvider. DefaultZkACLProvider is not secure, it creates 'OPEN_ACL_UNSAFE' ACLs to Zookeeper nodes
  2> 8096 INFO  (jetty-launcher-180-thread-2) [] o.a.c.f.i.CuratorFrameworkImpl Starting
  2> 8096 INFO  (jetty-launcher-180-thread-3) [] o.a.c.f.i.CuratorFrameworkImpl Default schema
  2> 8096 INFO  (jetty-launcher-180-thread-1) [] o.a.c.f.i.CuratorFrameworkImpl Starting
  2> 8096 INFO  (jetty-launcher-180-thread-4) [] o.a.s.c.ZkContainer Zookeeper client=127.0.0.1:36907/solr
  2> 8097 WARN  (jetty-launcher-180-thread-4) [] o.a.s.c.c.SolrZkClient Using default ZkCredentialsInjector. ZkCredentialsInjector is not secure, it creates an empty list of credentials which leads to 'OPEN_ACL_UNSAFE' ACLs to Zookeeper nodes
  2> 8097 WARN  (jetty-launcher-180-thread-4) [] o.a.s.c.c.SolrZkClient Using default ZkACLProvider. DefaultZkACLProvider is not secure, it creates 'OPEN_ACL_UNSAFE' ACLs to Zookeeper nodes
  2> 8097 INFO  (jetty-launcher-180-thread-4) [] o.a.c.f.i.CuratorFrameworkImpl Starting
  2> 8098 INFO  (jetty-launcher-180-thread-3-EventThread) [] o.a.c.f.s.ConnectionStateManager State change: CONNECTED
  2> 8098 INFO  (jetty-launcher-180-thread-2) [] o.a.c.f.i.CuratorFrameworkImpl Default schema
  2> 8099 INFO  (jetty-launcher-180-thread-1) [] o.a.c.f.i.CuratorFrameworkImpl Default schema
  2> 8099 INFO  (jetty-launcher-180-thread-3-EventThread) [] o.a.c.f.i.EnsembleTracker New config event received: {}
  2> 8099 INFO  (Curator-Framework-0) [] o.a.c.f.i.CuratorFrameworkImpl backgroundOperationsLoop exiting
  2> 8099 INFO  (jetty-launcher-180-thread-4) [] o.a.c.f.i.CuratorFrameworkImpl Default schema
  2> 8099 INFO  (jetty-launcher-180-thread-1-EventThread) [] o.a.c.f.s.ConnectionStateManager State change: CONNECTED
  2> 8100 INFO  (jetty-launcher-180-thread-2-EventThread) [] o.a.c.f.s.ConnectionStateManager State change: CONNECTED
  2> 8100 INFO  (jetty-launcher-180-thread-4-EventThread) [] o.a.c.f.s.ConnectionStateManager State change: CONNECTED
  2> 8100 INFO  (jetty-launcher-180-thread-1-EventThread) [] o.a.c.f.i.EnsembleTracker New config event received: {}
  2> 8100 INFO  (jetty-launcher-180-thread-1-EventThread) [] o.a.c.f.i.EnsembleTracker New config event received: {}
  2> 8100 INFO  (jetty-launcher-180-thread-2-EventThread) [] o.a.c.f.i.EnsembleTracker New config event received: {}
  2> 8100 INFO  (jetty-launcher-180-thread-2-EventThread) [] o.a.c.f.i.EnsembleTracker New config event received: {}
  2> 8100 INFO  (Curator-Framework-0) [] o.a.c.f.i.CuratorFrameworkImpl backgroundOperationsLoop exiting
  2> 8101 INFO  (Curator-Framework-0) [] o.a.c.f.i.CuratorFrameworkImpl backgroundOperationsLoop exiting
  2> 8101 INFO  (jetty-launcher-180-thread-4-EventThread) [] o.a.c.f.i.EnsembleTracker New config event received: {}
  2> 8101 INFO  (jetty-launcher-180-thread-4-EventThread) [] o.a.c.f.i.EnsembleTracker New config event received: {}
  2> 8101 INFO  (Curator-Framework-0) [] o.a.c.f.i.CuratorFrameworkImpl backgroundOperationsLoop exiting
  2> 8201 INFO  (jetty-launcher-180-thread-3) [n:127.0.0.1:42991_solr] o.a.c.f.i.CuratorFrameworkImpl Starting
  2> 8202 INFO  (jetty-launcher-180-thread-4) [n:127.0.0.1:43521_solr] o.a.c.f.i.CuratorFrameworkImpl Starting
  2> 8202 INFO  (jetty-launcher-180-thread-1) [n:127.0.0.1:45399_solr] o.a.c.f.i.CuratorFrameworkImpl Starting
  2> 8202 INFO  (jetty-launcher-180-thread-2) [n:127.0.0.1:44081_solr] o.a.c.f.i.CuratorFrameworkImpl Starting
  2> 8219 INFO  (jetty-launcher-180-thread-3) [n:127.0.0.1:42991_solr] o.a.c.f.i.CuratorFrameworkImpl Default schema
  2> 8220 INFO  (jetty-launcher-180-thread-3-EventThread) [] o.a.c.f.s.ConnectionStateManager State change: CONNECTED
  2> 8220 INFO  (jetty-launcher-180-thread-4) [n:127.0.0.1:43521_solr] o.a.c.f.i.CuratorFrameworkImpl Default schema
  2> 8221 INFO  (jetty-launcher-180-thread-1) [n:127.0.0.1:45399_solr] o.a.c.f.i.CuratorFrameworkImpl Default schema
  2> 8221 INFO  (jetty-launcher-180-thread-3-EventThread) [] o.a.c.f.i.EnsembleTracker New config event received: {}
  2> 8221 INFO  (jetty-launcher-180-thread-3-EventThread) [] o.a.c.f.i.EnsembleTracker New config event received: {}
  2> 8221 INFO  (jetty-launcher-180-thread-2) [n:127.0.0.1:44081_solr] o.a.c.f.i.CuratorFrameworkImpl Default schema
  2> 8221 INFO  (jetty-launcher-180-thread-4-EventThread) [] o.a.c.f.s.ConnectionStateManager State change: CONNECTED
  2> 8222 INFO  (jetty-launcher-180-thread-1-EventThread) [] o.a.c.f.s.ConnectionStateManager State change: CONNECTED
  2> 8222 INFO  (jetty-launcher-180-thread-2-EventThread) [] o.a.c.f.s.ConnectionStateManager State change: CONNECTED
  2> 8222 INFO  (jetty-launcher-180-thread-4-EventThread) [] o.a.c.f.i.EnsembleTracker New config event received: {}
  2> 8222 INFO  (jetty-launcher-180-thread-4-EventThread) [] o.a.c.f.i.EnsembleTracker New config event received: {}
  2> 8222 INFO  (jetty-launcher-180-thread-1-EventThread) [] o.a.c.f.i.EnsembleTracker New config event received: {}
  2> 8222 INFO  (jetty-launcher-180-thread-1-EventThread) [] o.a.c.f.i.EnsembleTracker New config event received: {}
  2> 8222 INFO  (jetty-launcher-180-thread-2-EventThread) [] o.a.c.f.i.EnsembleTracker New config event received: {}
  2> 8223 INFO  (jetty-launcher-180-thread-2-EventThread) [] o.a.c.f.i.EnsembleTracker New config event received: {}
  2> 8244 WARN  (jetty-launcher-180-thread-3) [n:127.0.0.1:42991_solr] o.a.s.c.ZkController Contents of zookeeper /security.json are world-readable; consider setting up ACLs as described in https://solr.apache.org/guide/solr/latest/deployment-guide/zookeeper-access-control.html
  2> 8244 WARN  (jetty-launcher-180-thread-2) [n:127.0.0.1:44081_solr] o.a.s.c.ZkController Contents of zookeeper /security.json are world-readable; consider setting up ACLs as described in https://solr.apache.org/guide/solr/latest/deployment-guide/zookeeper-access-control.html
  2> 8244 WARN  (jetty-launcher-180-thread-1) [n:127.0.0.1:45399_solr] o.a.s.c.ZkController Contents of zookeeper /security.json are world-readable; consider setting up ACLs as described in https://solr.apache.org/guide/solr/latest/deployment-guide/zookeeper-access-control.html
  2> 8244 WARN  (jetty-launcher-180-thread-4) [n:127.0.0.1:43521_solr] o.a.s.c.ZkController Contents of zookeeper /security.json are world-readable; consider setting up ACLs as described in https://solr.apache.org/guide/solr/latest/deployment-guide/zookeeper-access-control.html
  2> 8247 INFO  (jetty-launcher-180-thread-3) [n:127.0.0.1:42991_solr] o.a.s.c.ZkController The Overseer is enabled.  It will process all cluster commands & state updates.
  2> 8247 INFO  (jetty-launcher-180-thread-2) [n:127.0.0.1:44081_solr] o.a.s.c.ZkController The Overseer is enabled.  It will process all cluster commands & state updates.
  2> 8247 INFO  (jetty-launcher-180-thread-4) [n:127.0.0.1:43521_solr] o.a.s.c.ZkController The Overseer is enabled.  It will process all cluster commands & state updates.
  2> 8248 INFO  (jetty-launcher-180-thread-1) [n:127.0.0.1:45399_solr] o.a.s.c.ZkController The Overseer is enabled.  It will process all cluster commands & state updates.
  2> 8251 INFO  (jetty-launcher-180-thread-1) [n:127.0.0.1:45399_solr] o.a.s.c.OverseerElectionContext I am going to be the leader 127.0.0.1:45399_solr
  2> 8251 INFO  (jetty-launcher-180-thread-3) [n:127.0.0.1:42991_solr] o.a.s.c.ZkController Register node as live in ZooKeeper: /live_nodes/127.0.0.1:42991_solr
  2> 8252 INFO  (jetty-launcher-180-thread-1) [n:127.0.0.1:45399_solr] o.a.s.c.Overseer Overseer (id=72077749887238157-127.0.0.1:45399_solr-n_0000000000) starting
  2> 8252 INFO  (jetty-launcher-180-thread-4) [n:127.0.0.1:43521_solr] o.a.s.c.ZkController Register node as live in ZooKeeper: /live_nodes/127.0.0.1:43521_solr
  2> 8252 INFO  (jetty-launcher-180-thread-2) [n:127.0.0.1:44081_solr] o.a.s.c.ZkController Register node as live in ZooKeeper: /live_nodes/127.0.0.1:44081_solr
  2> 8253 INFO  (zkCallback-242-thread-1) [] o.a.s.c.c.ZkStateReader Updated live nodes from ZooKeeper... (0) -> (3)
  2> 8253 INFO  (zkCallback-247-thread-1) [] o.a.s.c.c.ZkStateReader Updated live nodes from ZooKeeper... (0) -> (3)
  2> 8254 INFO  (zkCallback-244-thread-1) [] o.a.s.c.c.ZkStateReader Updated live nodes from ZooKeeper... (0) -> (3)
  2> 8254 INFO  (zkCallback-238-thread-1) [] o.a.s.c.c.ZkStateReader Updated live nodes from ZooKeeper... (0) -> (3)
  2> 8258 INFO  (jetty-launcher-180-thread-1) [n:127.0.0.1:45399_solr] o.a.s.c.ZkController Publish node=127.0.0.1:45399_solr as DOWN
  2> 8258 INFO  (OverseerStateUpdate-72077749887238157-127.0.0.1:45399_solr-n_0000000000) [n:127.0.0.1:45399_solr] o.a.s.c.Overseer Starting to work on the main queue : 127.0.0.1:45399_solr
  2> 8258 WARN  (jetty-launcher-180-thread-3) [n:127.0.0.1:42991_solr] o.a.s.c.CoreContainer Not all security plugins configured!  authentication=disabled authorization=disabled.  Solr is only as secure as you make it. Consider configuring authentication/authorization before exposing Solr to users internal or external.  See https://s.apache.org/solrsecurity for more info
  2> 8258 WARN  (jetty-launcher-180-thread-2) [n:127.0.0.1:44081_solr] o.a.s.c.CoreContainer Not all security plugins configured!  authentication=disabled authorization=disabled.  Solr is only as secure as you make it. Consider configuring authentication/authorization before exposing Solr to users internal or external.  See https://s.apache.org/solrsecurity for more info
  2> 8258 WARN  (jetty-launcher-180-thread-4) [n:127.0.0.1:43521_solr] o.a.s.c.CoreContainer Not all security plugins configured!  authentication=disabled authorization=disabled.  Solr is only as secure as you make it. Consider configuring authentication/authorization before exposing Solr to users internal or external.  See https://s.apache.org/solrsecurity for more info
  2> 8260 INFO  (jetty-launcher-180-thread-1) [n:127.0.0.1:45399_solr] o.a.s.c.ZkController Register node as live in ZooKeeper: /live_nodes/127.0.0.1:45399_solr
  2> 8261 INFO  (zkCallback-244-thread-1) [] o.a.s.c.c.ZkStateReader Updated live nodes from ZooKeeper... (3) -> (4)
  2> 8261 INFO  (zkCallback-242-thread-1) [] o.a.s.c.c.ZkStateReader Updated live nodes from ZooKeeper... (3) -> (4)
  2> 8261 INFO  (zkCallback-238-thread-1) [] o.a.s.c.c.ZkStateReader Updated live nodes from ZooKeeper... (3) -> (4)
  2> 8261 INFO  (zkCallback-247-thread-1) [] o.a.s.c.c.ZkStateReader Updated live nodes from ZooKeeper... (3) -> (4)
  2> 8264 WARN  (jetty-launcher-180-thread-1) [n:127.0.0.1:45399_solr] o.a.s.c.CoreContainer Not all security plugins configured!  authentication=disabled authorization=disabled.  Solr is only as secure as you make it. Consider configuring authentication/authorization before exposing Solr to users internal or external.  See https://s.apache.org/solrsecurity for more info
  2> 8285 INFO  (jetty-launcher-180-thread-1) [n:127.0.0.1:45399_solr] o.a.s.c.CorePropertiesLocator Found 0 core definitions underneath /home/jenkins/jenkins-agent/workspace/Solr/Solr-Test-10.0/build/tmp/tests-tmp/org.apache.solr.client.solrj.io.stream.StreamDecoratorTest_CABB6CE3016848EF-001/tempDir-001/node1
  2> 8326 INFO  (jetty-launcher-180-thread-1) [n:127.0.0.1:45399_solr] o.a.s.j.SolrRequestAuthorizer Creating a new SolrRequestAuthorizer
  2> 8340 INFO  (jetty-launcher-180-thread-1) [n:127.0.0.1:45399_solr] o.e.j.e.s.ServletContextHandler Started oeje10s.ServletContextHandler@146f7a80{/solr,/solr,b=file:///home/jenkins/jenkins-agent/workspace/Solr/Solr-Test-10.0/solr/solrj-streaming/build/tmp/tests-cwd/,a=AVAILABLE,h=oeje10s.SessionHandler@69008f54{STARTED}}
  2> 8341 INFO  (jetty-launcher-180-thread-3) [n:127.0.0.1:42991_solr] o.a.s.c.CorePropertiesLocator Found 0 core definitions underneath /home/jenkins/jenkins-agent/workspace/Solr/Solr-Test-10.0/build/tmp/tests-tmp/org.apache.solr.client.solrj.io.stream.StreamDecoratorTest_CABB6CE3016848EF-001/tempDir-001/node3
  2> 8341 INFO  (jetty-launcher-180-thread-1) [n:127.0.0.1:45399_solr] o.e.j.s.AbstractConnector Started ServerConnector@241f6df3{HTTP/1.1, (http/1.1, h2c)}{127.0.0.1:45399}
  2> 8341 INFO  (jetty-launcher-180-thread-1) [n:127.0.0.1:45399_solr] o.e.j.s.Server Started oejs.Server@378bc45f{STARTING}[12.0.27,sto=15000] @8361ms
  2> 8354 INFO  (jetty-launcher-180-thread-4) [n:127.0.0.1:43521_solr] o.a.s.c.CorePropertiesLocator Found 0 core definitions underneath /home/jenkins/jenkins-agent/workspace/Solr/Solr-Test-10.0/build/tmp/tests-tmp/org.apache.solr.client.solrj.io.stream.StreamDecoratorTest_CABB6CE3016848EF-001/tempDir-001/node4
  2> 8356 INFO  (jetty-launcher-180-thread-2) [n:127.0.0.1:44081_solr] o.a.s.c.CorePropertiesLocator Found 0 core definitions underneath /home/jenkins/jenkins-agent/workspace/Solr/Solr-Test-10.0/build/tmp/tests-tmp/org.apache.solr.client.solrj.io.stream.StreamDecoratorTest_CABB6CE3016848EF-001/tempDir-001/node2
  2> 8380 INFO  (jetty-launcher-180-thread-3) [n:127.0.0.1:42991_solr] o.a.s.j.SolrRequestAuthorizer Creating a new SolrRequestAuthorizer
  2> 8395 INFO  (jetty-launcher-180-thread-4) [n:127.0.0.1:43521_solr] o.a.s.j.SolrRequestAuthorizer Creating a new SolrRequestAuthorizer
  2> 8396 INFO  (jetty-launcher-180-thread-3) [n:127.0.0.1:42991_solr] o.e.j.e.s.ServletContextHandler Started oeje10s.ServletContextHandler@57fa4df3{/solr,/solr,b=file:///home/jenkins/jenkins-agent/workspace/Solr/Solr-Test-10.0/solr/solrj-streaming/build/tmp/tests-cwd/,a=AVAILABLE,h=oeje10s.SessionHandler@4ee1558d{STARTED}}
  2> 8396 INFO  (jetty-launcher-180-thread-3) [n:127.0.0.1:42991_solr] o.e.j.s.AbstractConnector Started ServerConnector@32d8a819{HTTP/1.1, (http/1.1, h2c)}{127.0.0.1:42991}
  2> 8396 INFO  (jetty-launcher-180-thread-3) [n:127.0.0.1:42991_solr] o.e.j.s.Server Started oejs.Server@3b00658e{STARTING}[12.0.27,sto=15000] @8417ms
  2> 8396 INFO  (jetty-launcher-180-thread-2) [n:127.0.0.1:44081_solr] o.a.s.j.SolrRequestAuthorizer Creating a new SolrRequestAuthorizer
  2> 8410 INFO  (jetty-launcher-180-thread-4) [n:127.0.0.1:43521_solr] o.e.j.e.s.ServletContextHandler Started oeje10s.ServletContextHandler@2e3d765f{/solr,/solr,b=file:///home/jenkins/jenkins-agent/workspace/Solr/Solr-Test-10.0/solr/solrj-streaming/build/tmp/tests-cwd/,a=AVAILABLE,h=oeje10s.SessionHandler@42f97990{STARTED}}
  2> 8411 INFO  (jetty-launcher-180-thread-4) [n:127.0.0.1:43521_solr] o.e.j.s.AbstractConnector Started ServerConnector@30cab6b2{HTTP/1.1, (http/1.1, h2c)}{127.0.0.1:43521}
  2> 8411 INFO  (jetty-launcher-180-thread-4) [n:127.0.0.1:43521_solr] o.e.j.s.Server Started oejs.Server@53664c9{STARTING}[12.0.27,sto=15000] @8431ms
  2> 8411 INFO  (jetty-launcher-180-thread-2) [n:127.0.0.1:44081_solr] o.e.j.e.s.ServletContextHandler Started oeje10s.ServletContextHandler@68d83b1c{/solr,/solr,b=file:///home/jenkins/jenkins-agent/workspace/Solr/Solr-Test-10.0/solr/solrj-streaming/build/tmp/tests-cwd/,a=AVAILABLE,h=oeje10s.SessionHandler@595ca2ee{STARTED}}
  2> 8412 INFO  (jetty-launcher-180-thread-2) [n:127.0.0.1:44081_solr] o.e.j.s.AbstractConnector Started ServerConnector@339b77ea{HTTP/1.1, (http/1.1, h2c)}{127.0.0.1:44081}
  2> 8412 INFO  (jetty-launcher-180-thread-2) [n:127.0.0.1:44081_solr] o.e.j.s.Server Started oejs.Server@6ffdbed4{STARTING}[12.0.27,sto=15000] @8432ms
  2> 8413 INFO  (SUITE-StreamDecoratorTest-seed#[CABB6CE3016848EF]-worker) [] o.a.s.c.MiniSolrCloudCluster waitForAllNodes: numServers=4
  2> 8413 INFO  (SUITE-StreamDecoratorTest-seed#[CABB6CE3016848EF]-worker) [] o.a.s.c.MiniSolrCloudCluster waitForNode: 127.0.0.1:45399_solr
  2> 8413 WARN  (SUITE-StreamDecoratorTest-seed#[CABB6CE3016848EF]-worker) [] o.a.s.c.c.SolrZkClient Using default ZkCredentialsInjector. ZkCredentialsInjector is not secure, it creates an empty list of credentials which leads to 'OPEN_ACL_UNSAFE' ACLs to Zookeeper nodes
  2> 8413 WARN  (SUITE-StreamDecoratorTest-seed#[CABB6CE3016848EF]-worker) [] o.a.s.c.c.SolrZkClient Using default ZkACLProvider. DefaultZkACLProvider is not secure, it creates 'OPEN_ACL_UNSAFE' ACLs to Zookeeper nodes
  2> 8414 INFO  (SUITE-StreamDecoratorTest-seed#[CABB6CE3016848EF]-worker) [] o.a.c.f.i.CuratorFrameworkImpl Starting
  2> 8415 INFO  (SUITE-StreamDecoratorTest-seed#[CABB6CE3016848EF]-worker) [] o.a.c.f.i.CuratorFrameworkImpl Default schema
  2> 8416 INFO  (SUITE-StreamDecoratorTest-seed#[CABB6CE3016848EF]-worker-EventThread) [] o.a.c.f.s.ConnectionStateManager State change: CONNECTED
  2> 8416 INFO  (SUITE-StreamDecoratorTest-seed#[CABB6CE3016848EF]-worker-EventThread) [] o.a.c.f.i.EnsembleTracker New config event received: {}
  2> 8416 INFO  (SUITE-StreamDecoratorTest-seed#[CABB6CE3016848EF]-worker-EventThread) [] o.a.c.f.i.EnsembleTracker New config event received: {}
  2> 8417 INFO  (SUITE-StreamDecoratorTest-seed#[CABB6CE3016848EF]-worker) [] o.a.s.c.c.ZkStateReader Updated live nodes from ZooKeeper... (0) -> (4)
  2> 8418 INFO  (SUITE-StreamDecoratorTest-seed#[CABB6CE3016848EF]-worker) [] o.a.s.c.s.i.ZkClientClusterStateProvider Cluster at 127.0.0.1:36907/solr ready
  2> 8418 INFO  (SUITE-StreamDecoratorTest-seed#[CABB6CE3016848EF]-worker) [] o.a.s.c.MiniSolrCloudCluster waitForNode: 127.0.0.1:42991_solr
  2> 8418 INFO  (SUITE-StreamDecoratorTest-seed#[CABB6CE3016848EF]-worker) [] o.a.s.c.MiniSolrCloudCluster waitForNode: 127.0.0.1:43521_solr
  2> 8418 INFO  (SUITE-StreamDecoratorTest-seed#[CABB6CE3016848EF]-worker) [] o.a.s.c.MiniSolrCloudCluster waitForNode: 127.0.0.1:44081_solr
  2> 8419 WARN  (SUITE-StreamDecoratorTest-seed#[CABB6CE3016848EF]-worker) [] o.a.s.c.c.SolrZkClient Using default ZkCredentialsInjector. ZkCredentialsInjector is not secure, it creates an empty list of credentials which leads to 'OPEN_ACL_UNSAFE' ACLs to Zookeeper nodes
  2> 8419 WARN  (SUITE-StreamDecoratorTest-seed#[CABB6CE3016848EF]-worker) [] o.a.s.c.c.SolrZkClient Using default ZkACLProvider. DefaultZkACLProvider is not secure, it creates 'OPEN_ACL_UNSAFE' ACLs to Zookeeper nodes
  2> 8419 INFO  (SUITE-StreamDecoratorTest-seed#[CABB6CE3016848EF]-worker) [] o.a.c.f.i.CuratorFrameworkImpl Starting
  2> 8420 INFO  (SUITE-StreamDecoratorTest-seed#[CABB6CE3016848EF]-worker) [] o.a.c.f.i.CuratorFrameworkImpl Default schema
  2> 8421 INFO  (SUITE-StreamDecoratorTest-seed#[CABB6CE3016848EF]-worker-EventThread) [] o.a.c.f.s.ConnectionStateManager State change: CONNECTED
  2> 8421 INFO  (SUITE-StreamDecoratorTest-seed#[CABB6CE3016848EF]-worker-EventThread) [] o.a.c.f.i.EnsembleTracker New config event received: {}
  2> 8422 INFO  (SUITE-StreamDecoratorTest-seed#[CABB6CE3016848EF]-worker-EventThread) [] o.a.c.f.i.EnsembleTracker New config event received: {}
  2> 8425 INFO  (Curator-Framework-0) [] o.a.c.f.i.CuratorFrameworkImpl backgroundOperationsLoop exiting
  2> 8526 WARN  (SUITE-StreamDecoratorTest-seed#[CABB6CE3016848EF]-worker) [] o.a.s.c.c.SolrZkClient Using default ZkCredentialsInjector. ZkCredentialsInjector is not secure, it creates an empty list of credentials which leads to 'OPEN_ACL_UNSAFE' ACLs to Zookeeper nodes
  2> 8526 WARN  (SUITE-StreamDecoratorTest-seed#[CABB6CE3016848EF]-worker) [] o.a.s.c.c.SolrZkClient Using default ZkACLProvider. DefaultZkACLProvider is not secure, it creates 'OPEN_ACL_UNSAFE' ACLs to Zookeeper nodes
  2> 8527 INFO  (SUITE-StreamDecoratorTest-seed#[CABB6CE3016848EF]-worker) [] o.a.c.f.i.CuratorFrameworkImpl Starting
  2> 8528 INFO  (SUITE-StreamDecoratorTest-seed#[CABB6CE3016848EF]-worker) [] o.a.c.f.i.CuratorFrameworkImpl Default schema
  2> 8529 INFO  (SUITE-StreamDecoratorTest-seed#[CABB6CE3016848EF]-worker-EventThread) [] o.a.c.f.s.ConnectionStateManager State change: CONNECTED
  2> 8529 INFO  (SUITE-StreamDecoratorTest-seed#[CABB6CE3016848EF]-worker-EventThread) [] o.a.c.f.i.EnsembleTracker New config event received: {}
  2> 8529 INFO  (SUITE-StreamDecoratorTest-seed#[CABB6CE3016848EF]-worker-EventThread) [] o.a.c.f.i.EnsembleTracker New config event received: {}
  2> 8532 INFO  (Curator-Framework-0) [] o.a.c.f.i.CuratorFrameworkImpl backgroundOperationsLoop exiting
  2> 8644 INFO  (OverseerThreadFactory-259-thread-1) [ c:collection1_collection t:null-32] o.a.s.c.a.c.CreateCollectionCmd Create collection collection1_collection
  2> 8644 INFO  (OverseerThreadFactory-259-thread-1) [ c:collection1_collection t:null-32] o.a.s.c.a.c.CreateCollectionCmd solr.cloud.prs.enabled : false and collection prs : null, isPRS : false
  2> 8648 INFO  (OverseerThreadFactory-259-thread-1) [ c:collection1_collection t:null-32] o.a.s.c.c.ZkStateReader /collections/collection1_collection/state.json is deleted, stop watching children
  2> 8649 INFO  (zkCallback-242-thread-1) [] o.a.s.c.c.ZkStateReader A cluster state change: [WatchedEvent state:SyncConnected type:NodeCreated path:/collections/collection1_collection/state.json zxid: -1] for collection [collection1_collection] has occurred - updating... (live nodes size: [4])
  2> 8655 INFO  (OverseerStateUpdate-72077749887238157-127.0.0.1:45399_solr-n_0000000000) [n:127.0.0.1:45399_solr] o.a.s.c.o.SliceMutator createReplica() {
  2>   "core":"collection1_collection_shard1_replica_n1",
  2>   "node_name":"127.0.0.1:44081_solr",
  2>   "base_url":"http://127.0.0.1:44081/solr",
  2>   "collection":"collection1_collection",
  2>   "shard":"shard1",
  2>   "state":"down",
  2>   "type":"NRT",
  2>   "operation":"ADDREPLICA",
  2>   "waitForFinalState":"false"} 
  2> 8657 INFO  (OverseerStateUpdate-72077749887238157-127.0.0.1:45399_solr-n_0000000000) [n:127.0.0.1:45399_solr] o.a.s.c.o.SliceMutator createReplica() {
  2>   "core":"collection1_collection_shard2_replica_n2",
  2>   "node_name":"127.0.0.1:43521_solr",
  2>   "base_url":"http://127.0.0.1:43521/solr",
  2>   "collection":"collection1_collection",
  2>   "shard":"shard2",
  2>   "state":"down",
  2>   "type":"NRT",
  2>   "operation":"ADDREPLICA",
  2>   "waitForFinalState":"false"} 
  2> 8760 INFO  (zkCallback-242-thread-1) [] o.a.s.c.c.ZkStateReader A cluster state change: [WatchedEvent state:SyncConnected type:NodeDataChanged path:/collections/collection1_collection/state.json zxid: -1] for collection [collection1_collection] has occurred - updating... (live nodes size: [4])
  2> 8766 INFO  (qtp230108576-389-null-32) [n:127.0.0.1:44081_solr x:collection1_collection_shard1_replica_n1 t:null-32] o.a.s.h.a.a.CreateCore core create command "org.apache.solr.client.api.model.CreateCoreParams@392d163a"
  2> 8767 INFO  (qtp839231348-383-null-32) [n:127.0.0.1:43521_solr x:collection1_collection_shard2_replica_n2 t:null-32] o.a.s.h.a.a.CreateCore core create command "org.apache.solr.client.api.model.CreateCoreParams@7ef3644"
  2> 8778 INFO  (qtp230108576-389-null-32) [n:127.0.0.1:44081_solr c:collection1_collection s:shard1 r:core_node3 x:collection1_collection_shard1_replica_n1 t:null-32] o.a.s.c.SolrConfig Using Lucene MatchVersion: 10.3.2
  2> 8778 INFO  (qtp839231348-383-null-32) [n:127.0.0.1:43521_solr c:collection1_collection s:shard2 r:core_node4 x:collection1_collection_shard2_replica_n2 t:null-32] o.a.s.c.SolrConfig Using Lucene MatchVersion: 10.3.2
  2> 8785 INFO  (qtp839231348-383-null-32) [n:127.0.0.1:43521_solr c:collection1_collection s:shard2 r:core_node4 x:collection1_collection_shard2_replica_n2 t:null-32] o.a.s.s.IndexSchema Schema name=test
  2> 8785 INFO  (qtp230108576-389-null-32) [n:127.0.0.1:44081_solr c:collection1_collection s:shard1 r:core_node3 x:collection1_collection_shard1_replica_n1 t:null-32] o.a.s.s.IndexSchema Schema name=test
  2> 8797 WARN  (qtp839231348-383-null-32) [n:127.0.0.1:43521_solr c:collection1_collection s:shard2 r:core_node4 x:collection1_collection_shard2_replica_n2 t:null-32] o.a.s.s.IndexSchema Field lowerfilt1and2 is not multivalued and destination for multiple copyFields (2)
  2> 8797 WARN  (qtp230108576-389-null-32) [n:127.0.0.1:44081_solr c:collection1_collection s:shard1 r:core_node3 x:collection1_collection_shard1_replica_n1 t:null-32] o.a.s.s.IndexSchema Field lowerfilt1and2 is not multivalued and destination for multiple copyFields (2)
  2> 8797 WARN  (qtp839231348-383-null-32) [n:127.0.0.1:43521_solr c:collection1_collection s:shard2 r:core_node4 x:collection1_collection_shard2_replica_n2 t:null-32] o.a.s.s.IndexSchema Field text is not multivalued and destination for multiple copyFields (3)
  2> 8797 WARN  (qtp230108576-389-null-32) [n:127.0.0.1:44081_solr c:collection1_collection s:shard1 r:core_node3 x:collection1_collection_shard1_replica_n1 t:null-32] o.a.s.s.IndexSchema Field text is not multivalued and destination for multiple copyFields (3)
  2> 8797 INFO  (qtp839231348-383-null-32) [n:127.0.0.1:43521_solr c:collection1_collection s:shard2 r:core_node4 x:collection1_collection_shard2_replica_n2 t:null-32] o.a.s.s.IndexSchema Loaded schema test/1.7 with uniqueid field id
  2> 8797 INFO  (qtp230108576-389-null-32) [n:127.0.0.1:44081_solr c:collection1_collection s:shard1 r:core_node3 x:collection1_collection_shard1_replica_n1 t:null-32] o.a.s.s.IndexSchema Loaded schema test/1.7 with uniqueid field id
  2> 8797 INFO  (qtp839231348-383-null-32) [n:127.0.0.1:43521_solr c:collection1_collection s:shard2 r:core_node4 x:collection1_collection_shard2_replica_n2 t:null-32] o.a.s.c.CoreContainer Creating SolrCore 'collection1_collection_shard2_replica_n2' using configuration from configset conf
  2> 8797 INFO  (qtp230108576-389-null-32) [n:127.0.0.1:44081_solr c:collection1_collection s:shard1 r:core_node3 x:collection1_collection_shard1_replica_n1 t:null-32] o.a.s.c.CoreContainer Creating SolrCore 'collection1_collection_shard1_replica_n1' using configuration from configset conf
  2> 8798 INFO  (qtp230108576-389-null-32) [n:127.0.0.1:44081_solr c:collection1_collection s:shard1 r:core_node3 x:collection1_collection_shard1_replica_n1 t:null-32] o.a.s.c.SolrCore Opening new SolrCore at [/home/jenkins/jenkins-agent/workspace/Solr/Solr-Test-10.0/build/tmp/tests-tmp/org.apache.solr.client.solrj.io.stream.StreamDecoratorTest_CABB6CE3016848EF-001/tempDir-001/node2/collection1_collection_shard1_replica_n1], dataDir=[/home/jenkins/jenkins-agent/workspace/Solr/Solr-Test-10.0/build/tmp/tests-tmp/org.apache.solr.client.solrj.io.stream.StreamDecoratorTest_CABB6CE3016848EF-001/tempDir-001/node2/collection1_collection_shard1_replica_n1/data/]
  2> 8798 INFO  (qtp839231348-383-null-32) [n:127.0.0.1:43521_solr c:collection1_collection s:shard2 r:core_node4 x:collection1_collection_shard2_replica_n2 t:null-32] o.a.s.c.SolrCore Opening new SolrCore at [/home/jenkins/jenkins-agent/workspace/Solr/Solr-Test-10.0/build/tmp/tests-tmp/org.apache.solr.client.solrj.io.stream.StreamDecoratorTest_CABB6CE3016848EF-001/tempDir-001/node4/collection1_collection_shard2_replica_n2], dataDir=[/home/jenkins/jenkins-agent/workspace/Solr/Solr-Test-10.0/build/tmp/tests-tmp/org.apache.solr.clie

[...truncated too long message...]

 NO-SOURCE
> Task :solr:modules:scripting:classes

> Task :solr:modules:scripting:compileTestJava
Note: Some input files use or override a deprecated API.
Note: Recompile with -Xlint:deprecation for details.

> Task :solr:modules:scripting:processTestResources
> Task :solr:modules:scripting:testClasses

> Task :solr:modules:scripting:test
WARNING: Using incubator modules: jdk.incubator.vector
WARNING: Using incubator modules: jdk.incubator.vector
WARNING: Using incubator modules: jdk.incubator.vector
WARNING: Using incubator modules: jdk.incubator.vector
WARNING: A command line option has enabled the Security Manager
WARNING: The Security Manager is deprecated and will be removed in a future release
WARNING: A command line option has enabled the Security Manager
WARNING: The Security Manager is deprecated and will be removed in a future release
WARNING: A command line option has enabled the Security Manager
WARNING: The Security Manager is deprecated and will be removed in a future release
WARNING: A command line option has enabled the Security Manager
WARNING: The Security Manager is deprecated and will be removed in a future release
java.security.policy: error adding Permission, java.net.URLPermission:
	java.util.ServiceConfigurationError: Locale provider adapter "CLDR"cannot be instantiated.
java.security.policy: error adding Permission, java.net.URLPermission:
	java.util.ServiceConfigurationError: Locale provider adapter "CLDR"cannot be instantiated.
java.security.policy: error adding Permission, java.net.URLPermission:
	java.util.ServiceConfigurationError: Locale provider adapter "CLDR"cannot be instantiated.
java.security.policy: error adding Permission, java.net.URLPermission:
	java.util.ServiceConfigurationError: Locale provider adapter "CLDR"cannot be instantiated.
java.security.policy: error adding Permission, java.net.URLPermission:
	java.util.ServiceConfigurationError: Locale provider adapter "CLDR"cannot be instantiated.
java.security.policy: error adding Permission, java.net.URLPermission:
	java.util.ServiceConfigurationError: Locale provider adapter "CLDR"cannot be instantiated.
java.security.policy: error adding Permission, java.net.URLPermission:
	java.util.ServiceConfigurationError: Locale provider adapter "CLDR"cannot be instantiated.
java.security.policy: error adding Permission, java.net.URLPermission:
	java.util.ServiceConfigurationError: Locale provider adapter "CLDR"cannot be instantiated.
java.security.policy: error adding Permission, java.net.URLPermission:
	java.util.ServiceConfigurationError: Locale provider adapter "CLDR"cannot be instantiated.
java.security.policy: error adding Permission, java.net.URLPermission:
	java.util.ServiceConfigurationError: Locale provider adapter "CLDR"cannot be instantiated.
java.security.policy: error adding Permission, java.net.URLPermission:
	java.util.ServiceConfigurationError: Locale provider adapter "CLDR"cannot be instantiated.
java.security.policy: error adding Permission, java.net.URLPermission:
	java.util.ServiceConfigurationError: Locale provider adapter "CLDR"cannot be instantiated.
:solr:modules:scripting:test (SUCCESS): 22 test(s), 17 skipped

> Task :solr:modules:scripting:wipeTaskTemp

> Task :solr:modules:sql:compileTestJava
Note: Some input files use or override a deprecated API.
Note: Recompile with -Xlint:deprecation for details.

> Task :solr:modules:sql:copySolrCoreTestResources
> Task :solr:modules:sql:processTestResources
> Task :solr:modules:sql:testClasses

> Task :solr:modules:sql:test
WARNING: Using incubator modules: jdk.incubator.vector
WARNING: Using incubator modules: jdk.incubator.vector
WARNING: Using incubator modules: jdk.incubator.vector
WARNING: A command line option has enabled the Security Manager
WARNING: The Security Manager is deprecated and will be removed in a future release
WARNING: A command line option has enabled the Security Manager
WARNING: The Security Manager is deprecated and will be removed in a future release
WARNING: A command line option has enabled the Security Manager
WARNING: The Security Manager is deprecated and will be removed in a future release
java.security.policy: error adding Permission, java.net.URLPermission:
	java.util.ServiceConfigurationError: Locale provider adapter "CLDR"cannot be instantiated.
java.security.policy: error adding Permission, java.net.URLPermission:
	java.util.ServiceConfigurationError: Locale provider adapter "CLDR"cannot be instantiated.
java.security.policy: error adding Permission, java.net.URLPermission:
	java.util.ServiceConfigurationError: Locale provider adapter "CLDR"cannot be instantiated.
java.security.policy: error adding Permission, java.net.URLPermission:
	java.util.ServiceConfigurationError: Locale provider adapter "CLDR"cannot be instantiated.
java.security.policy: error adding Permission, java.net.URLPermission:
	java.util.ServiceConfigurationError: Locale provider adapter "CLDR"cannot be instantiated.
java.security.policy: error adding Permission, java.net.URLPermission:
	java.util.ServiceConfigurationError: Locale provider adapter "CLDR"cannot be instantiated.
java.security.policy: error adding Permission, java.net.URLPermission:
	java.util.ServiceConfigurationError: Locale provider adapter "CLDR"cannot be instantiated.
java.security.policy: error adding Permission, java.net.URLPermission:
	java.util.ServiceConfigurationError: Locale provider adapter "CLDR"cannot be instantiated.
java.security.policy: error adding Permission, java.net.URLPermission:
	java.util.ServiceConfigurationError: Locale provider adapter "CLDR"cannot be instantiated.
:solr:modules:sql:test (SUCCESS): 33 test(s)

> Task :solr:modules:sql:wipeTaskTemp
The slowest tests (exceeding 500 ms) during this run:
  7179.51s StreamDecoratorTest.testParallelDaemonCommitStream (:solr:solrj-streaming)
  90.51s BasicDistributedZkTest.test (:solr:core)
  66.58s TestCpuAllowedLimit.testDistribLimit2 (:solr:core)
  57.02s TestCpuAllowedLimit.testDistribLimit (:solr:core)
  54.30s PeerSyncReplicationTest.test (:solr:core)
  48.25s SyncSliceTest.test (:solr:core)
  47.43s TestInPlaceUpdatesDistrib.test (:solr:core)
  47.37s ReplicationFactorTest.test (:solr:core)
  45.79s TestRandomCollapseQParserPlugin.testRandomCollapseWithSort (:solr:core)
  40.36s UnloadDistributedZkTest.test (:solr:core)
The slowest suites (exceeding 1s) during this run:
  7203.65s StreamDecoratorTest (:solr:solrj-streaming)
  137.17s TestCpuAllowedLimit (:solr:core)
  90.75s BasicDistributedZkTest (:solr:core)
  82.81s KnnQParserTest (:solr:core)
  72.88s TestCoordinatorRole (:solr:core)
  64.89s TestCloudConsistency (:solr:core)
  62.26s TestPullReplica (:solr:core)
  61.56s MultiThreadedOCPTest (:solr:core)
  61.16s TestRecovery (:solr:core)
  59.05s TestJsonFacets (:solr:core)
ERROR: The following test(s) have failed:
  - org.apache.solr.client.solrj.io.stream.StreamDecoratorTest.testParallelDaemonCommitStream (:solr:solrj-streaming)
    Test history: https://develocity.apache.org/scans/tests?search.rootProjectNames=solr-root&tests.container=org.apache.solr.client.solrj.io.stream.StreamDecoratorTest&tests.test=testParallelDaemonCommitStream http://fucit.org/solr-jenkins-reports/history-trend-of-recent-failures.html#series/org.apache.solr.client.solrj.io.stream.StreamDecoratorTest.testParallelDaemonCommitStream
    Test output: /home/jenkins/jenkins-agent/workspace/Solr/Solr-Test-10.0/solr/solrj-streaming/build/test-results/test/outputs/OUTPUT-org.apache.solr.client.solrj.io.stream.StreamDecoratorTest.txt
    Reproduce with: ./gradlew :solr:solrj-streaming:test --tests "org.apache.solr.client.solrj.io.stream.StreamDecoratorTest.testParallelDaemonCommitStream" -Ptests.haltonfailure=false "-Ptests.jvmargs=-XX:TieredStopAtLevel=1 -XX:+UseParallelGC -XX:ActiveProcessorCount=1 -XX:ReservedCodeCacheSize=120m" -Ptests.seed=CABB6CE3016848EF -Ptests.multiplier=2 -Ptests.useSecurityManager=true -Ptests.badapples=false -Ptests.file.encoding=ISO-8859-1

  - org.apache.solr.client.solrj.io.stream.StreamDecoratorTest (:solr:solrj-streaming)
    Test history: https://develocity.apache.org/scans/tests?search.rootProjectNames=solr-root&tests.container=org.apache.solr.client.solrj.io.stream.StreamDecoratorTest
    Test output: /home/jenkins/jenkins-agent/workspace/Solr/Solr-Test-10.0/solr/solrj-streaming/build/test-results/test/outputs/OUTPUT-org.apache.solr.client.solrj.io.stream.StreamDecoratorTest.txt
    Reproduce with: ./gradlew :solr:solrj-streaming:test --tests "org.apache.solr.client.solrj.io.stream.StreamDecoratorTest" -Ptests.haltonfailure=false "-Ptests.jvmargs=-XX:TieredStopAtLevel=1 -XX:+UseParallelGC -XX:ActiveProcessorCount=1 -XX:ReservedCodeCacheSize=120m" -Ptests.seed=CABB6CE3016848EF -Ptests.multiplier=2 -Ptests.useSecurityManager=true -Ptests.badapples=false -Ptests.file.encoding=ISO-8859-1


Deprecated Gradle features were used in this build, making it incompatible with Gradle 9.0.

You can use '--warning-mode all' to show the individual deprecation warnings and determine if they come from your own scripts or plugins.

For more on this, please refer to https://docs.gradle.org/8.10/userguide/command_line_interface.html#sec:command_line_warnings in the Gradle documentation.

BUILD SUCCESSFUL in 2h 41m 51s
153 actionable tasks: 153 executed

Publishing build scan...

The Develocity server (develocity.apache.org) rejected the access key with prefix '7x3jzizm4zpygv7psbkg6byvm4'.
Your credential has expired.

Build step 'Invoke Gradle script' changed build result to SUCCESS
Archiving artifacts
‘**/*.events’ doesn’t match anything: ‘**’ exists but not ‘**/*.events’
No artifacts found that match the file pattern "**/*.events,heapdumps/**,**/hs_err_pid*". Configuration error?
Recording test results
[Checks API] No suitable checks publisher found.
Build step 'Publish JUnit test result report' changed build result to UNSTABLE
Email was triggered for: Unstable (Test Failures)
Sending email for trigger: Unstable (Test Failures)