You are viewing a plain text version of this content. The canonical link for it is here.
Posted to dev@kafka.apache.org by Apache Jenkins Server <je...@builds.apache.org> on 2015/04/02 02:02:04 UTC
Build failed in Jenkins: KafkaPreCommit #50
See <https://builds.apache.org/job/KafkaPreCommit/50/changes>
Changes:
[junrao] kafka-2013; benchmark test for the purgatory; patched by Yasuhiro Matsuda; reviewed by Jun Rao
------------------------------------------
[...truncated 2090 lines...]
kafka.admin.DeleteTopicTest > testDeleteNonExistingTopic PASSED
kafka.admin.DeleteTopicTest > testDeleteTopicWithCleaner PASSED
kafka.api.ProducerSendTest > testSendOffset PASSED
kafka.api.ProducerSendTest > testSerializer PASSED
kafka.api.ProducerSendTest > testClose PASSED
kafka.api.ProducerSendTest > testSendToPartition PASSED
kafka.api.ProducerSendTest > testAutoCreateTopic PASSED
kafka.api.ProducerSendTest > testFlush PASSED
kafka.api.ProducerFailureHandlingTest > testNotEnoughReplicas PASSED
kafka.api.ProducerFailureHandlingTest > testInvalidPartition PASSED
kafka.api.ProducerFailureHandlingTest > testTooLargeRecordWithAckZero PASSED
kafka.api.ProducerFailureHandlingTest > testTooLargeRecordWithAckOne PASSED
kafka.api.ProducerFailureHandlingTest > testNonExistentTopic PASSED
kafka.api.ProducerFailureHandlingTest > testWrongBrokerList PASSED
kafka.api.ProducerFailureHandlingTest > testNoResponse PASSED
kafka.api.ProducerFailureHandlingTest > testSendAfterClosed PASSED
kafka.api.ProducerFailureHandlingTest > testBrokerFailure PASSED
kafka.api.ProducerFailureHandlingTest > testCannotSendToInternalTopic PASSED
kafka.api.ProducerFailureHandlingTest > testNotEnoughReplicasAfterBrokerShutdown PASSED
kafka.api.ConsumerTest > testSimpleConsumption PASSED
kafka.api.ConsumerTest > testAutoOffsetReset PASSED
kafka.api.ConsumerTest > testSeek PASSED
kafka.api.ConsumerTest > testGroupConsumption PASSED
kafka.api.ConsumerTest > testPositionAndCommit PASSED
kafka.api.ConsumerTest > testPartitionsFor PASSED
kafka.api.ConsumerTest > testConsumptionWithBrokerFailures PASSED
kafka.api.ConsumerTest > testSeekAndCommitWithBrokerFailures PASSED
kafka.api.ConsumerTest > testPartitionReassignmentCallback PASSED
kafka.api.RequestResponseSerializationTest > testSerializationAndDeserialization PASSED
kafka.api.ApiUtilsTest > testShortStringNonASCII PASSED
kafka.api.ApiUtilsTest > testShortStringASCII PASSED
kafka.api.test.ProducerCompressionTest > testCompression[0] PASSED
kafka.api.test.ProducerCompressionTest > testCompression[1] PASSED
kafka.api.test.ProducerCompressionTest > testCompression[2] PASSED
kafka.api.test.ProducerCompressionTest > testCompression[3] PASSED
kafka.javaapi.consumer.ZookeeperConsumerConnectorTest > testBasic PASSED
kafka.javaapi.message.ByteBufferMessageSetTest > testWrittenEqualsRead PASSED
kafka.javaapi.message.ByteBufferMessageSetTest > testIteratorIsConsistent PASSED
kafka.javaapi.message.ByteBufferMessageSetTest > testSizeInBytes PASSED
kafka.javaapi.message.ByteBufferMessageSetTest > testIteratorIsConsistentWithCompression PASSED
kafka.javaapi.message.ByteBufferMessageSetTest > testSizeInBytesWithCompression PASSED
kafka.javaapi.message.ByteBufferMessageSetTest > testEquals PASSED
kafka.javaapi.message.ByteBufferMessageSetTest > testEqualsWithCompression PASSED
kafka.integration.UncleanLeaderElectionTest > testUncleanLeaderElectionEnabled PASSED
kafka.integration.UncleanLeaderElectionTest > testUncleanLeaderElectionDisabled PASSED
kafka.integration.UncleanLeaderElectionTest > testUncleanLeaderElectionEnabledByTopicOverride PASSED
kafka.integration.UncleanLeaderElectionTest > testCleanLeaderElectionDisabledByTopicOverride PASSED
kafka.integration.UncleanLeaderElectionTest > testUncleanLeaderElectionInvalidTopicOverride PASSED
kafka.integration.FetcherTest > testFetcher PASSED
kafka.integration.RollingBounceTest > testRollingBounce PASSED
kafka.integration.PrimitiveApiTest > testFetchRequestCanProperlySerialize PASSED
kafka.integration.PrimitiveApiTest > testEmptyFetchRequest PASSED
kafka.integration.PrimitiveApiTest > testDefaultEncoderProducerAndFetch PASSED
kafka.integration.PrimitiveApiTest > testDefaultEncoderProducerAndFetchWithCompression PASSED
kafka.integration.PrimitiveApiTest > testProduceAndMultiFetch PASSED
kafka.integration.PrimitiveApiTest > testMultiProduce PASSED
kafka.integration.PrimitiveApiTest > testConsumerEmptyTopic PASSED
kafka.integration.PrimitiveApiTest > testPipelinedProduceRequests PASSED
kafka.integration.AutoOffsetResetTest > testResetToEarliestWhenOffsetTooHigh PASSED
kafka.integration.AutoOffsetResetTest > testResetToEarliestWhenOffsetTooLow PASSED
kafka.integration.AutoOffsetResetTest > testResetToLatestWhenOffsetTooHigh PASSED
kafka.integration.AutoOffsetResetTest > testResetToLatestWhenOffsetTooLow PASSED
kafka.integration.TopicMetadataTest > testAutoCreateTopic PASSED
kafka.integration.TopicMetadataTest > testTopicMetadataRequest PASSED
kafka.integration.TopicMetadataTest > testBasicTopicMetadata PASSED
kafka.integration.TopicMetadataTest > testGetAllTopicMetadata PASSED
kafka.metrics.KafkaTimerTest > testKafkaTimer PASSED
kafka.utils.UtilsTest > testSwallow PASSED
kafka.utils.UtilsTest > testCircularIterator PASSED
kafka.utils.UtilsTest > testReadBytes PASSED
kafka.utils.UtilsTest > testAbs PASSED
kafka.utils.UtilsTest > testReplaceSuffix PASSED
kafka.utils.UtilsTest > testReadInt PASSED
kafka.utils.UtilsTest > testCsvList PASSED
kafka.utils.UtilsTest > testCsvMap PASSED
kafka.utils.UtilsTest > testInLock PASSED
kafka.utils.UtilsTest > testDoublyLinkedList PASSED
kafka.utils.SchedulerTest > testMockSchedulerNonPeriodicTask PASSED
kafka.utils.SchedulerTest > testMockSchedulerPeriodicTask PASSED
kafka.utils.SchedulerTest > testReentrantTaskInMockScheduler PASSED
kafka.utils.SchedulerTest > testNonPeriodicTask PASSED
kafka.utils.SchedulerTest > testPeriodicTask PASSED
kafka.utils.SchedulerTest > testRestart PASSED
kafka.utils.IteratorTemplateTest > testIterator PASSED
kafka.utils.ReplicationUtilsTest > testUpdateLeaderAndIsr PASSED
kafka.utils.ReplicationUtilsTest > testGetLeaderIsrAndEpochForPartition PASSED
kafka.utils.JsonTest > testJsonEncoding PASSED
kafka.message.MessageCompressionTest > testSimpleCompressDecompress PASSED
kafka.message.MessageWriterTest > testBufferingOutputStream PASSED
kafka.message.MessageWriterTest > testWithNoCompressionAttribute PASSED
kafka.message.MessageWriterTest > testWithCompressionAttribute PASSED
kafka.message.MessageWriterTest > testWithKey PASSED
kafka.message.MessageTest > testFieldValues PASSED
kafka.message.MessageTest > testChecksum PASSED
kafka.message.MessageTest > testEquality PASSED
kafka.message.MessageTest > testIsHashable PASSED
kafka.message.ByteBufferMessageSetTest > testWrittenEqualsRead PASSED
kafka.message.ByteBufferMessageSetTest > testIteratorIsConsistent PASSED
kafka.message.ByteBufferMessageSetTest > testSizeInBytes PASSED
kafka.message.ByteBufferMessageSetTest > testWriteTo PASSED
kafka.message.ByteBufferMessageSetTest > testEquals PASSED
kafka.message.ByteBufferMessageSetTest > testIterator PASSED
kafka.message.ByteBufferMessageSetTest > testValidBytes PASSED
kafka.message.ByteBufferMessageSetTest > testValidBytesWithCompression PASSED
kafka.message.ByteBufferMessageSetTest > testOffsetAssignment PASSED
kafka.tools.ConsoleProducerTest > testValidConfigsNewProducer PASSED
kafka.tools.ConsoleProducerTest > testValidConfigsOldProducer PASSED
kafka.tools.ConsoleProducerTest > testInvalidConfigs PASSED
kafka.tools.ConsoleProducerTest > testParseKeyProp PASSED
kafka.network.SocketServerTest > simpleRequest PASSED
kafka.network.SocketServerTest > tooBigRequestIsRejected PASSED
kafka.network.SocketServerTest > testNullResponse PASSED
kafka.network.SocketServerTest > testSocketsCloseOnShutdown PASSED
kafka.network.SocketServerTest > testMaxConnectionsPerIp PASSED
kafka.network.SocketServerTest > testMaxConnectionsPerIPOverrides PASSED
kafka.zk.ZKEphemeralTest > testEphemeralNodeCleanup PASSED
377 tests completed, 1 failed
:core:test FAILED
FAILURE: Build failed with an exception.
* What went wrong:
Execution failed for task ':core:test'.
> There were failing tests. See the report at: file:///x1/jenkins/jenkins-slave/workspace/KafkaPreCommit/core/build/reports/tests/index.html
* Try:
Run with --stacktrace option to get the stack trace. Run with --info or --debug option to get more log output.
BUILD FAILED
Total time: 11 mins 52.73 secs
Build step 'Execute shell' marked build as failure
Setting GRADLE_2_1_HOME=/home/jenkins/jenkins-slave/tools/hudson.plugins.gradle.GradleInstallation/Gradle_2.1
Jenkins build is back to normal : KafkaPreCommit #51
Posted by Apache Jenkins Server <je...@builds.apache.org>.
See <https://builds.apache.org/job/KafkaPreCommit/51/changes>