You are viewing a plain text version of this content. The canonical link for it is here.
Posted to notifications@qpid.apache.org by Apache Jenkins Server <je...@builds.apache.org> on 2019/12/27 20:16:10 UTC
Build failed in Jenkins: Qpid-Broker-J-7.1.x-TestMatrix » ubuntu&&!H25,JDK 1.8 (latest),java-bdb.1-0 #82
See <https://builds.apache.org/job/Qpid-Broker-J-7.1.x-TestMatrix/Ubuntu%20Slaves=ubuntu&&!H25,jdk=JDK%201.8%20(latest),profile=java-bdb.1-0/82/display/redirect?page=changes>
Changes:
[orudyy] QPID-8392 : Remove docs references to outdated DLQ configuration
------------------------------------------
[...truncated 565.66 KB...]
[INFO] --- maven-enforcer-plugin:3.0.0-M2:enforce (enforce-maven-version) @ qpid-java-doc ---
[INFO]
[INFO] --- maven-enforcer-plugin:3.0.0-M2:enforce (enforce-minimum-versions) @ qpid-java-doc ---
[INFO]
[INFO] --- maven-enforcer-plugin:3.0.0-M2:enforce (enforce-versions-standard-properties) @ qpid-java-doc ---
[INFO]
[INFO] --- maven-enforcer-plugin:3.0.0-M2:enforce (enforce-enableAmqp0x) @ qpid-java-doc ---
[INFO]
[INFO] --- jacoco-maven-plugin:0.8.2:prepare-agent (default-prepare-agent) @ qpid-java-doc ---
[INFO] argLine set to "-javaagent:/home/jenkins/.m2/repository/org/jacoco/org.jacoco.agent/0.8.2/org.jacoco.agent-0.8.2-runtime.jar=destfile=<https://builds.apache.org/job/Qpid-Broker-J-7.1.x-TestMatrix/Ubuntu%20Slaves=ubuntu&&!H25,jdk=JDK%201.8%20(latest),profile=java-bdb.1-0/ws/doc/target/jacoco.exec"> -Xmx512m
[INFO]
[INFO] --- maven-remote-resources-plugin:1.5:process (process-resource-bundles) @ qpid-java-doc ---
[INFO]
[INFO] --- maven-site-plugin:3.7.1:attach-descriptor (attach-descriptor) @ qpid-java-doc ---
[INFO] No site descriptor found: nothing to attach.
[INFO]
[INFO] --- maven-assembly-plugin:3.0.0:single (default) @ qpid-java-doc ---
[INFO] Assemblies have been skipped per configuration of the skipAssembly parameter.
[INFO]
[INFO] ----------------< org.apache.qpid:qpid-java-doc-broker >----------------
[INFO] Building Apache Qpid Broker-J Docbook 7.1.7-SNAPSHOT [46/47]
[INFO] --------------------------------[ jar ]---------------------------------
[INFO]
[INFO] --- maven-clean-plugin:3.1.0:clean (default-clean) @ qpid-java-doc-broker ---
[INFO]
[INFO] --- buildnumber-maven-plugin:1.4:create (default) @ qpid-java-doc-broker ---
[INFO] Executing: /bin/sh -c cd '<https://builds.apache.org/job/Qpid-Broker-J-7.1.x-TestMatrix/Ubuntu%20Slaves=ubuntu&&!H25,jdk=JDK%201.8%20(latest),profile=java-bdb.1-0/ws/doc/java-broker'> && 'git' 'rev-parse' '--verify' 'HEAD'
[INFO] Working directory: <https://builds.apache.org/job/Qpid-Broker-J-7.1.x-TestMatrix/Ubuntu%20Slaves=ubuntu&&!H25,jdk=JDK%201.8%20(latest),profile=java-bdb.1-0/ws/doc/java-broker>
[INFO] Storing buildNumber: c043cec46e91642fbcf69cc01150a776e94acda0 at timestamp: 1577477680811
[WARNING] Cannot get the branch information from the git repository:
Detecting the current branch failed: fatal: ref HEAD is not a symbolic ref
[INFO] Executing: /bin/sh -c cd '<https://builds.apache.org/job/Qpid-Broker-J-7.1.x-TestMatrix/Ubuntu%20Slaves=ubuntu&&!H25,jdk=JDK%201.8%20(latest),profile=java-bdb.1-0/ws/doc/java-broker'> && 'git' 'rev-parse' '--verify' 'HEAD'
[INFO] Working directory: <https://builds.apache.org/job/Qpid-Broker-J-7.1.x-TestMatrix/Ubuntu%20Slaves=ubuntu&&!H25,jdk=JDK%201.8%20(latest),profile=java-bdb.1-0/ws/doc/java-broker>
[INFO] Storing buildScmBranch: UNKNOWN
[INFO]
[INFO] --- maven-antrun-plugin:1.8:run (output-test-properties) @ qpid-java-doc-broker ---
[INFO] Executing tasks
main:
[echo] Qpid Test Profile Properties
[echo] [profile] java-bdb.1-0
[echo] [profile.broker.version] 1.0
[echo] [profile.virtualhostnode.type] BDB
[echo] [profile.virtualhostnode.context.blueprint] {"type":"ProvidedStore","globalAddressDomains":"${qpid.globalAddressDomains}"}
[echo] [profile.test_receive_timeout] 3000
[INFO] Executed tasks
[INFO]
[INFO] --- maven-enforcer-plugin:3.0.0-M2:enforce (enforce-maven-version) @ qpid-java-doc-broker ---
[INFO]
[INFO] --- maven-enforcer-plugin:3.0.0-M2:enforce (enforce-minimum-versions) @ qpid-java-doc-broker ---
[INFO]
[INFO] --- maven-enforcer-plugin:3.0.0-M2:enforce (enforce-versions-standard-properties) @ qpid-java-doc-broker ---
[INFO]
[INFO] --- maven-enforcer-plugin:3.0.0-M2:enforce (enforce-enableAmqp0x) @ qpid-java-doc-broker ---
[INFO]
[INFO] --- jacoco-maven-plugin:0.8.2:prepare-agent (default-prepare-agent) @ qpid-java-doc-broker ---
[INFO] argLine set to "-javaagent:/home/jenkins/.m2/repository/org/jacoco/org.jacoco.agent/0.8.2/org.jacoco.agent-0.8.2-runtime.jar=destfile=<https://builds.apache.org/job/Qpid-Broker-J-7.1.x-TestMatrix/Ubuntu%20Slaves=ubuntu&&!H25,jdk=JDK%201.8%20(latest),profile=java-bdb.1-0/ws/doc/java-broker/target/jacoco.exec"> -Xmx512m
[INFO]
[INFO] --- maven-resources-plugin:3.1.0:copy-resources (filter-docbook-sources) @ qpid-java-doc-broker ---
[INFO] Using 'UTF-8' encoding to copy filtered resources.
[INFO] Copying 76 resources
[INFO]
[INFO] --- maven-remote-resources-plugin:1.5:process (process-resource-bundles) @ qpid-java-doc-broker ---
[INFO]
[INFO] --- maven-resources-plugin:3.1.0:resources (default-resources) @ qpid-java-doc-broker ---
[INFO] Using 'UTF-8' encoding to copy filtered resources.
[INFO] Copying 76 resources
[INFO]
[INFO] --- maven-compiler-plugin:3.7.0:compile (default-compile) @ qpid-java-doc-broker ---
[INFO] No sources to compile
[INFO]
[INFO] --- maven-resources-plugin:3.1.0:testResources (default-testResources) @ qpid-java-doc-broker ---
[INFO] Using 'UTF-8' encoding to copy filtered resources.
[INFO] Copying 76 resources
[INFO]
[INFO] --- maven-compiler-plugin:3.7.0:testCompile (default-testCompile) @ qpid-java-doc-broker ---
[INFO] No sources to compile
[INFO]
[INFO] --- maven-surefire-plugin:2.22.0:test (default-test) @ qpid-java-doc-broker ---
[INFO] Tests are skipped.
[INFO]
[INFO] --- maven-jar-plugin:3.1.0:jar (default-jar) @ qpid-java-doc-broker ---
[WARNING] JAR will be empty - no content was marked for inclusion!
[INFO] Building jar: <https://builds.apache.org/job/Qpid-Broker-J-7.1.x-TestMatrix/Ubuntu%20Slaves=ubuntu&&!H25,jdk=JDK%201.8%20(latest),profile=java-bdb.1-0/ws/doc/java-broker/target/qpid-java-doc-broker-7.1.7-SNAPSHOT.jar>
[INFO]
[INFO] --- maven-site-plugin:3.7.1:attach-descriptor (attach-descriptor) @ qpid-java-doc-broker ---
[INFO] Skipping because packaging 'jar' is not pom.
[INFO]
[INFO] --- maven-assembly-plugin:3.0.0:single (default) @ qpid-java-doc-broker ---
[INFO] Assemblies have been skipped per configuration of the skipAssembly parameter.
[INFO]
[INFO] --------------< org.apache.qpid:qpid-java-doc-perftests >---------------
[INFO] Building Apache Qpid Broker-J Performance Test Docbook 7.1.7-SNAPSHOT [47/47]
[INFO] --------------------------------[ jar ]---------------------------------
[INFO]
[INFO] --- maven-clean-plugin:3.1.0:clean (default-clean) @ qpid-java-doc-perftests ---
[INFO]
[INFO] --- buildnumber-maven-plugin:1.4:create (default) @ qpid-java-doc-perftests ---
[INFO] Executing: /bin/sh -c cd '<https://builds.apache.org/job/Qpid-Broker-J-7.1.x-TestMatrix/Ubuntu%20Slaves=ubuntu&&!H25,jdk=JDK%201.8%20(latest),profile=java-bdb.1-0/ws/doc/java-perftests'> && 'git' 'rev-parse' '--verify' 'HEAD'
[INFO] Working directory: <https://builds.apache.org/job/Qpid-Broker-J-7.1.x-TestMatrix/Ubuntu%20Slaves=ubuntu&&!H25,jdk=JDK%201.8%20(latest),profile=java-bdb.1-0/ws/doc/java-perftests>
[INFO] Storing buildNumber: c043cec46e91642fbcf69cc01150a776e94acda0 at timestamp: 1577477681377
[WARNING] Cannot get the branch information from the git repository:
Detecting the current branch failed: fatal: ref HEAD is not a symbolic ref
[INFO] Executing: /bin/sh -c cd '<https://builds.apache.org/job/Qpid-Broker-J-7.1.x-TestMatrix/Ubuntu%20Slaves=ubuntu&&!H25,jdk=JDK%201.8%20(latest),profile=java-bdb.1-0/ws/doc/java-perftests'> && 'git' 'rev-parse' '--verify' 'HEAD'
[INFO] Working directory: <https://builds.apache.org/job/Qpid-Broker-J-7.1.x-TestMatrix/Ubuntu%20Slaves=ubuntu&&!H25,jdk=JDK%201.8%20(latest),profile=java-bdb.1-0/ws/doc/java-perftests>
[INFO] Storing buildScmBranch: UNKNOWN
[INFO]
[INFO] --- maven-antrun-plugin:1.8:run (output-test-properties) @ qpid-java-doc-perftests ---
[INFO] Executing tasks
main:
[echo] Qpid Test Profile Properties
[echo] [profile] java-bdb.1-0
[echo] [profile.broker.version] 1.0
[echo] [profile.virtualhostnode.type] BDB
[echo] [profile.virtualhostnode.context.blueprint] {"type":"ProvidedStore","globalAddressDomains":"${qpid.globalAddressDomains}"}
[echo] [profile.test_receive_timeout] 3000
[INFO] Executed tasks
[INFO]
[INFO] --- maven-enforcer-plugin:3.0.0-M2:enforce (enforce-maven-version) @ qpid-java-doc-perftests ---
[INFO]
[INFO] --- maven-enforcer-plugin:3.0.0-M2:enforce (enforce-minimum-versions) @ qpid-java-doc-perftests ---
[INFO]
[INFO] --- maven-enforcer-plugin:3.0.0-M2:enforce (enforce-versions-standard-properties) @ qpid-java-doc-perftests ---
[INFO]
[INFO] --- maven-enforcer-plugin:3.0.0-M2:enforce (enforce-enableAmqp0x) @ qpid-java-doc-perftests ---
[INFO]
[INFO] --- jacoco-maven-plugin:0.8.2:prepare-agent (default-prepare-agent) @ qpid-java-doc-perftests ---
[INFO] argLine set to "-javaagent:/home/jenkins/.m2/repository/org/jacoco/org.jacoco.agent/0.8.2/org.jacoco.agent-0.8.2-runtime.jar=destfile=<https://builds.apache.org/job/Qpid-Broker-J-7.1.x-TestMatrix/Ubuntu%20Slaves=ubuntu&&!H25,jdk=JDK%201.8%20(latest),profile=java-bdb.1-0/ws/doc/java-perftests/target/jacoco.exec"> -Xmx512m
[INFO]
[INFO] --- maven-resources-plugin:3.1.0:copy-resources (filter-docbook-sources) @ qpid-java-doc-perftests ---
[INFO] Using 'UTF-8' encoding to copy filtered resources.
[INFO] Copying 1 resource
[INFO]
[INFO] --- maven-remote-resources-plugin:1.5:process (process-resource-bundles) @ qpid-java-doc-perftests ---
[INFO]
[INFO] --- maven-resources-plugin:3.1.0:resources (default-resources) @ qpid-java-doc-perftests ---
[INFO] Using 'UTF-8' encoding to copy filtered resources.
[INFO] Copying 1 resource
[INFO]
[INFO] --- maven-compiler-plugin:3.7.0:compile (default-compile) @ qpid-java-doc-perftests ---
[INFO] No sources to compile
[INFO]
[INFO] --- maven-resources-plugin:3.1.0:testResources (default-testResources) @ qpid-java-doc-perftests ---
[INFO] Using 'UTF-8' encoding to copy filtered resources.
[INFO] Copying 1 resource
[INFO]
[INFO] --- maven-compiler-plugin:3.7.0:testCompile (default-testCompile) @ qpid-java-doc-perftests ---
[INFO] No sources to compile
[INFO]
[INFO] --- maven-surefire-plugin:2.22.0:test (default-test) @ qpid-java-doc-perftests ---
[INFO] Tests are skipped.
[INFO]
[INFO] --- maven-jar-plugin:3.1.0:jar (default-jar) @ qpid-java-doc-perftests ---
[WARNING] JAR will be empty - no content was marked for inclusion!
[INFO] Building jar: <https://builds.apache.org/job/Qpid-Broker-J-7.1.x-TestMatrix/Ubuntu%20Slaves=ubuntu&&!H25,jdk=JDK%201.8%20(latest),profile=java-bdb.1-0/ws/doc/java-perftests/target/qpid-java-doc-perftests-7.1.7-SNAPSHOT.jar>
[INFO]
[INFO] --- maven-site-plugin:3.7.1:attach-descriptor (attach-descriptor) @ qpid-java-doc-perftests ---
[INFO] Skipping because packaging 'jar' is not pom.
[INFO]
[INFO] --- maven-assembly-plugin:3.0.0:single (default) @ qpid-java-doc-perftests ---
[INFO] Assemblies have been skipped per configuration of the skipAssembly parameter.
[INFO] ------------------------------------------------------------------------
[INFO] Reactor Summary for Apache Qpid Broker-J Parent 7.1.7-SNAPSHOT:
[INFO]
[INFO] Apache Qpid Broker-J Parent ........................ SUCCESS [ 2.493 s]
[INFO] Apache Qpid Broker-J Code Generation ............... SUCCESS [ 2.249 s]
[INFO] Apache Qpid Broker-J Test Utilities ................ SUCCESS [ 0.510 s]
[INFO] Apache Qpid Broker-J Core .......................... SUCCESS [ 15.539 s]
[INFO] Apache Qpid Broker-J LogBack Logging Plug-in ....... SUCCESS [ 1.312 s]
[INFO] Apache Qpid Broker-J Access Control Plug-in ........ SUCCESS [ 0.946 s]
[INFO] Apache Qpid Broker-J AMQP 0-10 Protocol Plug-in .... SUCCESS [ 1.610 s]
[INFO] Apache Qpid Broker-J AMQP 0-8 Protocol Plug-in ..... SUCCESS [ 1.395 s]
[INFO] Apache Qpid Broker-J AMQP 1-0 Protocol Plug-in ..... SUCCESS [ 2.631 s]
[INFO] Apache Qpid Broker-J AMQP 0-8 to 0-10 Message Conversion Plug-in SUCCESS [ 0.306 s]
[INFO] Apache Qpid Broker-J AMQP 0-8 to 1-0 Message Conversion Plug-in SUCCESS [ 0.444 s]
[INFO] Apache Qpid Broker-J AMQP 0-10 to 1-0 Message Conversion Plug-in SUCCESS [ 0.465 s]
[INFO] Apache Qpid Broker-J JDBC Message Store Plug-in .... SUCCESS [ 1.036 s]
[INFO] Apache Qpid Broker-J Derby Message Store Plug-in ... SUCCESS [ 0.690 s]
[INFO] Apache Qpid Broker-J JDBC Message Store Connection Pooling Plug-in SUCCESS [ 0.267 s]
[INFO] Apache Qpid Broker-J LogBack JDBC Logging Plug-in .. SUCCESS [ 0.450 s]
[INFO] Apache Qpid AMQP 1.0 JDBC Link Store Plug-in ....... SUCCESS [ 0.303 s]
[INFO] Apache Qpid Broker-J HTTP Management Plug-in ....... SUCCESS [ 3.039 s]
[INFO] Apache Qpid Broker-J AMQP Management Protocol Plug-in SUCCESS [ 0.339 s]
[INFO] Apache Qpid Broker-J Memory Message Store Plug-in .. SUCCESS [ 0.347 s]
[INFO] Apache Qpid Broker-J WebSocket Plug-in ............. SUCCESS [ 0.353 s]
[INFO] Apache Qpid Broker-J BDB Message Store Plug-in ..... SUCCESS [ 1.733 s]
[INFO] Apache Qpid AMQP 1.0 BDB Link Store Plug-in ........ SUCCESS [ 0.319 s]
[INFO] Apache Qpid Broker-J ............................... SUCCESS [ 0.490 s]
[INFO] Apache Qpid Broker-J Bundles ....................... SUCCESS [ 6.296 s]
[INFO] Apache Qpid Broker-J Tools ......................... SUCCESS [ 0.283 s]
[INFO] Apache Qpid Broker-J System Test Parent ............ SUCCESS [ 0.108 s]
[INFO] Apache Qpid Broker-J System Test Utils ............. SUCCESS [ 0.365 s]
[INFO] Apache Qpid Broker-J JMS System Tests Core ......... SUCCESS [ 0.567 s]
[INFO] Apache Qpid Broker-J JMS 1.1 System Tests .......... SUCCESS [15:28 min]
[INFO] Apache Qpid Broker-J JMS 2.0 System Tests .......... SUCCESS [ 57.887 s]
[INFO] Apache Qpid Broker-J HTTP system tests ............. SUCCESS [03:20 min]
[INFO] Apache Qpid Broker-J Protocol Tests Core ........... SUCCESS [ 0.252 s]
[INFO] Apache Qpid Protocol Tests for AMQP 0-8,0-9,0-9-1 .. SUCCESS [ 1.424 s]
[INFO] Apache Qpid Protocol Tests for AMQP 0-10 ........... SUCCESS [ 0.865 s]
[INFO] Apache Qpid Protocol Tests for AMQP 1.0 ............ SUCCESS [ 2.209 s]
[INFO] Apache Qpid Broker-J System Tests Spawn Broker Admin SUCCESS [ 53.652 s]
[INFO] Apache Qpid Broker-J End to End Conversion Tests ... SUCCESS [06:50 min]
[INFO] Apache Qpid Broker-J Performance Tests ............. SUCCESS [ 1.535 s]
[INFO] Apache Qpid Broker-J Performance Test System Tests . SUCCESS [ 36.191 s]
[INFO] Apache Qpid Broker-J Performance Tests Visualisation JFC SUCCESS [ 1.231 s]
[INFO] Apache Qpid Broker-J BDB Store System Tests ........ FAILURE [05:41 min]
[INFO] Apache Qpid Joram JMS Tests ........................ SUCCESS [ 0.227 s]
[INFO] Apache Qpid Broker-J JMS TCK Configuration ......... SUCCESS [ 0.172 s]
[INFO] Apache Qpid Broker-J Docbook ....................... SUCCESS [ 0.058 s]
[INFO] Apache Qpid Broker-J Docbook ....................... SUCCESS [ 0.567 s]
[INFO] Apache Qpid Broker-J Performance Test Docbook ...... SUCCESS [ 0.082 s]
[INFO] ------------------------------------------------------------------------
[INFO] BUILD FAILURE
[INFO] ------------------------------------------------------------------------
[INFO] Total time: 34:46 min
[INFO] Finished at: 2019-12-27T20:14:41Z
[INFO] ------------------------------------------------------------------------
[ERROR] Failed to execute goal org.apache.maven.plugins:maven-surefire-plugin:2.22.0:test (integration-test) on project qpid-bdbstore-systests: There are test failures.
[ERROR]
[ERROR] Please refer to <https://builds.apache.org/job/Qpid-Broker-J-7.1.x-TestMatrix/Ubuntu%20Slaves=ubuntu&&!H25,jdk=JDK%201.8%20(latest),profile=java-bdb.1-0/82/artifact/bdbstore/systests/target/surefire-reports/java-bdb.1-0> for the individual test results.
[ERROR] Please refer to dump files (if any exist) [date]-jvmRun[N].dump, [date].dumpstream and [date]-jvmRun[N].dumpstream.
[ERROR] -> [Help 1]
[ERROR]
[ERROR] To see the full stack trace of the errors, re-run Maven with the -e switch.
[ERROR] Re-run Maven using the -X switch to enable full debug logging.
[ERROR]
[ERROR] For more information about the errors and possible solutions, please read the following articles:
[ERROR] [Help 1] http://cwiki.apache.org/confluence/display/MAVEN/MojoFailureException
[ERROR]
[ERROR] After correcting the problems, you can resume the build with the command
[ERROR] mvn <args> -rf :qpid-bdbstore-systests
Build step 'Invoke top-level Maven targets' marked build as failure
Archiving artifacts
Performing Post build task...
Match found for : : True
Logical operation result is TRUE
Running script : echo Finishing build
date
[java-bdb.1-0] $ /bin/bash -xe /tmp/jenkins410148559112864594.sh
+ echo Finishing build
Finishing build
+ date
Fri Dec 27 20:16:02 UTC 2019
POST BUILD TASK : SUCCESS
END OF POST BUILD TASK : 0
Recording test results
Jenkins build is back to normal : Qpid-Broker-J-7.1.x-TestMatrix » ubuntu&&!H25,JDK 1.8 (latest),java-bdb.1-0 #85
Posted by Apache Jenkins Server <je...@builds.apache.org>.
See <https://builds.apache.org/job/Qpid-Broker-J-7.1.x-TestMatrix/Ubuntu%20Slaves=ubuntu&&!H25,jdk=JDK%201.8%20(latest),profile=java-bdb.1-0/85/display/redirect?page=changes>
Build failed in Jenkins: Qpid-Broker-J-7.1.x-TestMatrix » ubuntu&&!H25,JDK 1.8 (latest),java-bdb.1-0 #84
Posted by Apache Jenkins Server <je...@builds.apache.org>.
See <https://builds.apache.org/job/Qpid-Broker-J-7.1.x-TestMatrix/Ubuntu%20Slaves=ubuntu&&!H25,jdk=JDK%201.8%20(latest),profile=java-bdb.1-0/84/display/redirect?page=changes>
Changes:
[orudyy] QPID-8394: [Broker-J][WMC] Fix message table
------------------------------------------
[...truncated 494.58 KB...]
[WARNING] Tests run: 28, Failures: 0, Errors: 0, Skipped: 12, Time elapsed: 71.241 s - in org.apache.qpid.systests.end_to_end_conversion.SimpleConversionTest
[INFO]
[INFO] Results:
[INFO]
[WARNING] Tests run: 28, Failures: 0, Errors: 0, Skipped: 12
[INFO]
[INFO]
[INFO] --- maven-surefire-plugin:2.22.0:test (1.0 -> 0-10) @ qpid-systests-end-to-end-conversion-tests ---
[INFO]
[INFO] -------------------------------------------------------
[INFO] T E S T S
[INFO] -------------------------------------------------------
[INFO] Running org.apache.qpid.systests.end_to_end_conversion.SimpleConversionTest
[WARNING] Tests run: 28, Failures: 0, Errors: 0, Skipped: 11, Time elapsed: 179.271 s - in org.apache.qpid.systests.end_to_end_conversion.SimpleConversionTest
[INFO]
[INFO] Results:
[INFO]
[WARNING] Tests run: 28, Failures: 0, Errors: 0, Skipped: 11
[INFO]
[INFO]
[INFO] --- maven-surefire-plugin:2.22.0:test (0-9-1 -> 0-10) @ qpid-systests-end-to-end-conversion-tests ---
[INFO]
[INFO] -------------------------------------------------------
[INFO] T E S T S
[INFO] -------------------------------------------------------
[INFO] Running org.apache.qpid.systests.end_to_end_conversion.SimpleConversionTest
[WARNING] Tests run: 28, Failures: 0, Errors: 0, Skipped: 13, Time elapsed: 97.123 s - in org.apache.qpid.systests.end_to_end_conversion.SimpleConversionTest
[INFO]
[INFO] Results:
[INFO]
[WARNING] Tests run: 28, Failures: 0, Errors: 0, Skipped: 13
[INFO]
[INFO]
[INFO] --- maven-surefire-plugin:2.22.0:test (0-10 -> 0-9-1) @ qpid-systests-end-to-end-conversion-tests ---
[INFO]
[INFO] -------------------------------------------------------
[INFO] T E S T S
[INFO] -------------------------------------------------------
[INFO] Running org.apache.qpid.systests.end_to_end_conversion.SimpleConversionTest
[WARNING] Tests run: 28, Failures: 0, Errors: 0, Skipped: 12, Time elapsed: 89.324 s - in org.apache.qpid.systests.end_to_end_conversion.SimpleConversionTest
[INFO]
[INFO] Results:
[INFO]
[WARNING] Tests run: 28, Failures: 0, Errors: 0, Skipped: 12
[INFO]
[INFO]
[INFO] --- maven-jar-plugin:3.1.0:jar (default-jar) @ qpid-systests-end-to-end-conversion-tests ---
[INFO] Building jar: /home/jenkins/jenkins-slave/workspace/Qpid-Broker-J-7.1.x-TestMatrix/Ubuntu Slaves/ubuntu&&!H25/jdk/JDK 1.8 (latest)/profile/java-bdb.1-0/systests/end-to-end-conversion-tests/target/qpid-systests-end-to-end-conversion-tests-7.1.7-SNAPSHOT.jar
[INFO]
[INFO] --- maven-site-plugin:3.7.1:attach-descriptor (attach-descriptor) @ qpid-systests-end-to-end-conversion-tests ---
[INFO] Skipping because packaging 'jar' is not pom.
[INFO]
[INFO] --- maven-surefire-plugin:2.22.0:test (integration-test) @ qpid-systests-end-to-end-conversion-tests ---
[INFO] Skipping execution of surefire because it has already been run for this configuration
[INFO]
[INFO] -------------------< org.apache.qpid:qpid-perftests >-------------------
[INFO] Building Apache Qpid Broker-J Performance Tests 7.1.7-SNAPSHOT [39/47]
[INFO] --------------------------------[ jar ]---------------------------------
[INFO]
[INFO] --- maven-clean-plugin:3.1.0:clean (default-clean) @ qpid-perftests ---
[INFO]
[INFO] --- buildnumber-maven-plugin:1.4:create (default) @ qpid-perftests ---
[INFO] Executing: /bin/sh -c cd '/home/jenkins/jenkins-slave/workspace/Qpid-Broker-J-7.1.x-TestMatrix/Ubuntu Slaves/ubuntu&&!H25/jdk/JDK 1.8 (latest)/profile/java-bdb.1-0/perftests' && 'git' 'rev-parse' '--verify' 'HEAD'
[INFO] Working directory: /home/jenkins/jenkins-slave/workspace/Qpid-Broker-J-7.1.x-TestMatrix/Ubuntu Slaves/ubuntu&&!H25/jdk/JDK 1.8 (latest)/profile/java-bdb.1-0/perftests
[INFO] Storing buildNumber: 5209244dc8223c8dacf8fd2048baf30edca63518 at timestamp: 1578330394966
[WARNING] Cannot get the branch information from the git repository:
Detecting the current branch failed: fatal: ref HEAD is not a symbolic ref
[INFO] Executing: /bin/sh -c cd '/home/jenkins/jenkins-slave/workspace/Qpid-Broker-J-7.1.x-TestMatrix/Ubuntu Slaves/ubuntu&&!H25/jdk/JDK 1.8 (latest)/profile/java-bdb.1-0/perftests' && 'git' 'rev-parse' '--verify' 'HEAD'
[INFO] Working directory: /home/jenkins/jenkins-slave/workspace/Qpid-Broker-J-7.1.x-TestMatrix/Ubuntu Slaves/ubuntu&&!H25/jdk/JDK 1.8 (latest)/profile/java-bdb.1-0/perftests
[INFO] Storing buildScmBranch: UNKNOWN
[INFO]
[INFO] --- maven-antrun-plugin:1.8:run (output-test-properties) @ qpid-perftests ---
[INFO] Executing tasks
main:
[echo] Qpid Test Profile Properties
[echo] [profile] java-bdb.1-0
[echo] [profile.broker.version] 1.0
[echo] [profile.virtualhostnode.type] BDB
[echo] [profile.virtualhostnode.context.blueprint] {"type":"ProvidedStore","globalAddressDomains":"${qpid.globalAddressDomains}"}
[echo] [profile.test_receive_timeout] 3000
[INFO] Executed tasks
[INFO]
[INFO] --- maven-enforcer-plugin:3.0.0-M2:enforce (enforce-maven-version) @ qpid-perftests ---
[INFO]
[INFO] --- maven-enforcer-plugin:3.0.0-M2:enforce (enforce-minimum-versions) @ qpid-perftests ---
[INFO]
[INFO] --- maven-enforcer-plugin:3.0.0-M2:enforce (enforce-versions-standard-properties) @ qpid-perftests ---
[INFO]
[INFO] --- maven-enforcer-plugin:3.0.0-M2:enforce (enforce-enableAmqp0x) @ qpid-perftests ---
[INFO]
[INFO] --- jacoco-maven-plugin:0.8.2:prepare-agent (default-prepare-agent) @ qpid-perftests ---
[INFO] argLine set to "-javaagent:/home/jenkins/.m2/repository/org/jacoco/org.jacoco.agent/0.8.2/org.jacoco.agent-0.8.2-runtime.jar=destfile=/home/jenkins/jenkins-slave/workspace/Qpid-Broker-J-7.1.x-TestMatrix/Ubuntu Slaves/ubuntu&&!H25/jdk/JDK 1.8 (latest)/profile/java-bdb.1-0/perftests/target/jacoco.exec" -Xmx512m
[INFO]
[INFO] --- maven-remote-resources-plugin:1.5:process (process-resource-bundles) @ qpid-perftests ---
[INFO]
[INFO] --- maven-resources-plugin:3.1.0:resources (default-resources) @ qpid-perftests ---
[INFO] Using 'UTF-8' encoding to copy filtered resources.
[INFO] Copying 2 resources
[INFO] Copying 2 resources
[INFO] Copying 3 resources
[INFO]
[INFO] --- maven-compiler-plugin:3.7.0:compile (default-compile) @ qpid-perftests ---
[INFO] Compiling 102 source files to /home/jenkins/jenkins-slave/workspace/Qpid-Broker-J-7.1.x-TestMatrix/Ubuntu Slaves/ubuntu&&!H25/jdk/JDK 1.8 (latest)/profile/java-bdb.1-0/perftests/target/classes
[WARNING] /home/jenkins/jenkins-slave/workspace/Qpid-Broker-J-7.1.x-TestMatrix/Ubuntu Slaves/ubuntu&&!H25/jdk/JDK 1.8 (latest)/profile/java-bdb.1-0/perftests/src/main/java/org/apache/qpid/disttest/controller/AbstractTestRunner.java: unknown enum constant com.google.j2objc.annotations.ReflectionSupport.Level.FULL
reason: class file for com.google.j2objc.annotations.ReflectionSupport$Level not found
[INFO] /home/jenkins/jenkins-slave/workspace/Qpid-Broker-J-7.1.x-TestMatrix/Ubuntu Slaves/ubuntu&&!H25/jdk/JDK 1.8 (latest)/profile/java-bdb.1-0/perftests/src/main/java/org/apache/qpid/disttest/client/property/PropertyValueFactory.java: Some input files use unchecked or unsafe operations.
[INFO] /home/jenkins/jenkins-slave/workspace/Qpid-Broker-J-7.1.x-TestMatrix/Ubuntu Slaves/ubuntu&&!H25/jdk/JDK 1.8 (latest)/profile/java-bdb.1-0/perftests/src/main/java/org/apache/qpid/disttest/client/property/PropertyValueFactory.java: Recompile with -Xlint:unchecked for details.
[INFO]
[INFO] --- maven-resources-plugin:3.1.0:testResources (default-testResources) @ qpid-perftests ---
[INFO] Using 'UTF-8' encoding to copy filtered resources.
[INFO] Copying 4 resources
[INFO] Copying 3 resources
[INFO] Copying 3 resources
[INFO]
[INFO] --- maven-compiler-plugin:3.7.0:testCompile (default-testCompile) @ qpid-perftests ---
[INFO] Compiling 50 source files to /home/jenkins/jenkins-slave/workspace/Qpid-Broker-J-7.1.x-TestMatrix/Ubuntu Slaves/ubuntu&&!H25/jdk/JDK 1.8 (latest)/profile/java-bdb.1-0/perftests/target/test-classes
[INFO] /home/jenkins/jenkins-slave/workspace/Qpid-Broker-J-7.1.x-TestMatrix/Ubuntu Slaves/ubuntu&&!H25/jdk/JDK 1.8 (latest)/profile/java-bdb.1-0/perftests/src/test/java/org/apache/qpid/disttest/results/ResultsCsvWriterTest.java: /home/jenkins/jenkins-slave/workspace/Qpid-Broker-J-7.1.x-TestMatrix/Ubuntu Slaves/ubuntu&&!H25/jdk/JDK 1.8 (latest)/profile/java-bdb.1-0/perftests/src/test/java/org/apache/qpid/disttest/results/ResultsCsvWriterTest.java uses unchecked or unsafe operations.
[INFO] /home/jenkins/jenkins-slave/workspace/Qpid-Broker-J-7.1.x-TestMatrix/Ubuntu Slaves/ubuntu&&!H25/jdk/JDK 1.8 (latest)/profile/java-bdb.1-0/perftests/src/test/java/org/apache/qpid/disttest/results/ResultsCsvWriterTest.java: Recompile with -Xlint:unchecked for details.
[INFO]
[INFO] --- maven-surefire-plugin:2.22.0:test (default-test) @ qpid-perftests ---
[INFO] Tests are skipped.
[INFO]
[INFO] --- maven-jar-plugin:3.1.0:jar (default-jar) @ qpid-perftests ---
[INFO] Building jar: /home/jenkins/jenkins-slave/workspace/Qpid-Broker-J-7.1.x-TestMatrix/Ubuntu Slaves/ubuntu&&!H25/jdk/JDK 1.8 (latest)/profile/java-bdb.1-0/perftests/target/qpid-perftests-7.1.7-SNAPSHOT.jar
[INFO]
[INFO] --- maven-site-plugin:3.7.1:attach-descriptor (attach-descriptor) @ qpid-perftests ---
[INFO] Skipping because packaging 'jar' is not pom.
[INFO]
[INFO] --- maven-assembly-plugin:3.0.0:single (make-assembly) @ qpid-perftests ---
[INFO] Reading assembly descriptor: src/main/assembly/qpid-perftests-bin.xml
[INFO] Building tar: /home/jenkins/jenkins-slave/workspace/Qpid-Broker-J-7.1.x-TestMatrix/Ubuntu Slaves/ubuntu&&!H25/jdk/JDK 1.8 (latest)/profile/java-bdb.1-0/perftests/target/qpid-perftests-7.1.7-SNAPSHOT-bin.tar.gz
[INFO]
[INFO] --------------< org.apache.qpid:qpid-perftests-systests >---------------
[INFO] Building Apache Qpid Broker-J Performance Test System Tests 7.1.7-SNAPSHOT [40/47]
[INFO] --------------------------------[ jar ]---------------------------------
[INFO]
[INFO] --- maven-clean-plugin:3.1.0:clean (default-clean) @ qpid-perftests-systests ---
[INFO]
[INFO] --- buildnumber-maven-plugin:1.4:create (default) @ qpid-perftests-systests ---
[INFO] Executing: /bin/sh -c cd '/home/jenkins/jenkins-slave/workspace/Qpid-Broker-J-7.1.x-TestMatrix/Ubuntu Slaves/ubuntu&&!H25/jdk/JDK 1.8 (latest)/profile/java-bdb.1-0/qpid-perftests-systests' && 'git' 'rev-parse' '--verify' 'HEAD'
[INFO] Working directory: /home/jenkins/jenkins-slave/workspace/Qpid-Broker-J-7.1.x-TestMatrix/Ubuntu Slaves/ubuntu&&!H25/jdk/JDK 1.8 (latest)/profile/java-bdb.1-0/qpid-perftests-systests
[INFO] Storing buildNumber: 5209244dc8223c8dacf8fd2048baf30edca63518 at timestamp: 1578330401652
[WARNING] Cannot get the branch information from the git repository:
Detecting the current branch failed: fatal: ref HEAD is not a symbolic ref
[INFO] Executing: /bin/sh -c cd '/home/jenkins/jenkins-slave/workspace/Qpid-Broker-J-7.1.x-TestMatrix/Ubuntu Slaves/ubuntu&&!H25/jdk/JDK 1.8 (latest)/profile/java-bdb.1-0/qpid-perftests-systests' && 'git' 'rev-parse' '--verify' 'HEAD'
[INFO] Working directory: /home/jenkins/jenkins-slave/workspace/Qpid-Broker-J-7.1.x-TestMatrix/Ubuntu Slaves/ubuntu&&!H25/jdk/JDK 1.8 (latest)/profile/java-bdb.1-0/qpid-perftests-systests
[INFO] Storing buildScmBranch: UNKNOWN
[INFO]
[INFO] --- maven-antrun-plugin:1.8:run (output-test-properties) @ qpid-perftests-systests ---
[INFO] Executing tasks
main:
[echo] Qpid Test Profile Properties
[echo] [profile] java-bdb.1-0
[echo] [profile.broker.version] 1.0
[echo] [profile.virtualhostnode.type] BDB
[echo] [profile.virtualhostnode.context.blueprint] {"type":"ProvidedStore","globalAddressDomains":"${qpid.globalAddressDomains}"}
[echo] [profile.test_receive_timeout] 3000
[INFO] Executed tasks
[INFO]
[INFO] --- maven-enforcer-plugin:3.0.0-M2:enforce (enforce-maven-version) @ qpid-perftests-systests ---
[INFO]
[INFO] --- maven-enforcer-plugin:3.0.0-M2:enforce (enforce-minimum-versions) @ qpid-perftests-systests ---
[INFO]
[INFO] --- maven-enforcer-plugin:3.0.0-M2:enforce (enforce-versions-standard-properties) @ qpid-perftests-systests ---
[INFO]
[INFO] --- maven-enforcer-plugin:3.0.0-M2:enforce (enforce-enableAmqp0x) @ qpid-perftests-systests ---
[INFO]
[INFO] --- jacoco-maven-plugin:0.8.2:prepare-agent (default-prepare-agent) @ qpid-perftests-systests ---
[INFO] Skipping JaCoCo execution because property jacoco.skip is set.
[INFO]
[INFO] --- maven-remote-resources-plugin:1.5:process (process-resource-bundles) @ qpid-perftests-systests ---
[INFO]
[INFO] --- maven-resources-plugin:3.1.0:resources (default-resources) @ qpid-perftests-systests ---
[INFO] Using 'UTF-8' encoding to copy filtered resources.
[INFO] skip non existing resourceDirectory /home/jenkins/jenkins-slave/workspace/Qpid-Broker-J-7.1.x-TestMatrix/Ubuntu Slaves/ubuntu&&!H25/jdk/JDK 1.8 (latest)/profile/java-bdb.1-0/qpid-perftests-systests/src/main/resources
[INFO] Copying 3 resources
[INFO]
[INFO] --- maven-compiler-plugin:3.7.0:compile (default-compile) @ qpid-perftests-systests ---
[INFO] No sources to compile
[INFO]
[INFO] --- maven-resources-plugin:3.1.0:testResources (default-testResources) @ qpid-perftests-systests ---
[INFO] Using 'UTF-8' encoding to copy filtered resources.
[INFO] Copying 0 resource
[INFO] Copying 4 resources
[INFO] Copying 3 resources
[INFO]
[INFO] --- maven-compiler-plugin:3.7.0:testCompile (default-testCompile) @ qpid-perftests-systests ---
[INFO] Compiling 1 source file to /home/jenkins/jenkins-slave/workspace/Qpid-Broker-J-7.1.x-TestMatrix/Ubuntu Slaves/ubuntu&&!H25/jdk/JDK 1.8 (latest)/profile/java-bdb.1-0/qpid-perftests-systests/target/test-classes
[INFO]
[INFO] --- maven-surefire-plugin:2.22.0:test (default-test) @ qpid-perftests-systests ---
[INFO] Tests are skipped.
[INFO]
[INFO] --- maven-jar-plugin:3.1.0:jar (default-jar) @ qpid-perftests-systests ---
[INFO] Building jar: /home/jenkins/jenkins-slave/workspace/Qpid-Broker-J-7.1.x-TestMatrix/Ubuntu Slaves/ubuntu&&!H25/jdk/JDK 1.8 (latest)/profile/java-bdb.1-0/qpid-perftests-systests/target/qpid-perftests-systests-7.1.7-SNAPSHOT.jar
[INFO]
[INFO] --- maven-site-plugin:3.7.1:attach-descriptor (attach-descriptor) @ qpid-perftests-systests ---
[INFO] Skipping because packaging 'jar' is not pom.
[INFO]
[INFO] --- maven-surefire-plugin:2.22.0:test (integration-test) @ qpid-perftests-systests ---
[INFO]
[INFO] -------------------------------------------------------
[INFO] T E S T S
[INFO] -------------------------------------------------------
[INFO] Running org.apache.qpid.systest.disttest.endtoend.EndToEndTest
FATAL: command execution failed
java.io.EOFException
at java.io.ObjectInputStream$PeekInputStream.readFully(ObjectInputStream.java:2681)
at java.io.ObjectInputStream$BlockDataInputStream.readShort(ObjectInputStream.java:3156)
at java.io.ObjectInputStream.readStreamHeader(ObjectInputStream.java:862)
at java.io.ObjectInputStream.<init>(ObjectInputStream.java:358)
at hudson.remoting.ObjectInputStreamEx.<init>(ObjectInputStreamEx.java:49)
at hudson.remoting.Command.readFrom(Command.java:140)
at hudson.remoting.Command.readFrom(Command.java:126)
at hudson.remoting.AbstractSynchronousByteArrayCommandTransport.read(AbstractSynchronousByteArrayCommandTransport.java:36)
at hudson.remoting.SynchronousCommandTransport$ReaderThread.run(SynchronousCommandTransport.java:63)
Caused: java.io.IOException: Unexpected termination of the channel
at hudson.remoting.SynchronousCommandTransport$ReaderThread.run(SynchronousCommandTransport.java:77)
Caused: hudson.remoting.ChannelClosedException: Channel "unknown": Remote call on H43 failed. The channel is closing down or has closed down
at hudson.remoting.Channel.call(Channel.java:950)
at hudson.remoting.RemoteInvocationHandler.invoke(RemoteInvocationHandler.java:283)
at com.sun.proxy.$Proxy141.isAlive(Unknown Source)
at hudson.Launcher$RemoteLauncher$ProcImpl.isAlive(Launcher.java:1150)
at hudson.Launcher$RemoteLauncher$ProcImpl.join(Launcher.java:1142)
at hudson.Launcher$ProcStarter.join(Launcher.java:470)
at hudson.tasks.Maven.perform(Maven.java:368)
at hudson.tasks.BuildStepMonitor$1.perform(BuildStepMonitor.java:20)
at hudson.model.AbstractBuild$AbstractBuildExecution.perform(AbstractBuild.java:741)
at hudson.model.Build$BuildExecution.build(Build.java:206)
at hudson.model.Build$BuildExecution.doRun(Build.java:163)
at hudson.model.AbstractBuild$AbstractBuildExecution.run(AbstractBuild.java:504)
at hudson.model.Run.execute(Run.java:1815)
at hudson.matrix.MatrixRun.run(MatrixRun.java:153)
at hudson.model.ResourceController.execute(ResourceController.java:97)
at hudson.model.Executor.run(Executor.java:429)
Build step 'Invoke top-level Maven targets' marked build as failure
ERROR: Step ?Archive the artifacts? failed: no workspace for Qpid-Broker-J-7.1.x-TestMatrix/Ubuntu Slaves=ubuntu&&!H25,jdk=JDK 1.8 (latest),profile=java-bdb.1-0 #84
Performing Post build task...
Match found for : : True
Logical operation result is TRUE
Running script : echo Finishing build
date
Exception when executing the batch command : no workspace from node hudson.slaves.DumbSlave[H43] which is computer hudson.slaves.SlaveComputer@43051538 and has channel null
Build step 'Post build task' marked build as failure
ERROR: Step ?Publish JUnit test result report? failed: no workspace for Qpid-Broker-J-7.1.x-TestMatrix/Ubuntu Slaves=ubuntu&&!H25,jdk=JDK 1.8 (latest),profile=java-bdb.1-0 #84
ERROR: H43 is offline; cannot locate JDK 1.8 (latest)
Build failed in Jenkins: Qpid-Broker-J-7.1.x-TestMatrix » ubuntu&&!H25,JDK 1.8 (latest),java-bdb.1-0 #83
Posted by Apache Jenkins Server <je...@builds.apache.org>.
See <https://builds.apache.org/job/Qpid-Broker-J-7.1.x-TestMatrix/Ubuntu%20Slaves=ubuntu&&!H25,jdk=JDK%201.8%20(latest),profile=java-bdb.1-0/83/display/redirect>
Changes:
------------------------------------------
Started by upstream project "Qpid-Broker-J-7.1.x-TestMatrix" build number 83
originally caused by:
Started by an SCM change
Running as SYSTEM
ERROR: H39 is offline; cannot locate JDK 1.8 (latest)
ERROR: Issue with creating launcher for agent H39. The agent has not been fully initialized yet
[EnvInject] - Loading node environment variables.
ERROR: H39 is offline; cannot locate JDK 1.8 (latest)
ERROR: H39 is offline; cannot locate JDK 1.8 (latest)
ERROR: H39 is offline; cannot locate JDK 1.8 (latest)
Building remotely on H39 (ubuntu xenial)FATAL: Cannot retrieve the node's workspace for hudson.matrix.MatrixProject@1829f9dc[Qpid-Broker-J-7.1.x-TestMatrix]. Most probably the node is offline
java.io.IOException: Cannot retrieve the node's workspace for hudson.matrix.MatrixProject@1829f9dc[Qpid-Broker-J-7.1.x-TestMatrix]. Most probably the node is offline
at hudson.matrix.MatrixRun$MatrixRunExecution.getParentWorkspaceLease(MatrixRun.java:173)
at hudson.matrix.MatrixRun$MatrixRunExecution.decideWorkspace(MatrixRun.java:187)
at hudson.model.AbstractBuild$AbstractBuildExecution.run(AbstractBuild.java:488)
at hudson.model.Run.execute(Run.java:1815)
at hudson.matrix.MatrixRun.run(MatrixRun.java:153)
at hudson.model.ResourceController.execute(ResourceController.java:97)
at hudson.model.Executor.run(Executor.java:429)
ERROR: Step ?Archive the artifacts? failed: no workspace for Qpid-Broker-J-7.1.x-TestMatrix/Ubuntu Slaves=ubuntu&&!H25,jdk=JDK 1.8 (latest),profile=java-bdb.1-0 #83
Performing Post build task...
Match found for : : True
Logical operation result is TRUE
Running script : echo Finishing build
date
Exception when executing the batch command : no workspace from node hudson.slaves.DumbSlave[H39] which is computer hudson.slaves.SlaveComputer@4eb6e001 and has channel null
Build step 'Post build task' marked build as failure
ERROR: Step ?Publish JUnit test result report? failed: no workspace for Qpid-Broker-J-7.1.x-TestMatrix/Ubuntu Slaves=ubuntu&&!H25,jdk=JDK 1.8 (latest),profile=java-bdb.1-0 #83
ERROR: H39 is offline; cannot locate JDK 1.8 (latest)