You are viewing a plain text version of this content. The canonical link for it is here.
Posted to notifications@zookeeper.apache.org by Apache Jenkins Server <je...@builds.apache.org> on 2020/05/18 15:06:30 UTC

Build failed in Jenkins: PreCommit-ZOOKEEPER-github-pr-build-maven #2047

See <https://builds.apache.org/job/PreCommit-ZOOKEEPER-github-pr-build-maven/2047/display/redirect>

Changes:


------------------------------------------
[...truncated 790.87 KB...]
[ERROR] src/test/java/org/apache/zookeeper/common/CertificatesToPlayWith.java:[359,90] (whitespace) OperatorWrap: '+' should be on a new line.
[ERROR] src/test/java/org/apache/zookeeper/common/CertificatesToPlayWith.java:[360,90] (whitespace) OperatorWrap: '+' should be on a new line.
[ERROR] src/test/java/org/apache/zookeeper/common/CertificatesToPlayWith.java:[361,90] (whitespace) OperatorWrap: '+' should be on a new line.
[ERROR] src/test/java/org/apache/zookeeper/common/CertificatesToPlayWith.java:[362,90] (whitespace) OperatorWrap: '+' should be on a new line.
[ERROR] src/test/java/org/apache/zookeeper/common/CertificatesToPlayWith.java:[363,90] (whitespace) OperatorWrap: '+' should be on a new line.
[ERROR] src/test/java/org/apache/zookeeper/common/CertificatesToPlayWith.java:[364,90] (whitespace) OperatorWrap: '+' should be on a new line.
[ERROR] src/test/java/org/apache/zookeeper/common/CertificatesToPlayWith.java:[365,90] (whitespace) OperatorWrap: '+' should be on a new line.
[ERROR] src/test/java/org/apache/zookeeper/common/CertificatesToPlayWith.java:[366,90] (whitespace) OperatorWrap: '+' should be on a new line.
[ERROR] src/test/java/org/apache/zookeeper/common/CertificatesToPlayWith.java:[367,90] (whitespace) OperatorWrap: '+' should be on a new line.
[ERROR] src/test/java/org/apache/zookeeper/common/CertificatesToPlayWith.java:[368,90] (whitespace) OperatorWrap: '+' should be on a new line.
[ERROR] src/test/java/org/apache/zookeeper/common/CertificatesToPlayWith.java:[369,90] (whitespace) OperatorWrap: '+' should be on a new line.
[ERROR] src/test/java/org/apache/zookeeper/common/CertificatesToPlayWith.java:[370,90] (whitespace) OperatorWrap: '+' should be on a new line.
[ERROR] src/test/java/org/apache/zookeeper/common/CertificatesToPlayWith.java:[371,90] (whitespace) OperatorWrap: '+' should be on a new line.
[ERROR] src/test/java/org/apache/zookeeper/common/CertificatesToPlayWith.java:[372,90] (whitespace) OperatorWrap: '+' should be on a new line.
[ERROR] src/test/java/org/apache/zookeeper/common/CertificatesToPlayWith.java:[373,34] (whitespace) OperatorWrap: '+' should be on a new line.
[ERROR] src/test/java/org/apache/zookeeper/common/CertificatesToPlayWith.java:[381,18] (modifier) ModifierOrder: 'static' modifier out of order with the JLS suggestions.
[ERROR] src/test/java/org/apache/zookeeper/common/CertificatesToPlayWith.java:[382,76] (whitespace) OperatorWrap: '+' should be on a new line.
[ERROR] src/test/java/org/apache/zookeeper/common/CertificatesToPlayWith.java:[383,84] (whitespace) OperatorWrap: '+' should be on a new line.
[ERROR] src/test/java/org/apache/zookeeper/common/CertificatesToPlayWith.java:[384,84] (whitespace) OperatorWrap: '+' should be on a new line.
[ERROR] src/test/java/org/apache/zookeeper/common/CertificatesToPlayWith.java:[385,84] (whitespace) OperatorWrap: '+' should be on a new line.
[ERROR] src/test/java/org/apache/zookeeper/common/CertificatesToPlayWith.java:[386,84] (whitespace) OperatorWrap: '+' should be on a new line.
[ERROR] src/test/java/org/apache/zookeeper/common/CertificatesToPlayWith.java:[387,84] (whitespace) OperatorWrap: '+' should be on a new line.
[ERROR] src/test/java/org/apache/zookeeper/common/CertificatesToPlayWith.java:[388,84] (whitespace) OperatorWrap: '+' should be on a new line.
[ERROR] src/test/java/org/apache/zookeeper/common/CertificatesToPlayWith.java:[389,84] (whitespace) OperatorWrap: '+' should be on a new line.
[ERROR] src/test/java/org/apache/zookeeper/common/CertificatesToPlayWith.java:[392,18] (modifier) ModifierOrder: 'static' modifier out of order with the JLS suggestions.
[ERROR] src/test/java/org/apache/zookeeper/common/CertificatesToPlayWith.java:[394,18] (modifier) ModifierOrder: 'static' modifier out of order with the JLS suggestions.
[ERROR] src/test/java/org/apache/zookeeper/common/CertificatesToPlayWith.java:[395,76] (whitespace) OperatorWrap: '+' should be on a new line.
[ERROR] src/test/java/org/apache/zookeeper/common/CertificatesToPlayWith.java:[396,84] (whitespace) OperatorWrap: '+' should be on a new line.
[ERROR] src/test/java/org/apache/zookeeper/common/CertificatesToPlayWith.java:[397,84] (whitespace) OperatorWrap: '+' should be on a new line.
[ERROR] src/test/java/org/apache/zookeeper/common/CertificatesToPlayWith.java:[398,84] (whitespace) OperatorWrap: '+' should be on a new line.
[ERROR] src/test/java/org/apache/zookeeper/common/CertificatesToPlayWith.java:[399,84] (whitespace) OperatorWrap: '+' should be on a new line.
[ERROR] src/test/java/org/apache/zookeeper/common/CertificatesToPlayWith.java:[400,84] (whitespace) OperatorWrap: '+' should be on a new line.
[ERROR] src/test/java/org/apache/zookeeper/common/CertificatesToPlayWith.java:[401,84] (whitespace) OperatorWrap: '+' should be on a new line.
[ERROR] src/test/java/org/apache/zookeeper/common/CertificatesToPlayWith.java:[402,84] (whitespace) OperatorWrap: '+' should be on a new line.
[ERROR] src/test/java/org/apache/zookeeper/common/CertificatesToPlayWith.java:[405,18] (modifier) ModifierOrder: 'static' modifier out of order with the JLS suggestions.
[ERROR] src/test/java/org/apache/zookeeper/common/CertificatesToPlayWith.java:[406,76] (whitespace) OperatorWrap: '+' should be on a new line.
[ERROR] src/test/java/org/apache/zookeeper/common/CertificatesToPlayWith.java:[407,84] (whitespace) OperatorWrap: '+' should be on a new line.
[ERROR] src/test/java/org/apache/zookeeper/common/CertificatesToPlayWith.java:[408,84] (whitespace) OperatorWrap: '+' should be on a new line.
[ERROR] src/test/java/org/apache/zookeeper/common/CertificatesToPlayWith.java:[409,84] (whitespace) OperatorWrap: '+' should be on a new line.
[ERROR] src/test/java/org/apache/zookeeper/common/CertificatesToPlayWith.java:[412,18] (modifier) ModifierOrder: 'static' modifier out of order with the JLS suggestions.
[ERROR] src/test/java/org/apache/zookeeper/common/CertificatesToPlayWith.java:[413,76] (whitespace) OperatorWrap: '+' should be on a new line.
[ERROR] src/test/java/org/apache/zookeeper/common/CertificatesToPlayWith.java:[414,84] (whitespace) OperatorWrap: '+' should be on a new line.
[ERROR] src/test/java/org/apache/zookeeper/common/CertificatesToPlayWith.java:[415,84] (whitespace) OperatorWrap: '+' should be on a new line.
[ERROR] src/test/java/org/apache/zookeeper/common/CertificatesToPlayWith.java:[416,84] (whitespace) OperatorWrap: '+' should be on a new line.
[ERROR] src/test/java/org/apache/zookeeper/common/CertificatesToPlayWith.java:[419,18] (modifier) ModifierOrder: 'static' modifier out of order with the JLS suggestions.
[ERROR] src/test/java/org/apache/zookeeper/common/CertificatesToPlayWith.java:[420,76] (whitespace) OperatorWrap: '+' should be on a new line.
[ERROR] src/test/java/org/apache/zookeeper/common/CertificatesToPlayWith.java:[421,84] (whitespace) OperatorWrap: '+' should be on a new line.
[ERROR] src/test/java/org/apache/zookeeper/common/CertificatesToPlayWith.java:[422,84] (whitespace) OperatorWrap: '+' should be on a new line.
[ERROR] src/test/java/org/apache/zookeeper/common/CertificatesToPlayWith.java:[423,84] (whitespace) OperatorWrap: '+' should be on a new line.
[ERROR] src/test/java/org/apache/zookeeper/common/CertificatesToPlayWith.java:[426,18] (modifier) ModifierOrder: 'static' modifier out of order with the JLS suggestions.
[ERROR] src/test/java/org/apache/zookeeper/common/CertificatesToPlayWith.java:[427,76] (whitespace) OperatorWrap: '+' should be on a new line.
[ERROR] src/test/java/org/apache/zookeeper/common/CertificatesToPlayWith.java:[428,84] (whitespace) OperatorWrap: '+' should be on a new line.
[ERROR] src/test/java/org/apache/zookeeper/common/CertificatesToPlayWith.java:[429,84] (whitespace) OperatorWrap: '+' should be on a new line.
[ERROR] src/test/java/org/apache/zookeeper/common/CertificatesToPlayWith.java:[430,84] (whitespace) OperatorWrap: '+' should be on a new line.
[ERROR] src/test/java/org/apache/zookeeper/common/CertificatesToPlayWith.java:[433,18] (modifier) ModifierOrder: 'static' modifier out of order with the JLS suggestions.
[ERROR] src/test/java/org/apache/zookeeper/common/CertificatesToPlayWith.java:[434,76] (whitespace) OperatorWrap: '+' should be on a new line.
[ERROR] src/test/java/org/apache/zookeeper/common/CertificatesToPlayWith.java:[435,84] (whitespace) OperatorWrap: '+' should be on a new line.
[ERROR] src/test/java/org/apache/zookeeper/common/CertificatesToPlayWith.java:[436,84] (whitespace) OperatorWrap: '+' should be on a new line.
[ERROR] src/test/java/org/apache/zookeeper/common/CertificatesToPlayWith.java:[437,84] (whitespace) OperatorWrap: '+' should be on a new line.
[ERROR] src/test/java/org/apache/zookeeper/common/CertificatesToPlayWith.java:[443,18] (modifier) ModifierOrder: 'static' modifier out of order with the JLS suggestions.
[ERROR] src/test/java/org/apache/zookeeper/common/CertificatesToPlayWith.java:[444,45] (whitespace) OperatorWrap: '+' should be on a new line.
[ERROR] src/test/java/org/apache/zookeeper/common/CertificatesToPlayWith.java:[445,90] (whitespace) OperatorWrap: '+' should be on a new line.
[ERROR] src/test/java/org/apache/zookeeper/common/CertificatesToPlayWith.java:[446,90] (whitespace) OperatorWrap: '+' should be on a new line.
[ERROR] src/test/java/org/apache/zookeeper/common/CertificatesToPlayWith.java:[447,90] (whitespace) OperatorWrap: '+' should be on a new line.
[ERROR] src/test/java/org/apache/zookeeper/common/CertificatesToPlayWith.java:[448,90] (whitespace) OperatorWrap: '+' should be on a new line.
[ERROR] src/test/java/org/apache/zookeeper/common/CertificatesToPlayWith.java:[449,90] (whitespace) OperatorWrap: '+' should be on a new line.
[ERROR] src/test/java/org/apache/zookeeper/common/CertificatesToPlayWith.java:[450,90] (whitespace) OperatorWrap: '+' should be on a new line.
[ERROR] src/test/java/org/apache/zookeeper/common/CertificatesToPlayWith.java:[451,90] (whitespace) OperatorWrap: '+' should be on a new line.
[ERROR] src/test/java/org/apache/zookeeper/common/CertificatesToPlayWith.java:[452,90] (whitespace) OperatorWrap: '+' should be on a new line.
[ERROR] src/test/java/org/apache/zookeeper/common/CertificatesToPlayWith.java:[453,90] (whitespace) OperatorWrap: '+' should be on a new line.
[ERROR] src/test/java/org/apache/zookeeper/common/CertificatesToPlayWith.java:[454,90] (whitespace) OperatorWrap: '+' should be on a new line.
[ERROR] src/test/java/org/apache/zookeeper/common/CertificatesToPlayWith.java:[455,90] (whitespace) OperatorWrap: '+' should be on a new line.
[ERROR] src/test/java/org/apache/zookeeper/common/CertificatesToPlayWith.java:[456,90] (whitespace) OperatorWrap: '+' should be on a new line.
[ERROR] src/test/java/org/apache/zookeeper/common/CertificatesToPlayWith.java:[457,90] (whitespace) OperatorWrap: '+' should be on a new line.
[ERROR] src/test/java/org/apache/zookeeper/common/CertificatesToPlayWith.java:[458,90] (whitespace) OperatorWrap: '+' should be on a new line.
[ERROR] src/test/java/org/apache/zookeeper/common/CertificatesToPlayWith.java:[459,90] (whitespace) OperatorWrap: '+' should be on a new line.
[ERROR] src/test/java/org/apache/zookeeper/common/CertificatesToPlayWith.java:[460,90] (whitespace) OperatorWrap: '+' should be on a new line.
[ERROR] src/test/java/org/apache/zookeeper/common/CertificatesToPlayWith.java:[461,90] (whitespace) OperatorWrap: '+' should be on a new line.
[ERROR] src/test/java/org/apache/zookeeper/common/CertificatesToPlayWith.java:[462,90] (whitespace) OperatorWrap: '+' should be on a new line.
[ERROR] src/test/java/org/apache/zookeeper/common/CertificatesToPlayWith.java:[463,54] (whitespace) OperatorWrap: '+' should be on a new line.
[ERROR] src/test/java/org/apache/zookeeper/common/CertificatesToPlayWith.java:[469,18] (modifier) ModifierOrder: 'static' modifier out of order with the JLS suggestions.
[ERROR] src/test/java/org/apache/zookeeper/common/CertificatesToPlayWith.java:[470,45] (whitespace) OperatorWrap: '+' should be on a new line.
[ERROR] src/test/java/org/apache/zookeeper/common/CertificatesToPlayWith.java:[471,90] (whitespace) OperatorWrap: '+' should be on a new line.
[ERROR] src/test/java/org/apache/zookeeper/common/CertificatesToPlayWith.java:[472,90] (whitespace) OperatorWrap: '+' should be on a new line.
[ERROR] src/test/java/org/apache/zookeeper/common/CertificatesToPlayWith.java:[473,90] (whitespace) OperatorWrap: '+' should be on a new line.
[ERROR] src/test/java/org/apache/zookeeper/common/CertificatesToPlayWith.java:[474,90] (whitespace) OperatorWrap: '+' should be on a new line.
[ERROR] src/test/java/org/apache/zookeeper/common/CertificatesToPlayWith.java:[475,90] (whitespace) OperatorWrap: '+' should be on a new line.
[ERROR] src/test/java/org/apache/zookeeper/common/CertificatesToPlayWith.java:[476,90] (whitespace) OperatorWrap: '+' should be on a new line.
[ERROR] src/test/java/org/apache/zookeeper/common/CertificatesToPlayWith.java:[477,90] (whitespace) OperatorWrap: '+' should be on a new line.
[ERROR] src/test/java/org/apache/zookeeper/common/CertificatesToPlayWith.java:[478,90] (whitespace) OperatorWrap: '+' should be on a new line.
[ERROR] src/test/java/org/apache/zookeeper/common/CertificatesToPlayWith.java:[479,90] (whitespace) OperatorWrap: '+' should be on a new line.
[ERROR] src/test/java/org/apache/zookeeper/common/CertificatesToPlayWith.java:[480,90] (whitespace) OperatorWrap: '+' should be on a new line.
[ERROR] src/test/java/org/apache/zookeeper/common/CertificatesToPlayWith.java:[481,90] (whitespace) OperatorWrap: '+' should be on a new line.
[ERROR] src/test/java/org/apache/zookeeper/common/CertificatesToPlayWith.java:[482,90] (whitespace) OperatorWrap: '+' should be on a new line.
[ERROR] src/test/java/org/apache/zookeeper/common/CertificatesToPlayWith.java:[483,90] (whitespace) OperatorWrap: '+' should be on a new line.
[ERROR] src/test/java/org/apache/zookeeper/common/CertificatesToPlayWith.java:[484,90] (whitespace) OperatorWrap: '+' should be on a new line.
[ERROR] src/test/java/org/apache/zookeeper/common/CertificatesToPlayWith.java:[485,90] (whitespace) OperatorWrap: '+' should be on a new line.
[ERROR] src/test/java/org/apache/zookeeper/common/CertificatesToPlayWith.java:[486,90] (whitespace) OperatorWrap: '+' should be on a new line.
[ERROR] src/test/java/org/apache/zookeeper/common/CertificatesToPlayWith.java:[487,90] (whitespace) OperatorWrap: '+' should be on a new line.
[ERROR] src/test/java/org/apache/zookeeper/common/CertificatesToPlayWith.java:[488,90] (whitespace) OperatorWrap: '+' should be on a new line.
[ERROR] src/test/java/org/apache/zookeeper/common/CertificatesToPlayWith.java:[489,90] (whitespace) OperatorWrap: '+' should be on a new line.
[ERROR] src/test/java/org/apache/zookeeper/common/CertificatesToPlayWith.java:[490,90] (whitespace) OperatorWrap: '+' should be on a new line.
[ERROR] src/test/java/org/apache/zookeeper/common/CertificatesToPlayWith.java:[491,90] (whitespace) OperatorWrap: '+' should be on a new line.
[ERROR] src/test/java/org/apache/zookeeper/common/CertificatesToPlayWith.java:[492,90] (whitespace) OperatorWrap: '+' should be on a new line.
[ERROR] src/test/java/org/apache/zookeeper/common/CertificatesToPlayWith.java:[493,90] (whitespace) OperatorWrap: '+' should be on a new line.
[ERROR] src/test/java/org/apache/zookeeper/common/CertificatesToPlayWith.java:[494,90] (whitespace) OperatorWrap: '+' should be on a new line.
[ERROR] src/test/java/org/apache/zookeeper/common/CertificatesToPlayWith.java:[495,90] (whitespace) OperatorWrap: '+' should be on a new line.
[ERROR] src/test/java/org/apache/zookeeper/common/CertificatesToPlayWith.java:[496,90] (whitespace) OperatorWrap: '+' should be on a new line.
[ERROR] src/test/java/org/apache/zookeeper/common/CertificatesToPlayWith.java:[497,90] (whitespace) OperatorWrap: '+' should be on a new line.
[ERROR] src/test/java/org/apache/zookeeper/common/CertificatesToPlayWith.java:[498,90] (whitespace) OperatorWrap: '+' should be on a new line.
[ERROR] src/test/java/org/apache/zookeeper/common/CertificatesToPlayWith.java:[499,90] (whitespace) OperatorWrap: '+' should be on a new line.
[ERROR] src/test/java/org/apache/zookeeper/common/CertificatesToPlayWith.java:[500,90] (whitespace) OperatorWrap: '+' should be on a new line.
[ERROR] src/test/java/org/apache/zookeeper/common/CertificatesToPlayWith.java:[501,86] (whitespace) OperatorWrap: '+' should be on a new line.
[ERROR] src/test/java/org/apache/zookeeper/common/CertificatesToPlayWith.java:[504,18] (modifier) ModifierOrder: 'static' modifier out of order with the JLS suggestions.
[ERROR] src/test/java/org/apache/zookeeper/common/CertificatesToPlayWith.java:[505,45] (whitespace) OperatorWrap: '+' should be on a new line.
[ERROR] src/test/java/org/apache/zookeeper/common/CertificatesToPlayWith.java:[506,90] (whitespace) OperatorWrap: '+' should be on a new line.
[ERROR] src/test/java/org/apache/zookeeper/common/CertificatesToPlayWith.java:[507,90] (whitespace) OperatorWrap: '+' should be on a new line.
[ERROR] src/test/java/org/apache/zookeeper/common/CertificatesToPlayWith.java:[508,90] (whitespace) OperatorWrap: '+' should be on a new line.
[ERROR] src/test/java/org/apache/zookeeper/common/CertificatesToPlayWith.java:[509,90] (whitespace) OperatorWrap: '+' should be on a new line.
[ERROR] src/test/java/org/apache/zookeeper/common/CertificatesToPlayWith.java:[510,90] (whitespace) OperatorWrap: '+' should be on a new line.
[ERROR] src/test/java/org/apache/zookeeper/common/CertificatesToPlayWith.java:[511,90] (whitespace) OperatorWrap: '+' should be on a new line.
[ERROR] src/test/java/org/apache/zookeeper/common/CertificatesToPlayWith.java:[512,90] (whitespace) OperatorWrap: '+' should be on a new line.
[ERROR] src/test/java/org/apache/zookeeper/common/CertificatesToPlayWith.java:[513,90] (whitespace) OperatorWrap: '+' should be on a new line.
[ERROR] src/test/java/org/apache/zookeeper/common/CertificatesToPlayWith.java:[514,90] (whitespace) OperatorWrap: '+' should be on a new line.
[ERROR] src/test/java/org/apache/zookeeper/common/CertificatesToPlayWith.java:[515,90] (whitespace) OperatorWrap: '+' should be on a new line.
[ERROR] src/test/java/org/apache/zookeeper/common/CertificatesToPlayWith.java:[516,90] (whitespace) OperatorWrap: '+' should be on a new line.
[ERROR] src/test/java/org/apache/zookeeper/common/CertificatesToPlayWith.java:[517,90] (whitespace) OperatorWrap: '+' should be on a new line.
[ERROR] src/test/java/org/apache/zookeeper/common/CertificatesToPlayWith.java:[518,90] (whitespace) OperatorWrap: '+' should be on a new line.
[ERROR] src/test/java/org/apache/zookeeper/common/CertificatesToPlayWith.java:[519,90] (whitespace) OperatorWrap: '+' should be on a new line.
[ERROR] src/test/java/org/apache/zookeeper/common/CertificatesToPlayWith.java:[520,42] (whitespace) OperatorWrap: '+' should be on a new line.
[ERROR] src/test/java/org/apache/zookeeper/common/CertificatesToPlayWith.java:[524,18] (modifier) ModifierOrder: 'static' modifier out of order with the JLS suggestions.
[ERROR] src/test/java/org/apache/zookeeper/common/CertificatesToPlayWith.java:[525,45] (whitespace) OperatorWrap: '+' should be on a new line.
[ERROR] src/test/java/org/apache/zookeeper/common/CertificatesToPlayWith.java:[526,90] (whitespace) OperatorWrap: '+' should be on a new line.
[ERROR] src/test/java/org/apache/zookeeper/common/CertificatesToPlayWith.java:[527,90] (whitespace) OperatorWrap: '+' should be on a new line.
[ERROR] src/test/java/org/apache/zookeeper/common/CertificatesToPlayWith.java:[528,90] (whitespace) OperatorWrap: '+' should be on a new line.
[ERROR] src/test/java/org/apache/zookeeper/common/CertificatesToPlayWith.java:[529,90] (whitespace) OperatorWrap: '+' should be on a new line.
[ERROR] src/test/java/org/apache/zookeeper/common/CertificatesToPlayWith.java:[530,90] (whitespace) OperatorWrap: '+' should be on a new line.
[ERROR] src/test/java/org/apache/zookeeper/common/CertificatesToPlayWith.java:[531,90] (whitespace) OperatorWrap: '+' should be on a new line.
[ERROR] src/test/java/org/apache/zookeeper/common/CertificatesToPlayWith.java:[532,90] (whitespace) OperatorWrap: '+' should be on a new line.
[ERROR] src/test/java/org/apache/zookeeper/common/CertificatesToPlayWith.java:[533,90] (whitespace) OperatorWrap: '+' should be on a new line.
[ERROR] src/test/java/org/apache/zookeeper/common/CertificatesToPlayWith.java:[534,90] (whitespace) OperatorWrap: '+' should be on a new line.
[ERROR] src/test/java/org/apache/zookeeper/common/CertificatesToPlayWith.java:[535,90] (whitespace) OperatorWrap: '+' should be on a new line.
[ERROR] src/test/java/org/apache/zookeeper/common/CertificatesToPlayWith.java:[536,90] (whitespace) OperatorWrap: '+' should be on a new line.
[ERROR] src/test/java/org/apache/zookeeper/common/CertificatesToPlayWith.java:[537,90] (whitespace) OperatorWrap: '+' should be on a new line.
[ERROR] src/test/java/org/apache/zookeeper/common/CertificatesToPlayWith.java:[538,90] (whitespace) OperatorWrap: '+' should be on a new line.
[ERROR] src/test/java/org/apache/zookeeper/common/CertificatesToPlayWith.java:[539,90] (whitespace) OperatorWrap: '+' should be on a new line.
[ERROR] src/test/java/org/apache/zookeeper/common/CertificatesToPlayWith.java:[540,78] (whitespace) OperatorWrap: '+' should be on a new line.
[ERROR] src/test/java/org/apache/zookeeper/common/CertificatesToPlayWith.java:[544,18] (modifier) ModifierOrder: 'static' modifier out of order with the JLS suggestions.
[ERROR] src/test/java/org/apache/zookeeper/common/CertificatesToPlayWith.java:[545,45] (whitespace) OperatorWrap: '+' should be on a new line.
[ERROR] src/test/java/org/apache/zookeeper/common/CertificatesToPlayWith.java:[546,90] (whitespace) OperatorWrap: '+' should be on a new line.
[ERROR] src/test/java/org/apache/zookeeper/common/CertificatesToPlayWith.java:[547,90] (whitespace) OperatorWrap: '+' should be on a new line.
[ERROR] src/test/java/org/apache/zookeeper/common/CertificatesToPlayWith.java:[548,90] (whitespace) OperatorWrap: '+' should be on a new line.
[ERROR] src/test/java/org/apache/zookeeper/common/CertificatesToPlayWith.java:[549,90] (whitespace) OperatorWrap: '+' should be on a new line.
[ERROR] src/test/java/org/apache/zookeeper/common/CertificatesToPlayWith.java:[550,90] (whitespace) OperatorWrap: '+' should be on a new line.
[ERROR] src/test/java/org/apache/zookeeper/common/CertificatesToPlayWith.java:[551,90] (whitespace) OperatorWrap: '+' should be on a new line.
[ERROR] src/test/java/org/apache/zookeeper/common/CertificatesToPlayWith.java:[552,90] (whitespace) OperatorWrap: '+' should be on a new line.
[ERROR] src/test/java/org/apache/zookeeper/common/CertificatesToPlayWith.java:[553,90] (whitespace) OperatorWrap: '+' should be on a new line.
[ERROR] src/test/java/org/apache/zookeeper/common/CertificatesToPlayWith.java:[554,90] (whitespace) OperatorWrap: '+' should be on a new line.
[ERROR] src/test/java/org/apache/zookeeper/common/CertificatesToPlayWith.java:[555,90] (whitespace) OperatorWrap: '+' should be on a new line.
[ERROR] src/test/java/org/apache/zookeeper/common/CertificatesToPlayWith.java:[556,90] (whitespace) OperatorWrap: '+' should be on a new line.
[ERROR] src/test/java/org/apache/zookeeper/common/CertificatesToPlayWith.java:[557,90] (whitespace) OperatorWrap: '+' should be on a new line.
[ERROR] src/test/java/org/apache/zookeeper/common/CertificatesToPlayWith.java:[558,90] (whitespace) OperatorWrap: '+' should be on a new line.
[ERROR] src/test/java/org/apache/zookeeper/common/CertificatesToPlayWith.java:[559,90] (whitespace) OperatorWrap: '+' should be on a new line.
[ERROR] src/test/java/org/apache/zookeeper/common/CertificatesToPlayWith.java:[560,90] (whitespace) OperatorWrap: '+' should be on a new line.
[ERROR] src/test/java/org/apache/zookeeper/common/CertificatesToPlayWith.java:[561,90] (whitespace) OperatorWrap: '+' should be on a new line.
[ERROR] src/test/java/org/apache/zookeeper/common/CertificatesToPlayWith.java:[562,90] (whitespace) OperatorWrap: '+' should be on a new line.
[ERROR] src/test/java/org/apache/zookeeper/common/CertificatesToPlayWith.java:[563,90] (whitespace) OperatorWrap: '+' should be on a new line.
[ERROR] src/test/java/org/apache/zookeeper/common/CertificatesToPlayWith.java:[564,90] (whitespace) OperatorWrap: '+' should be on a new line.
[ERROR] src/test/java/org/apache/zookeeper/common/CertificatesToPlayWith.java:[565,62] (whitespace) OperatorWrap: '+' should be on a new line.
[ERROR] src/test/java/org/apache/zookeeper/common/ZKHostnameVerifierTest.java:[26] (imports) ImportOrder: Extra separation in import group before 'javax.net.ssl.SSLException'
[ERROR] src/test/java/org/apache/zookeeper/common/ZKHostnameVerifierTest.java:[28] (imports) ImportOrder: Extra separation in import group before 'org.junit.Assert'
[ERROR] src/test/java/org/apache/zookeeper/common/ZKHostnameVerifierTest.java:[156,9] (blocks) RightCurly: '}' at column 9 should be on the same line as the next part of a multi-block statement (one that directly contains multiple blocks: if/else-if/else, do/while or try/catch/finally).
[ERROR] src/test/java/org/apache/zookeeper/common/ZKHostnameVerifierTest.java:[157,9] (whitespace) WhitespaceAround: 'catch' is not followed by whitespace.
[INFO] ------------------------------------------------------------------------
[INFO] Reactor Summary for Apache ZooKeeper 3.7.0-SNAPSHOT:
[INFO] 
[INFO] Apache ZooKeeper ................................... SUCCESS [ 23.166 s]
[INFO] Apache ZooKeeper - Documentation ................... SUCCESS [  6.152 s]
[INFO] Apache ZooKeeper - Jute ............................ SUCCESS [01:35 min]
[INFO] Apache ZooKeeper - Server .......................... FAILURE [19:20 min]
[INFO] Apache ZooKeeper - Metrics Providers ............... SKIPPED
[INFO] Apache ZooKeeper - Prometheus.io Metrics Provider .. SKIPPED
[INFO] Apache ZooKeeper - Client .......................... SKIPPED
[INFO] Apache ZooKeeper - Client - C ...................... SKIPPED
[INFO] Apache ZooKeeper - Recipes ......................... SKIPPED
[INFO] Apache ZooKeeper - Recipes - Election .............. SKIPPED
[INFO] Apache ZooKeeper - Recipes - Lock .................. SKIPPED
[INFO] Apache ZooKeeper - Recipes - Queue ................. SKIPPED
[INFO] Apache ZooKeeper - Assembly ........................ SKIPPED
[INFO] Apache ZooKeeper - Tests ........................... SKIPPED
[INFO] Apache ZooKeeper - Contrib ......................... SKIPPED
[INFO] Apache ZooKeeper - Contrib - Fatjar ................ SKIPPED
[INFO] Apache ZooKeeper - Contrib - Loggraph .............. SKIPPED
[INFO] Apache ZooKeeper - Contrib - Rest .................. SKIPPED
[INFO] Apache ZooKeeper - Contrib - ZooInspector .......... SKIPPED
[INFO] ------------------------------------------------------------------------
[INFO] BUILD FAILURE
[INFO] ------------------------------------------------------------------------
[INFO] Total time:  22:02 min
[INFO] Finished at: 2020-05-18T15:04:48Z
[INFO] ------------------------------------------------------------------------
Waiting for Jenkins to finish collecting data
[ERROR] Failed to execute goal org.apache.maven.plugins:maven-checkstyle-plugin:3.1.0:check (default-cli) on project zookeeper: You have 441 Checkstyle violations. -> [Help 1]
[ERROR] 
[ERROR] To see the full stack trace of the errors, re-run Maven with the -e switch.
[ERROR] Re-run Maven using the -X switch to enable full debug logging.
[ERROR] 
[ERROR] For more information about the errors and possible solutions, please read the following articles:
[ERROR] [Help 1] http://cwiki.apache.org/confluence/display/MAVEN/MojoFailureException
[ERROR] 
[ERROR] After correcting the problems, you can resume the build with the command
[ERROR]   mvn <goals> -rf :zookeeper
[JENKINS] Archiving <https://builds.apache.org/job/PreCommit-ZOOKEEPER-github-pr-build-maven/ws/zookeeper-server/pom.xml> to org.apache.zookeeper/zookeeper/3.7.0-SNAPSHOT/zookeeper-3.7.0-SNAPSHOT.pom
[JENKINS] Archiving <https://builds.apache.org/job/PreCommit-ZOOKEEPER-github-pr-build-maven/ws/zookeeper-server/target/zookeeper-3.7.0-SNAPSHOT.jar> to org.apache.zookeeper/zookeeper/3.7.0-SNAPSHOT/zookeeper-3.7.0-SNAPSHOT.jar
[JENKINS] Archiving <https://builds.apache.org/job/PreCommit-ZOOKEEPER-github-pr-build-maven/ws/zookeeper-server/target/zookeeper-3.7.0-SNAPSHOT-tests.jar> to org.apache.zookeeper/zookeeper/3.7.0-SNAPSHOT/zookeeper-3.7.0-SNAPSHOT-tests.jar
[JENKINS] Archiving <https://builds.apache.org/job/PreCommit-ZOOKEEPER-github-pr-build-maven/ws/zookeeper-server/target/zookeeper-3.7.0-SNAPSHOT-sources.jar> to org.apache.zookeeper/zookeeper/3.7.0-SNAPSHOT/zookeeper-3.7.0-SNAPSHOT-sources.jar
[JENKINS] Archiving <https://builds.apache.org/job/PreCommit-ZOOKEEPER-github-pr-build-maven/ws/zookeeper-server/target/zookeeper-3.7.0-SNAPSHOT-javadoc.jar> to org.apache.zookeeper/zookeeper/3.7.0-SNAPSHOT/zookeeper-3.7.0-SNAPSHOT-javadoc.jar
[JENKINS] Archiving <https://builds.apache.org/job/PreCommit-ZOOKEEPER-github-pr-build-maven/ws/zookeeper-contrib/zookeeper-contrib-loggraph/pom.xml> to org.apache.zookeeper/zookeeper-contrib-loggraph/3.7.0-SNAPSHOT/zookeeper-contrib-loggraph-3.7.0-SNAPSHOT.pom
[JENKINS] Archiving <https://builds.apache.org/job/PreCommit-ZOOKEEPER-github-pr-build-maven/ws/zookeeper-metrics-providers/pom.xml> to org.apache.zookeeper/zookeeper-metrics-providers/3.7.0-SNAPSHOT/zookeeper-metrics-providers-3.7.0-SNAPSHOT.pom
[JENKINS] Archiving <https://builds.apache.org/job/PreCommit-ZOOKEEPER-github-pr-build-maven/ws/zookeeper-metrics-providers/zookeeper-prometheus-metrics/pom.xml> to org.apache.zookeeper/zookeeper-prometheus-metrics/3.7.0-SNAPSHOT/zookeeper-prometheus-metrics-3.7.0-SNAPSHOT.pom
[JENKINS] Archiving <https://builds.apache.org/job/PreCommit-ZOOKEEPER-github-pr-build-maven/ws/zookeeper-recipes/zookeeper-recipes-election/pom.xml> to org.apache.zookeeper/zookeeper-recipes-election/3.7.0-SNAPSHOT/zookeeper-recipes-election-3.7.0-SNAPSHOT.pom
[JENKINS] Archiving <https://builds.apache.org/job/PreCommit-ZOOKEEPER-github-pr-build-maven/ws/pom.xml> to org.apache.zookeeper/parent/3.7.0-SNAPSHOT/parent-3.7.0-SNAPSHOT.pom
[Fast Archiver] Compressed 36.76 KB of artifacts by 87.0% relative to #2046
[JENKINS] Archiving <https://builds.apache.org/job/PreCommit-ZOOKEEPER-github-pr-build-maven/ws/zookeeper-recipes/zookeeper-recipes-lock/pom.xml> to org.apache.zookeeper/zookeeper-recipes-lock/3.7.0-SNAPSHOT/zookeeper-recipes-lock-3.7.0-SNAPSHOT.pom
[JENKINS] Archiving <https://builds.apache.org/job/PreCommit-ZOOKEEPER-github-pr-build-maven/ws/zookeeper-contrib/pom.xml> to org.apache.zookeeper/zookeeper-contrib/3.7.0-SNAPSHOT/zookeeper-contrib-3.7.0-SNAPSHOT.pom
[JENKINS] Archiving <https://builds.apache.org/job/PreCommit-ZOOKEEPER-github-pr-build-maven/ws/zookeeper-client/pom.xml> to org.apache.zookeeper/zookeeper-client/3.7.0-SNAPSHOT/zookeeper-client-3.7.0-SNAPSHOT.pom
[JENKINS] Archiving <https://builds.apache.org/job/PreCommit-ZOOKEEPER-github-pr-build-maven/ws/zookeeper-jute/pom.xml> to org.apache.zookeeper/zookeeper-jute/3.7.0-SNAPSHOT/zookeeper-jute-3.7.0-SNAPSHOT.pom
[JENKINS] Archiving <https://builds.apache.org/job/PreCommit-ZOOKEEPER-github-pr-build-maven/ws/zookeeper-jute/target/zookeeper-jute-3.7.0-SNAPSHOT.jar> to org.apache.zookeeper/zookeeper-jute/3.7.0-SNAPSHOT/zookeeper-jute-3.7.0-SNAPSHOT.jar
[JENKINS] Archiving <https://builds.apache.org/job/PreCommit-ZOOKEEPER-github-pr-build-maven/ws/zookeeper-jute/target/zookeeper-jute-3.7.0-SNAPSHOT-tests.jar> to org.apache.zookeeper/zookeeper-jute/3.7.0-SNAPSHOT/zookeeper-jute-3.7.0-SNAPSHOT-tests.jar
[JENKINS] Archiving <https://builds.apache.org/job/PreCommit-ZOOKEEPER-github-pr-build-maven/ws/zookeeper-jute/target/zookeeper-jute-3.7.0-SNAPSHOT-sources.jar> to org.apache.zookeeper/zookeeper-jute/3.7.0-SNAPSHOT/zookeeper-jute-3.7.0-SNAPSHOT-sources.jar
[JENKINS] Archiving <https://builds.apache.org/job/PreCommit-ZOOKEEPER-github-pr-build-maven/ws/zookeeper-jute/target/zookeeper-jute-3.7.0-SNAPSHOT-javadoc.jar> to org.apache.zookeeper/zookeeper-jute/3.7.0-SNAPSHOT/zookeeper-jute-3.7.0-SNAPSHOT-javadoc.jar
[JENKINS] Archiving <https://builds.apache.org/job/PreCommit-ZOOKEEPER-github-pr-build-maven/ws/zookeeper-recipes/zookeeper-recipes-queue/pom.xml> to org.apache.zookeeper/zookeeper-recipes-queue/3.7.0-SNAPSHOT/zookeeper-recipes-queue-3.7.0-SNAPSHOT.pom
[JENKINS] Archiving <https://builds.apache.org/job/PreCommit-ZOOKEEPER-github-pr-build-maven/ws/zookeeper-docs/pom.xml> to org.apache.zookeeper/zookeeper-docs/3.7.0-SNAPSHOT/zookeeper-docs-3.7.0-SNAPSHOT.pom
[JENKINS] Archiving <https://builds.apache.org/job/PreCommit-ZOOKEEPER-github-pr-build-maven/ws/zookeeper-recipes/pom.xml> to org.apache.zookeeper/zookeeper-recipes/3.7.0-SNAPSHOT/zookeeper-recipes-3.7.0-SNAPSHOT.pom
[JENKINS] Archiving <https://builds.apache.org/job/PreCommit-ZOOKEEPER-github-pr-build-maven/ws/zookeeper-it/pom.xml> to org.apache.zookeeper/zookeeper-it/3.7.0-SNAPSHOT/zookeeper-it-3.7.0-SNAPSHOT.pom
[JENKINS] Archiving <https://builds.apache.org/job/PreCommit-ZOOKEEPER-github-pr-build-maven/ws/zookeeper-client/zookeeper-client-c/pom.xml> to org.apache.zookeeper/zookeeper-client-c/3.7.0-SNAPSHOT/zookeeper-client-c-3.7.0-SNAPSHOT.pom
[JENKINS] Archiving <https://builds.apache.org/job/PreCommit-ZOOKEEPER-github-pr-build-maven/ws/zookeeper-contrib/zookeeper-contrib-rest/pom.xml> to org.apache.zookeeper/zookeeper-contrib-rest/3.7.0-SNAPSHOT/zookeeper-contrib-rest-3.7.0-SNAPSHOT.pom
[JENKINS] Archiving <https://builds.apache.org/job/PreCommit-ZOOKEEPER-github-pr-build-maven/ws/zookeeper-contrib/zookeeper-contrib-fatjar/pom.xml> to org.apache.zookeeper/zookeeper-contrib-fatjar/3.7.0-SNAPSHOT/zookeeper-contrib-fatjar-3.7.0-SNAPSHOT.pom
[JENKINS] Archiving <https://builds.apache.org/job/PreCommit-ZOOKEEPER-github-pr-build-maven/ws/zookeeper-assembly/pom.xml> to org.apache.zookeeper/zookeeper-assembly/3.7.0-SNAPSHOT/zookeeper-assembly-3.7.0-SNAPSHOT.pom
[JENKINS] Archiving <https://builds.apache.org/job/PreCommit-ZOOKEEPER-github-pr-build-maven/ws/zookeeper-contrib/zookeeper-contrib-zooinspector/pom.xml> to org.apache.zookeeper/zookeeper-contrib-zooinspector/3.7.0-SNAPSHOT/zookeeper-contrib-zooinspector-3.7.0-SNAPSHOT.pom
channel stopped
[SpotBugs] Skipping execution of recorder since overall result is 'FAILURE'
Setting status of 3c2570c05f59ba4e5f9c9eba8bfe8b69a71088a2 to FAILURE with url https://builds.apache.org/job/PreCommit-ZOOKEEPER-github-pr-build-maven/2047/ and message: 'FAILURE
 '
Using context: JenkinsMaven

Refer to this link for build results (access rights to CI server needed): 
https://builds.apache.org/job/PreCommit-ZOOKEEPER-github-pr-build-maven/2047/<h2>Build result: FAILURE</span></h2>[...truncated 855.15 KB...][JENKINS] Archiving <https://builds.apache.org/job/PreCommit-ZOOKEEPER-github-pr-build-maven/ws/pom.xml> to org.apache.zookeeper/parent/3.7.0-SNAPSHOT/parent-3.7.0-SNAPSHOT.pom[Fast Archiver] Compressed 36.76 KB of artifacts by 87.0% relative to #2046[JENKINS] Archiving <https://builds.apache.org/job/PreCommit-ZOOKEEPER-github-pr-build-maven/ws/zookeeper-recipes/zookeeper-recipes-lock/pom.xml> to org.apache.zookeeper/zookeeper-recipes-lock/3.7.0-SNAPSHOT/zookeeper-recipes-lock-3.7.0-SNAPSHOT.pom[JENKINS] Archiving <https://builds.apache.org/job/PreCommit-ZOOKEEPER-github-pr-build-maven/ws/zookeeper-contrib/pom.xml> to org.apache.zookeeper/zookeeper-contrib/3.7.0-SNAPSHOT/zookeeper-contrib-3.7.0-SNAPSHOT.pom[JENKINS] Archiving <https://builds.apache.org/job/PreCommit-ZOOKEEPER-github-pr-build-maven/ws/zookeeper-client/pom.xml> to org.apache.zookeeper/zookeeper-client/3.7.0-SNAPSHOT/zookeeper-client-3.7.0-SNAPSHOT.pom[JENKINS] Archiving <https://builds.apache.org/job/PreCommit-ZOOKEEPER-github-pr-build-maven/ws/zookeeper-jute/pom.xml> to org.apache.zookeeper/zookeeper-jute/3.7.0-SNAPSHOT/zookeeper-jute-3.7.0-SNAPSHOT.pom[JENKINS] Archiving <https://builds.apache.org/job/PreCommit-ZOOKEEPER-github-pr-build-maven/ws/zookeeper-jute/target/zookeeper-jute-3.7.0-SNAPSHOT.jar> to org.apache.zookeeper/zookeeper-jute/3.7.0-SNAPSHOT/zookeeper-jute-3.7.0-SNAPSHOT.jar[JENKINS] Archiving <https://builds.apache.org/job/PreCommit-ZOOKEEPER-github-pr-build-maven/ws/zookeeper-jute/target/zookeeper-jute-3.7.0-SNAPSHOT-tests.jar> to org.apache.zookeeper/zookeeper-jute/3.7.0-SNAPSHOT/zookeeper-jute-3.7.0-SNAPSHOT-tests.jar[JENKINS] Archiving <https://builds.apache.org/job/PreCommit-ZOOKEEPER-github-pr-build-maven/ws/zookeeper-jute/target/zookeeper-jute-3.7.0-SNAPSHOT-sources.jar> to org.apache.zookeeper/zookeeper-jute/3.7.0-SNAPSHOT/zookeeper-jute-3.7.0-SNAPSHOT-sources.jar[JENKINS] Archiving <https://builds.apache.org/job/PreCommit-ZOOKEEPER-github-pr-build-maven/ws/zookeeper-jute/target/zookeeper-jute-3.7.0-SNAPSHOT-javadoc.jar> to org.apache.zookeeper/zookeeper-jute/3.7.0-SNAPSHOT/zookeeper-jute-3.7.0-SNAPSHOT-javadoc.jar[JENKINS] Archiving <https://builds.apache.org/job/PreCommit-ZOOKEEPER-github-pr-build-maven/ws/zookeeper-recipes/zookeeper-recipes-queue/pom.xml> to org.apache.zookeeper/zookeeper-recipes-queue/3.7.0-SNAPSHOT/zookeeper-recipes-queue-3.7.0-SNAPSHOT.pom[JENKINS] Archiving <https://builds.apache.org/job/PreCommit-ZOOKEEPER-github-pr-build-maven/ws/zookeeper-docs/pom.xml> to org.apache.zookeeper/zookeeper-docs/3.7.0-SNAPSHOT/zookeeper-docs-3.7.0-SNAPSHOT.pom[JENKINS] Archiving <https://builds.apache.org/job/PreCommit-ZOOKEEPER-github-pr-build-maven/ws/zookeeper-recipes/pom.xml> to org.apache.zookeeper/zookeeper-recipes/3.7.0-SNAPSHOT/zookeeper-recipes-3.7.0-SNAPSHOT.pom[JENKINS] Archiving <https://builds.apache.org/job/PreCommit-ZOOKEEPER-github-pr-build-maven/ws/zookeeper-it/pom.xml> to org.apache.zookeeper/zookeeper-it/3.7.0-SNAPSHOT/zookeeper-it-3.7.0-SNAPSHOT.pom[JENKINS] Archiving <https://builds.apache.org/job/PreCommit-ZOOKEEPER-github-pr-build-maven/ws/zookeeper-client/zookeeper-client-c/pom.xml> to org.apache.zookeeper/zookeeper-client-c/3.7.0-SNAPSHOT/zookeeper-client-c-3.7.0-SNAPSHOT.pom[JENKINS] Archiving <https://builds.apache.org/job/PreCommit-ZOOKEEPER-github-pr-build-maven/ws/zookeeper-contrib/zookeeper-contrib-rest/pom.xml> to org.apache.zookeeper/zookeeper-contrib-rest/3.7.0-SNAPSHOT/zookeeper-contrib-rest-3.7.0-SNAPSHOT.pom[JENKINS] Archiving <https://builds.apache.org/job/PreCommit-ZOOKEEPER-github-pr-build-maven/ws/zookeeper-contrib/zookeeper-contrib-fatjar/pom.xml> to org.apache.zookeeper/zookeeper-contrib-fatjar/3.7.0-SNAPSHOT/zookeeper-contrib-fatjar-3.7.0-SNAPSHOT.pom[JENKINS] Archiving <https://builds.apache.org/job/PreCommit-ZOOKEEPER-github-pr-build-maven/ws/zookeeper-assembly/pom.xml> to org.apache.zookeeper/zookeeper-assembly/3.7.0-SNAPSHOT/zookeeper-assembly-3.7.0-SNAPSHOT.pom[JENKINS] Archiving <https://builds.apache.org/job/PreCommit-ZOOKEEPER-github-pr-build-maven/ws/zookeeper-contrib/zookeeper-contrib-zooinspector/pom.xml> to org.apache.zookeeper/zookeeper-contrib-zooinspector/3.7.0-SNAPSHOT/zookeeper-contrib-zooinspector-3.7.0-SNAPSHOT.pomchannel stopped[SpotBugs] Skipping execution of recorder since overall result is 'FAILURE'Setting status of 3c2570c05f59ba4e5f9c9eba8bfe8b69a71088a2 to FAILURE with url https://builds.apache.org/job/PreCommit-ZOOKEEPER-github-pr-build-maven/2047/ and message: 'FAILURE 'Using context: JenkinsMaven


Jenkins build is back to normal : PreCommit-ZOOKEEPER-github-pr-build-maven #2048

Posted by Apache Jenkins Server <je...@builds.apache.org>.
See <https://builds.apache.org/job/PreCommit-ZOOKEEPER-github-pr-build-maven/2048/display/redirect?page=changes>