You are viewing a plain text version of this content. The canonical link for it is here.
Posted to builds@cassandra.apache.org by Apache Jenkins Server <je...@builds.apache.org> on 2022/11/05 16:15:27 UTC
Build complete: Cassandra-3.11 #403 [FAILURE] bdd6606486e91024e123afc4e56465a95b102d1a
-------------------------------------------------------------------------------
Build Cassandra-3.11 #403 Still Failing
URL: https://ci-cassandra.apache.org/job/Cassandra-3.11/403/
-------------------------------------------------------------------------------
Changes:
No changes
-------------------------------------------------------------------------------
Failed Tests:
16 tests failed.
FAILED: dtest-novnode.cqlsh_tests.test_cqlsh_copy.TestCqlshCopy.test_bulk_round_trip_with_backoff
FAILED: dtest-upgrade.upgrade_tests.bootstrap_upgrade_test.TestBootstrapUpgrade.test_simultaneous_bootstrap
FAILED: org.apache.cassandra.distributed.upgrade.DropCompactStorageWithClusteringAndValueColumnTest.testDropCompactWithClusteringAndValueColumn
FAILED: org.apache.cassandra.distributed.upgrade.MixedModeReadTest.mixedModeReadColumnSubsetDigestCheck
FAILED: org.apache.cassandra.cql3.ViewComplexTest.testMVWithDifferentColumnsWithoutFlush
FAILED: org.apache.cassandra.cql3.ViewComplexTest.testRangeDeletionWithFlush
FAILED: org.apache.cassandra.cql3.ViewFilteringTest.testRestrictedRegularColumnTimestampUpdates
FAILED: org.apache.cassandra.cql3.validation.operations.SelectTest.testFilterWithIndexForContains
FAILED: dtest-upgrade.upgrade_tests.upgrade_through_versions_test.TestUpgrade_current_2_1_x_To_indev_3_11_x.test_rolling_upgrade_with_internode_ssl
FAILED: dtest-novnode.repair_tests.repair_test.TestRepair.test_dead_sync_initiator
FAILED: dtest-novnode.repair_tests.repair_test.TestRepair.test_failure_during_validation
FAILED: dtest-offheap.repair_tests.repair_test.TestRepair.test_dead_sync_initiator
FAILED: dtest-offheap.repair_tests.repair_test.TestRepair.test_failure_during_validation
FAILED: dtest.repair_tests.repair_test.TestRepair.test_dead_sync_initiator
FAILED: dtest.repair_tests.repair_test.TestRepair.test_failure_during_validation
FAILED: dtest-upgrade.upgrade_internal_auth_test.TestAuthUpgrade.test_upgrade_legacy_table
-------------------------------------------------------------------------------
For complete test report and logs see https://nightlies.apache.org/cassandra/Cassandra-3.11/403/