You are viewing a plain text version of this content. The canonical link for it is here.
Posted to dev@pdfbox.apache.org by Apache Jenkins Server <je...@builds.apache.org> on 2012/04/08 18:57:46 UTC
Build failed in Jenkins: PDFBox-trunk #446
See <https://builds.apache.org/job/PDFBox-trunk/446/changes>
Changes:
[tboehme] add new load method which uses new NonSequentialPDFParser
[tboehme] add new NonSequentialPDFParser as proposed in PDFBOX-1199
[tboehme] add 'isDecrypted' flag to COSDocument which signals that the document was already decrypted, needed e.g. by new NonSequentialPDFParser
------------------------------------------
[...truncated 213 lines...]
Uploading: https://repository.apache.org/content/repositories/snapshots/org/apache/pdfbox/jempbox/1.7.0-SNAPSHOT/jempbox-1.7.0-20120408.165503-134.jar
Uploaded: https://repository.apache.org/content/repositories/snapshots/org/apache/pdfbox/jempbox/1.7.0-SNAPSHOT/jempbox-1.7.0-20120408.165503-134.jar (51 KB at 28.0 KB/sec)
Uploading: https://repository.apache.org/content/repositories/snapshots/org/apache/pdfbox/jempbox/1.7.0-SNAPSHOT/jempbox-1.7.0-20120408.165503-134.pom
Uploaded: https://repository.apache.org/content/repositories/snapshots/org/apache/pdfbox/jempbox/1.7.0-SNAPSHOT/jempbox-1.7.0-20120408.165503-134.pom (4 KB at 5.0 KB/sec)
Downloading: https://repository.apache.org/content/repositories/snapshots/org/apache/pdfbox/jempbox/maven-metadata.xml
Downloaded: https://repository.apache.org/content/repositories/snapshots/org/apache/pdfbox/jempbox/maven-metadata.xml (424 B at 0.4 KB/sec)
Uploading: https://repository.apache.org/content/repositories/snapshots/org/apache/pdfbox/jempbox/1.7.0-SNAPSHOT/maven-metadata.xml
Uploaded: https://repository.apache.org/content/repositories/snapshots/org/apache/pdfbox/jempbox/1.7.0-SNAPSHOT/maven-metadata.xml (780 B at 0.7 KB/sec)
Uploading: https://repository.apache.org/content/repositories/snapshots/org/apache/pdfbox/jempbox/maven-metadata.xml
Uploaded: https://repository.apache.org/content/repositories/snapshots/org/apache/pdfbox/jempbox/maven-metadata.xml (424 B at 0.6 KB/sec)
[INFO]
[INFO] --- maven-bundle-plugin:2.0.0:deploy (default-deploy) @ jempbox ---[INFO] Remote OBR update disabled (enable with -DremoteOBR)
[JENKINS] Archiving <https://builds.apache.org/job/PDFBox-trunk/ws/trunk/jempbox/pom.xml> to /home/hudson/hudson/jobs/PDFBox-trunk/modules/org.apache.pdfbox$jempbox/builds/2012-04-08_16-34-53/archive/org.apache.pdfbox/jempbox/1.7.0-SNAPSHOT/jempbox-1.7.0-SNAPSHOT.pom
[JENKINS] Archiving <https://builds.apache.org/job/PDFBox-trunk/ws/trunk/jempbox/target/jempbox-1.7.0-SNAPSHOT.jar> to /home/hudson/hudson/jobs/PDFBox-trunk/modules/org.apache.pdfbox$jempbox/builds/2012-04-08_16-34-53/archive/org.apache.pdfbox/jempbox/1.7.0-20120408.165503-134/jempbox-1.7.0-20120408.165503-134.jar
[INFO]
[INFO] ------------------------------------------------------------------------
[INFO] Building Apache XmpBox 1.7.0-SNAPSHOT
[INFO] ------------------------------------------------------------------------
[INFO]
[INFO] Deleting <https://builds.apache.org/job/PDFBox-trunk/ws/trunk/xmpbox/target>
[INFO] --- maven-clean-plugin:2.4.1:clean (default-clean) @ xmpbox ---
[INFO]
[INFO] --- maven-remote-resources-plugin:1.2.1:process (default) @ xmpbox ---
[INFO]
[INFO] --- maven-resources-plugin:2.5:resources (default-resources) @ xmpbox ---[debug] execute contextualize
[INFO] Using 'ISO-8859-1' encoding to copy filtered resources.
[INFO] skip non existing resourceDirectory <https://builds.apache.org/job/PDFBox-trunk/ws/trunk/xmpbox/src/main/resources>
[INFO] Copying 3 resources
[INFO]
[INFO] --- maven-compiler-plugin:2.3.2:compile (default-compile) @ xmpbox ---
[INFO] Compiling 71 source files to <https://builds.apache.org/job/PDFBox-trunk/ws/trunk/xmpbox/target/classes>
[INFO]
[INFO] [debug] execute contextualize
--- maven-resources-plugin:2.5:testResources (default-testResources) @ xmpbox ---
[INFO] Using 'ISO-8859-1' encoding to copy filtered resources.
[INFO] Copying 5 resources
[INFO] Copying 3 resources
[INFO]
[INFO] --- maven-compiler-plugin:2.3.2:testCompile (default-testCompile) @ xmpbox ---[INFO] Compiling 25 source files to <https://builds.apache.org/job/PDFBox-trunk/ws/trunk/xmpbox/target/test-classes>
[INFO]
[INFO] --- maven-surefire-plugin:2.9:test (default-test) @ xmpbox ---[INFO] Surefire report directory: <https://builds.apache.org/job/PDFBox-trunk/ws/trunk/xmpbox/target/surefire-reports>
-------------------------------------------------------
T E S T S
-------------------------------------------------------
Running org.apache.padaf.xmpbox.XMPMetaDataTest
Tests run: 4, Failures: 0, Errors: 0, Skipped: 0, Time elapsed: 0.088 sec
Running org.apache.padaf.xmpbox.schema.PDFAValueTypeDescriptionTest
Tests run: 1, Failures: 0, Errors: 0, Skipped: 0, Time elapsed: 0.003 sec
Running org.apache.padaf.xmpbox.schema.PDFAIdentificationTest
Tests run: 6, Failures: 0, Errors: 0, Skipped: 0, Time elapsed: 0.034 sec
Running org.apache.padaf.xmpbox.schema.PDFAExtensionTest
Tests run: 6, Failures: 0, Errors: 0, Skipped: 0, Time elapsed: 0.02 sec
Running org.apache.padaf.xmpbox.schema.PDFAIdentificationOthersTest
Tests run: 3, Failures: 0, Errors: 0, Skipped: 0, Time elapsed: 0.004 sec
Running org.apache.padaf.xmpbox.schema.XMPBasicTest
Tests run: 22, Failures: 0, Errors: 0, Skipped: 0, Time elapsed: 0.122 sec
Running org.apache.padaf.xmpbox.schema.AdobePDFTest
Tests run: 6, Failures: 0, Errors: 0, Skipped: 0, Time elapsed: 0.02 sec
Running org.apache.padaf.xmpbox.schema.DublinCoreTest
Tests run: 30, Failures: 0, Errors: 0, Skipped: 0, Time elapsed: 0.107 sec
Running org.apache.padaf.xmpbox.schema.XMPSchemaTest
Tests run: 12, Failures: 0, Errors: 0, Skipped: 0, Time elapsed: 0.016 sec
Running org.apache.padaf.xmpbox.schema.XmpRightsSchemaTest
Tests run: 10, Failures: 0, Errors: 0, Skipped: 0, Time elapsed: 0.021 sec
Running org.apache.padaf.xmpbox.schema.PDFAPropertyDescriptionTest
Tests run: 2, Failures: 0, Errors: 0, Skipped: 0, Time elapsed: 0.001 sec
Running org.apache.padaf.xmpbox.schema.AdobePDFErrorsTest
Tests run: 3, Failures: 0, Errors: 0, Skipped: 0, Time elapsed: 0.002 sec
Running org.apache.padaf.xmpbox.schema.XMPMediaManagementTest
Tests run: 28, Failures: 0, Errors: 0, Skipped: 0, Time elapsed: 0.103 sec
Running org.apache.padaf.xmpbox.type.AttributeTest
Tests run: 2, Failures: 0, Errors: 0, Skipped: 0, Time elapsed: 0 sec
Running org.apache.padaf.xmpbox.type.SimpleMetadataPropertyTest
Tests run: 11, Failures: 0, Errors: 0, Skipped: 0, Time elapsed: 0.009 sec
Running org.apache.padaf.xmpbox.type.ComplexMetadataPropertyTest
Tests run: 4, Failures: 0, Errors: 0, Skipped: 0, Time elapsed: 0.007 sec
Running org.apache.padaf.xmpbox.SaveMetadataHelperTest
Tests run: 2, Failures: 0, Errors: 0, Skipped: 0, Time elapsed: 0.055 sec
Running org.apache.padaf.xmpbox.DoubleSameTypeSchemaTest
Tests run: 1, Failures: 0, Errors: 0, Skipped: 0, Time elapsed: 0.002 sec
Running org.apache.padaf.xmpbox.BuildPDFAExtensionSchemaDescriptionTest
Tests run: 1, Failures: 0, Errors: 0, Skipped: 0, Time elapsed: 0.259 sec
Running org.apache.padaf.xmpbox.parser.XMLValueTypeDescriptionManagerTest
Tests run: 2, Failures: 0, Errors: 0, Skipped: 0, Time elapsed: 0.04 sec
Running org.apache.padaf.xmpbox.parser.DeserializationTest
Tests run: 3, Failures: 0, Errors: 0, Skipped: 0, Time elapsed: 0.078 sec
Running org.apache.padaf.xmpbox.parser.PropMappingTest
Tests run: 3, Failures: 0, Errors: 0, Skipped: 0, Time elapsed: 0 sec
Running org.apache.padaf.xmpbox.parser.XMLPropertiesDescriptionManagerTest
Tests run: 1, Failures: 0, Errors: 0, Skipped: 0, Time elapsed: 0.008 sec
Results :
Tests run: 163, Failures: 0, Errors: 0, Skipped: 0
[JENKINS] Recording test results
[INFO]
[INFO] --- maven-bundle-plugin:2.0.0:bundle (default-bundle) @ xmpbox ---
[INFO]
[INFO] --- maven-site-plugin:3.0:attach-descriptor (attach-descriptor) @ xmpbox ---
[INFO]
[INFO] --- apache-rat-plugin:0.6:check (default) @ xmpbox ---[INFO] Exclude: release.properties
[INFO] [INFO] Installing <https://builds.apache.org/job/PDFBox-trunk/ws/trunk/xmpbox/target/xmpbox-1.7.0-SNAPSHOT.jar> to /export/home/hudson/hudson-slave/maven-repositories/0/org/apache/pdfbox/xmpbox/1.7.0-SNAPSHOT/xmpbox-1.7.0-SNAPSHOT.jar
[INFO] Installing <https://builds.apache.org/job/PDFBox-trunk/ws/trunk/xmpbox/pom.xml> to /export/home/hudson/hudson-slave/maven-repositories/0/org/apache/pdfbox/xmpbox/1.7.0-SNAPSHOT/xmpbox-1.7.0-SNAPSHOT.pom
[INFO] --- maven-install-plugin:2.3.1:install (default-install) @ xmpbox ---
[INFO]
[INFO] --- maven-bundle-plugin:2.0.0:install (default-install) @ xmpbox ---[INFO] Parsing file:/export/home/hudson/hudson-slave/maven-repositories/0/repository.xml
[INFO] Installing org/apache/pdfbox/xmpbox/1.7.0-SNAPSHOT/xmpbox-1.7.0-SNAPSHOT.jar
[INFO] Writing OBR metadata
[INFO]
[INFO] --- maven-deploy-plugin:2.6:deploy (default-deploy) @ xmpbox ---Downloading: https://repository.apache.org/content/repositories/snapshots/org/apache/pdfbox/xmpbox/1.7.0-SNAPSHOT/maven-metadata.xml
Downloaded: https://repository.apache.org/content/repositories/snapshots/org/apache/pdfbox/xmpbox/1.7.0-SNAPSHOT/maven-metadata.xml (779 B at 0.4 KB/sec)
Uploading: https://repository.apache.org/content/repositories/snapshots/org/apache/pdfbox/xmpbox/1.7.0-SNAPSHOT/xmpbox-1.7.0-20120408.165559-113.jar
Uploaded: https://repository.apache.org/content/repositories/snapshots/org/apache/pdfbox/xmpbox/1.7.0-SNAPSHOT/xmpbox-1.7.0-20120408.165559-113.jar (131 KB at 52.5 KB/sec)
Uploading: https://repository.apache.org/content/repositories/snapshots/org/apache/pdfbox/xmpbox/1.7.0-SNAPSHOT/xmpbox-1.7.0-20120408.165559-113.pom
Uploaded: https://repository.apache.org/content/repositories/snapshots/org/apache/pdfbox/xmpbox/1.7.0-SNAPSHOT/xmpbox-1.7.0-20120408.165559-113.pom (5 KB at 7.8 KB/sec)
Downloading: https://repository.apache.org/content/repositories/snapshots/org/apache/pdfbox/xmpbox/maven-metadata.xml
Downloaded: https://repository.apache.org/content/repositories/snapshots/org/apache/pdfbox/xmpbox/maven-metadata.xml (283 B at 0.2 KB/sec)
Uploading: https://repository.apache.org/content/repositories/snapshots/org/apache/pdfbox/xmpbox/1.7.0-SNAPSHOT/maven-metadata.xml
Uploaded: https://repository.apache.org/content/repositories/snapshots/org/apache/pdfbox/xmpbox/1.7.0-SNAPSHOT/maven-metadata.xml (779 B at 0.4 KB/sec)
Uploading: https://repository.apache.org/content/repositories/snapshots/org/apache/pdfbox/xmpbox/maven-metadata.xml
Uploaded: https://repository.apache.org/content/repositories/snapshots/org/apache/pdfbox/xmpbox/maven-metadata.xml (283 B at 0.4 KB/sec)
[INFO]
[INFO] --- maven-bundle-plugin:2.0.0:deploy (default-deploy) @ xmpbox ---[INFO] Remote OBR update disabled (enable with -DremoteOBR)
[JENKINS] Archiving <https://builds.apache.org/job/PDFBox-trunk/ws/trunk/xmpbox/pom.xml> to /home/hudson/hudson/jobs/PDFBox-trunk/modules/org.apache.pdfbox$xmpbox/builds/2012-04-08_16-34-54/archive/org.apache.pdfbox/xmpbox/1.7.0-SNAPSHOT/xmpbox-1.7.0-SNAPSHOT.pom
[JENKINS] Archiving <https://builds.apache.org/job/PDFBox-trunk/ws/trunk/xmpbox/target/xmpbox-1.7.0-SNAPSHOT.jar> to /home/hudson/hudson/jobs/PDFBox-trunk/modules/org.apache.pdfbox$xmpbox/builds/2012-04-08_16-34-54/archive/org.apache.pdfbox/xmpbox/1.7.0-20120408.165559-113/xmpbox-1.7.0-20120408.165559-113.jar
[INFO]
[INFO] ------------------------------------------------------------------------
[INFO] Building Apache PDFBox 1.7.0-SNAPSHOT
[INFO] ------------------------------------------------------------------------
[INFO]
[INFO] --- maven-clean-plugin:2.4.1:clean (default-clean) @ pdfbox ---[INFO] Deleting <https://builds.apache.org/job/PDFBox-trunk/ws/trunk/pdfbox/target>
[INFO]
[INFO] --- maven-remote-resources-plugin:1.2.1:process (default) @ pdfbox ---
[INFO]
[INFO] --- maven-antrun-plugin:1.6:run (default) @ pdfbox ---
[INFO] Executing tasks
main:
find.adobefiles:
get.adobefiles:
testexist:
downloadfile:
[unjar] Expanding: <https://builds.apache.org/job/PDFBox-trunk/ws/trunk/pdfbox/download/pcfi-2010.08.09.jar> into <https://builds.apache.org/job/PDFBox-trunk/ws/trunk/pdfbox/target/classes/org/apache/pdfbox/resources/afm>
[unjar] Expanding: <https://builds.apache.org/job/PDFBox-trunk/ws/trunk/pdfbox/download/pcfi-2010.08.09.jar> into <https://builds.apache.org/job/PDFBox-trunk/ws/trunk/pdfbox/target/classes/org/apache/pdfbox/resources>
[INFO] Executed tasks
[INFO] [debug] execute contextualize
[INFO] --- maven-resources-plugin:2.5:resources (default-resources) @ pdfbox ---[INFO] Using 'ISO-8859-1' encoding to copy filtered resources.
[INFO] Copying 192 resources
[INFO] Copying 3 resources
[INFO]
[INFO] --- maven-compiler-plugin:2.3.2:compile (default-compile) @ pdfbox ---
[INFO] Compiling 495 source files to <https://builds.apache.org/job/PDFBox-trunk/ws/trunk/pdfbox/target/classes>
[INFO] -------------------------------------------------------------
[ERROR] COMPILATION ERROR :
[INFO] -------------------------------------------------------------
[ERROR] <https://builds.apache.org/job/PDFBox-trunk/ws/trunk/pdfbox/src/main/java/org/apache/pdfbox/pdfparser/NonSequentialPDFParser.java>:[261,54] cannot find symbol
symbol : constructor IOException(java.lang.String,java.lang.Exception)
location: class java.io.IOException
[ERROR] <https://builds.apache.org/job/PDFBox-trunk/ws/trunk/pdfbox/src/main/java/org/apache/pdfbox/pdfparser/NonSequentialPDFParser.java>:[903,110] cannot find symbol
symbol : constructor IOException(java.lang.String,org.apache.pdfbox.exceptions.CryptographyException)
location: class java.io.IOException
[ERROR] <https://builds.apache.org/job/PDFBox-trunk/ws/trunk/pdfbox/src/main/java/org/apache/pdfbox/pdfparser/NonSequentialPDFParser.java>:[1015,46] cannot find symbol
symbol : constructor IOException(java.lang.String,org.apache.pdfbox.exceptions.CryptographyException)
location: class java.io.IOException
[INFO] 3 errors
[INFO] -------------------------------------------------------------
[JENKINS] Archiving <https://builds.apache.org/job/PDFBox-trunk/ws/trunk/pdfbox/pom.xml> to /home/hudson/hudson/jobs/PDFBox-trunk/modules/org.apache.pdfbox$pdfbox/builds/2012-04-08_16-34-58/archive/org.apache.pdfbox/pdfbox/1.7.0-SNAPSHOT/pdfbox-1.7.0-SNAPSHOT.pom
[INFO] ------------------------------------------------------------------------
[INFO] Reactor Summary:
[INFO]
[INFO] PDFBox parent ..................................... SUCCESS [7:08.863s]
[INFO] Apache FontBox .................................... SUCCESS [3:23.533s]
[INFO] Apache JempBox .................................... SUCCESS [40.159s]
[INFO] Apache XmpBox ..................................... SUCCESS [51.227s]
[INFO] Apache PDFBox ..................................... FAILURE [36.236s]
[INFO] Apache Preflight .................................. SKIPPED
[INFO] Apache PDFBox for Lucene .......................... SKIPPED
[INFO] Apache PDFBox for Ant ............................. SKIPPED
[INFO] Apache PDFBox webapp .............................. SKIPPED
[INFO] Apache PDFBox application ......................... SKIPPED
[INFO] Apache PDFBox examples ............................ SKIPPED
[INFO] PDFBox reactor .................................... SKIPPED
[INFO] ------------------------------------------------------------------------
[INFO] BUILD FAILURE
[INFO] ------------------------------------------------------------------------
[INFO] Total time: 14:30.467s
[INFO] Finished at: Sun Apr 08 16:57:03 GMT+00:00 2012
[INFO] Final Memory: 31M/160M
[INFO] ------------------------------------------------------------------------
mavenExecutionResult exceptions not empty
message : Failed to execute goal org.apache.maven.plugins:maven-compiler-plugin:2.3.2:compile (default-compile) on project pdfbox: Compilation failure
cause : Compilation failure
Stack trace :
org.apache.maven.lifecycle.LifecycleExecutionException: Failed to execute goal org.apache.maven.plugins:maven-compiler-plugin:2.3.2:compile (default-compile) on project pdfbox: Compilation failure
at org.apache.maven.lifecycle.internal.MojoExecutor.execute(MojoExecutor.java:213)
at org.apache.maven.lifecycle.internal.MojoExecutor.execute(MojoExecutor.java:153)
at org.apache.maven.lifecycle.internal.MojoExecutor.execute(MojoExecutor.java:145)
at org.apache.maven.lifecycle.internal.LifecycleModuleBuilder.buildProject(LifecycleModuleBuilder.java:84)
at org.apache.maven.lifecycle.internal.LifecycleModuleBuilder.buildProject(LifecycleModuleBuilder.java:59)
at org.apache.maven.lifecycle.internal.LifecycleStarter.singleThreadedBuild(LifecycleStarter.java:183)
at org.apache.maven.lifecycle.internal.LifecycleStarter.execute(LifecycleStarter.java:161)
at org.apache.maven.DefaultMaven.doExecute(DefaultMaven.java:319)
at org.apache.maven.DefaultMaven.execute(DefaultMaven.java:156)
at org.jvnet.hudson.maven3.launcher.Maven3Launcher.main(Maven3Launcher.java:79)
at sun.reflect.NativeMethodAccessorImpl.invoke0(Native Method)
at sun.reflect.NativeMethodAccessorImpl.invoke(NativeMethodAccessorImpl.java:39)
at sun.reflect.DelegatingMethodAccessorImpl.invoke(DelegatingMethodAccessorImpl.java:25)
at java.lang.reflect.Method.invoke(Method.java:592)
at org.codehaus.plexus.classworlds.launcher.Launcher.launchStandard(Launcher.java:329)
at org.codehaus.plexus.classworlds.launcher.Launcher.launch(Launcher.java:239)
at org.jvnet.hudson.maven3.agent.Maven3Main.launch(Maven3Main.java:158)
at hudson.maven.Maven3Builder.call(Maven3Builder.java:104)
at hudson.maven.Maven3Builder.call(Maven3Builder.java:70)
at hudson.remoting.UserRequest.perform(UserRequest.java:118)
at hudson.remoting.UserRequest.perform(UserRequest.java:48)
at hudson.remoting.Request$2.run(Request.java:287)
at hudson.remoting.InterceptingExecutorService$1.call(InterceptingExecutorService.java:72)
at java.util.concurrent.FutureTask$Sync.innerRun(FutureTask.java:269)
at java.util.concurrent.FutureTask.run(FutureTask.java:123)
at java.util.concurrent.ThreadPoolExecutor$Worker.runTask(ThreadPoolExecutor.java:651)
at java.util.concurrent.ThreadPoolExecutor$Worker.run(ThreadPoolExecutor.java:676)
at java.lang.Thread.run(Thread.java:595)
Caused by: org.apache.maven.plugin.CompilationFailureException: Compilation failure
at org.apache.maven.plugin.AbstractCompilerMojo.execute(AbstractCompilerMojo.java:656)
at org.apache.maven.plugin.CompilerMojo.execute(CompilerMojo.java:128)
at org.apache.maven.plugin.DefaultBuildPluginManager.executeMojo(DefaultBuildPluginManager.java:101)
at org.apache.maven.lifecycle.internal.MojoExecutor.execute(MojoExecutor.java:209)
... 27 more
Sending e-mails to: dev@pdfbox.apache.org
channel stopped
Archiving artifacts
Jenkins build is back to normal : PDFBox-trunk #448
Posted by Apache Jenkins Server <je...@builds.apache.org>.
See <https://builds.apache.org/job/PDFBox-trunk/448/changes>
Build failed in Jenkins: PDFBox-trunk #447
Posted by Apache Jenkins Server <je...@builds.apache.org>.
See <https://builds.apache.org/job/PDFBox-trunk/447/changes>
Changes:
[lehmi] PDFBOX-490: process the very last glyph too
[lehmi] PDFBOX-490: improved TTFParser to read glyph information based on Apache Batik code
------------------------------------------
[...truncated 1528 lines...]
A xmpbox/src/main/java/org/apache/padaf/xmpbox/parser/PDFAExtentionSchemaPreprocessor.java
AU xmpbox/src/main/java/org/apache/padaf/xmpbox/parser/XmpExpectedRdfAboutAttribute.java
AU xmpbox/src/main/java/org/apache/padaf/xmpbox/parser/XmpInitialXPacketParsingException.java
AU xmpbox/src/main/java/org/apache/padaf/xmpbox/parser/XmpPropertyFormatException.java
AU xmpbox/src/main/java/org/apache/padaf/xmpbox/parser/XmpUnknownValueTypeException.java
AU xmpbox/src/main/java/org/apache/padaf/xmpbox/parser/XmpUnexpectedNamespacePrefixException.java
AU xmpbox/src/main/java/org/apache/padaf/xmpbox/parser/XmpSchemaException.java
AU xmpbox/src/main/java/org/apache/padaf/xmpbox/parser/XmpUnexpectedNamespaceURIException.java
AU xmpbox/src/main/java/org/apache/padaf/xmpbox/parser/DateConverter.java
AU xmpbox/src/main/java/org/apache/padaf/xmpbox/parser/XmpUnexpectedElementQualifiedNameException.java
AU xmpbox/src/main/java/org/apache/padaf/xmpbox/parser/XmpParsingException.java
AU xmpbox/src/main/java/org/apache/padaf/xmpbox/parser/XmpUnknownPropertyException.java
AU xmpbox/src/main/java/org/apache/padaf/xmpbox/parser/XmpUnknownPropertyTypeException.java
AU xmpbox/src/main/java/org/apache/padaf/xmpbox/parser/XmpUnexpectedTypeException.java
AU xmpbox/src/main/java/org/apache/padaf/xmpbox/parser/XMPDocumentBuilder.java
A xmpbox/src/main/java/org/apache/padaf/xmpbox/parser/XMPDocumentPreprocessor.java
AU xmpbox/src/main/java/org/apache/padaf/xmpbox/parser/XmpPropertyType.java
AU xmpbox/src/main/java/org/apache/padaf/xmpbox/parser/XMLPropertiesDescriptionManager.java
AU xmpbox/src/main/java/org/apache/padaf/xmpbox/parser/XMPSchemaFactory.java
AU xmpbox/src/main/java/org/apache/padaf/xmpbox/parser/XmpUnexpectedElementException.java
AU xmpbox/src/main/java/org/apache/padaf/xmpbox/parser/XmpUnknownSchemaException.java
AU xmpbox/src/main/java/org/apache/padaf/xmpbox/parser/StructuredPropertyParser.java
AU xmpbox/src/main/java/org/apache/padaf/xmpbox/parser/JobParser.java
AU xmpbox/src/main/java/org/apache/padaf/xmpbox/parser/XmpRequiredPropertyException.java
AU xmpbox/src/main/java/org/apache/padaf/xmpbox/parser/XmpXpacketEndException.java
AU xmpbox/src/main/java/org/apache/padaf/xmpbox/parser/PropMapping.java
AU xmpbox/src/main/java/org/apache/padaf/xmpbox/parser/NSMapping.java
AU xmpbox/src/main/java/org/apache/padaf/xmpbox/parser/XMLValueTypeDescriptionManager.java
AU xmpbox/src/main/java/org/apache/padaf/xmpbox/parser/XMLUtil.java
A xmpbox/src/main/appended-resources
A xmpbox/src/main/appended-resources/META-INF
AU xmpbox/src/main/appended-resources/META-INF/NOTICE.txt
AU xmpbox/src/main/appended-resources/META-INF/LICENSE.txt
AU xmpbox/pom.xml
A xmpbox/README.txt
A examples
A examples/src
A examples/src/main
A examples/src/main/java
A examples/src/main/java/org
A examples/src/main/java/org/apache
A examples/src/main/java/org/apache/pdfbox
A examples/src/main/java/org/apache/pdfbox/examples
AU examples/src/main/java/org/apache/pdfbox/examples/AbstractExample.java
A examples/src/main/java/org/apache/pdfbox/examples/fdf
AU examples/src/main/java/org/apache/pdfbox/examples/fdf/SetField.java
AU examples/src/main/java/org/apache/pdfbox/examples/fdf/PrintFields.java
AU examples/src/main/java/org/apache/pdfbox/examples/fdf/package.html
A examples/src/main/java/org/apache/pdfbox/examples/signature
AU examples/src/main/java/org/apache/pdfbox/examples/signature/ShowSignature.java
AU examples/src/main/java/org/apache/pdfbox/examples/signature/package.html
A examples/src/main/java/org/apache/pdfbox/examples/pdmodel
AU examples/src/main/java/org/apache/pdfbox/examples/pdmodel/ReplaceString.java
AU examples/src/main/java/org/apache/pdfbox/examples/pdmodel/RemoveFirstPage.java
AU examples/src/main/java/org/apache/pdfbox/examples/pdmodel/PrintURLs.java
AU examples/src/main/java/org/apache/pdfbox/examples/pdmodel/CreateBlankPDF.java
AU examples/src/main/java/org/apache/pdfbox/examples/pdmodel/PrintBookmarks.java
AU examples/src/main/java/org/apache/pdfbox/examples/pdmodel/CreateLandscapePDF.java
AU examples/src/main/java/org/apache/pdfbox/examples/pdmodel/GoToSecondBookmarkOnOpen.java
AU examples/src/main/java/org/apache/pdfbox/examples/pdmodel/Annotation.java
AU examples/src/main/java/org/apache/pdfbox/examples/pdmodel/HelloWorldType1AfmPfb.java
AU examples/src/main/java/org/apache/pdfbox/examples/pdmodel/ExtractMetadata.java
AU examples/src/main/java/org/apache/pdfbox/examples/pdmodel/HelloWorld.java
AU examples/src/main/java/org/apache/pdfbox/examples/pdmodel/CreateBookmarks.java
AU examples/src/main/java/org/apache/pdfbox/examples/pdmodel/EmbeddedFiles.java
AU examples/src/main/java/org/apache/pdfbox/examples/pdmodel/package.html
AU examples/src/main/java/org/apache/pdfbox/examples/pdmodel/AddMessageToEachPage.java
AU examples/src/main/java/org/apache/pdfbox/examples/pdmodel/ImageToPDF.java
AU examples/src/main/java/org/apache/pdfbox/examples/pdmodel/AddMetadataFromDocInfo.java
AU examples/src/main/java/org/apache/pdfbox/examples/pdmodel/AddJavascript.java
AU examples/src/main/java/org/apache/pdfbox/examples/pdmodel/UsingTextMatrix.java
AU examples/src/main/java/org/apache/pdfbox/examples/pdmodel/ShowColorBoxes.java
AU examples/src/main/java/org/apache/pdfbox/examples/pdmodel/ReplaceURLs.java
AU examples/src/main/java/org/apache/pdfbox/examples/pdmodel/RubberStampWithImage.java
AU examples/src/main/java/org/apache/pdfbox/examples/pdmodel/RubberStamp.java
AU examples/src/main/java/org/apache/pdfbox/examples/pdmodel/AddImageToPDF.java
AU examples/src/main/java/org/apache/pdfbox/examples/pdmodel/HelloWorldTTF.java
AU examples/src/main/java/org/apache/pdfbox/examples/pdmodel/PrintDocumentMetaData.java
A examples/src/main/java/org/apache/pdfbox/examples/persistence
AU examples/src/main/java/org/apache/pdfbox/examples/persistence/CopyDoc.java
AU examples/src/main/java/org/apache/pdfbox/examples/persistence/package.html
A examples/src/main/java/org/apache/pdfbox/examples/util
AU examples/src/main/java/org/apache/pdfbox/examples/util/ExtractTextByArea.java
AU examples/src/main/java/org/apache/pdfbox/examples/util/PrintImageLocations.java
AU examples/src/main/java/org/apache/pdfbox/examples/util/RemoveAllText.java
AU examples/src/main/java/org/apache/pdfbox/examples/util/PrintTextLocations.java
AU examples/src/main/java/org/apache/pdfbox/examples/util/package.html
AU examples/src/main/java/org/apache/pdfbox/examples/package.html
AU examples/pom.xml
AU assembly.xml
U .
At revision 1311324
Parsing POMs
[trunk] $ /home/hudson/tools/java/latest1.5/bin/java -cp /home/jenkins/jenkins-slave/maven3-agent.jar:/home/hudson/tools/maven/latest3/boot/plexus-classworlds-2.4.jar org.jvnet.hudson.maven3.agent.Maven3Main /home/hudson/tools/maven/latest3 /home/jenkins/jenkins-slave/slave.jar /home/jenkins/jenkins-slave/maven3-interceptor.jar 35903
<===[JENKINS REMOTING CAPACITY]===>channel started
log4j:WARN No appenders could be found for logger (org.apache.commons.beanutils.converters.BooleanConverter).
log4j:WARN Please initialize the log4j system properly.
Executing Maven: -B -f <https://builds.apache.org/job/PDFBox-trunk/ws/trunk/pom.xml> -Dmaven.repo.local=/home/jenkins/jenkins-slave/maven-repositories/0 clean deploy -Ppedantic
[INFO] Scanning for projects...
[INFO] ------------------------------------------------------------------------
[INFO] Reactor Build Order:
[INFO]
[INFO] PDFBox parent
[INFO] Apache FontBox
[INFO] Apache JempBox
[INFO] Apache XmpBox
[INFO] Apache PDFBox
[INFO] Apache Preflight
[INFO] Apache PDFBox for Lucene
[INFO] Apache PDFBox for Ant
[INFO] Apache PDFBox webapp
[INFO] Apache PDFBox application
[INFO] Apache PDFBox examples
[INFO] PDFBox reactor
[INFO]
[INFO] ------------------------------------------------------------------------
[INFO] Building PDFBox parent 1.7.0-SNAPSHOT
[INFO] ------------------------------------------------------------------------
[INFO]
[INFO] --- maven-clean-plugin:2.4.1:clean (default-clean) @ pdfbox-parent ---
[INFO]
[INFO] --- maven-remote-resources-plugin:1.2.1:process (default) @ pdfbox-parent ---
[INFO]
[INFO] --- maven-site-plugin:3.0:attach-descriptor (attach-descriptor) @ pdfbox-parent ---
[INFO]
[INFO] --- apache-rat-plugin:0.6:check (default) @ pdfbox-parent ---
[INFO] Exclude: release.properties
[INFO] [INFO] Installing <https://builds.apache.org/job/PDFBox-trunk/ws/trunk/parent/pom.xml> to /home/jenkins/jenkins-slave/maven-repositories/0/org/apache/pdfbox/pdfbox-parent/1.7.0-SNAPSHOT/pdfbox-parent-1.7.0-SNAPSHOT.pom
[INFO] --- maven-install-plugin:2.3.1:install (default-install) @ pdfbox-parent ---
[INFO]
[INFO] --- maven-deploy-plugin:2.6:deploy (default-deploy) @ pdfbox-parent ---
Downloading: https://repository.apache.org/content/repositories/snapshots/org/apache/pdfbox/pdfbox-parent/1.7.0-SNAPSHOT/maven-metadata.xml
Downloaded: https://repository.apache.org/content/repositories/snapshots/org/apache/pdfbox/pdfbox-parent/1.7.0-SNAPSHOT/maven-metadata.xml (611 B at 0.6 KB/sec)
Uploading: https://repository.apache.org/content/repositories/snapshots/org/apache/pdfbox/pdfbox-parent/1.7.0-SNAPSHOT/pdfbox-parent-1.7.0-20120409.170551-138.pom
Uploaded: https://repository.apache.org/content/repositories/snapshots/org/apache/pdfbox/pdfbox-parent/1.7.0-SNAPSHOT/pdfbox-parent-1.7.0-20120409.170551-138.pom (7 KB at 11.1 KB/sec)
Downloading: https://repository.apache.org/content/repositories/snapshots/org/apache/pdfbox/pdfbox-parent/maven-metadata.xml
Downloaded: https://repository.apache.org/content/repositories/snapshots/org/apache/pdfbox/pdfbox-parent/maven-metadata.xml (430 B at 1.6 KB/sec)
Uploading: https://repository.apache.org/content/repositories/snapshots/org/apache/pdfbox/pdfbox-parent/1.7.0-SNAPSHOT/maven-metadata.xml
Uploaded: https://repository.apache.org/content/repositories/snapshots/org/apache/pdfbox/pdfbox-parent/1.7.0-SNAPSHOT/maven-metadata.xml (611 B at 2.1 KB/sec)
Uploading: https://repository.apache.org/content/repositories/snapshots/org/apache/pdfbox/pdfbox-parent/maven-metadata.xml
Uploaded: https://repository.apache.org/content/repositories/snapshots/org/apache/pdfbox/pdfbox-parent/maven-metadata.xml (430 B at 1.3 KB/sec)
[JENKINS] Archiving <https://builds.apache.org/job/PDFBox-trunk/ws/trunk/parent/pom.xml> to /home/hudson/hudson/jobs/PDFBox-trunk/modules/org.apache.pdfbox$pdfbox-parent/builds/2012-04-09_17-05-03/archive/org.apache.pdfbox/pdfbox-parent/1.7.0-SNAPSHOT/pdfbox-parent-1.7.0-SNAPSHOT.pom
[INFO]
[INFO] ------------------------------------------------------------------------
[INFO] Building Apache FontBox 1.7.0-SNAPSHOT
[INFO] ------------------------------------------------------------------------
[INFO]
[INFO] --- maven-clean-plugin:2.4.1:clean (default-clean) @ fontbox ---
[INFO]
[INFO] --- maven-remote-resources-plugin:1.2.1:process (default) @ fontbox ---
[INFO] [debug] execute contextualize
[INFO] --- maven-resources-plugin:2.5:resources (default-resources) @ fontbox ---
[INFO] Using 'ISO-8859-1' encoding to copy filtered resources.
[INFO] Copying 1 resource
[INFO] Copying 3 resources
[INFO]
[INFO] --- maven-compiler-plugin:2.3.2:compile (default-compile) @ fontbox ---
[INFO] Compiling 72 source files to <https://builds.apache.org/job/PDFBox-trunk/ws/trunk/fontbox/target/classes>
[INFO] -------------------------------------------------------------
[ERROR] COMPILATION ERROR :
[INFO] -------------------------------------------------------------
[ERROR] <https://builds.apache.org/job/PDFBox-trunk/ws/trunk/fontbox/src/main/java/org/apache/fontbox/ttf/GlyphData.java>:[53,22] cannot find symbol
symbol : constructor BoundingBox(short,short,short,short)
location: class org.apache.fontbox.util.BoundingBox
[INFO] 1 error
[INFO] -------------------------------------------------------------
[JENKINS] Archiving <https://builds.apache.org/job/PDFBox-trunk/ws/trunk/fontbox/pom.xml> to /home/hudson/hudson/jobs/PDFBox-trunk/modules/org.apache.pdfbox$fontbox/builds/2012-04-09_17-05-03/archive/org.apache.pdfbox/fontbox/1.7.0-SNAPSHOT/fontbox-1.7.0-SNAPSHOT.pom
[INFO] ------------------------------------------------------------------------
[INFO] Reactor Summary:
[INFO]
[INFO] PDFBox parent ..................................... SUCCESS [32.337s]
[INFO] Apache FontBox .................................... FAILURE [2.483s]
[INFO] Apache JempBox .................................... SKIPPED
[INFO] Apache XmpBox ..................................... SKIPPED
[INFO] Apache PDFBox ..................................... SKIPPED
[INFO] Apache Preflight .................................. SKIPPED
[INFO] Apache PDFBox for Lucene .......................... SKIPPED
[INFO] Apache PDFBox for Ant ............................. SKIPPED
[INFO] Apache PDFBox webapp .............................. SKIPPED
[INFO] Apache PDFBox application ......................... SKIPPED
[INFO] Apache PDFBox examples ............................ SKIPPED
[INFO] PDFBox reactor .................................... SKIPPED
[INFO] ------------------------------------------------------------------------
[INFO] BUILD FAILURE
[INFO] ------------------------------------------------------------------------
[INFO] Total time: 40.768s
[INFO] Finished at: Mon Apr 09 17:06:00 UTC 2012
[INFO] Final Memory: 19M/315M
[INFO] ------------------------------------------------------------------------
mavenExecutionResult exceptions not empty
message : Failed to execute goal org.apache.maven.plugins:maven-compiler-plugin:2.3.2:compile (default-compile) on project fontbox: Compilation failure
<https://builds.apache.org/job/PDFBox-trunk/ws/trunk/fontbox/src/main/java/org/apache/fontbox/ttf/GlyphData.java>:[53,22] cannot find symbol
symbol : constructor BoundingBox(short,short,short,short)
location: class org.apache.fontbox.util.BoundingBox
cause : Compilation failure
<https://builds.apache.org/job/PDFBox-trunk/ws/trunk/fontbox/src/main/java/org/apache/fontbox/ttf/GlyphData.java>:[53,22] cannot find symbol
symbol : constructor BoundingBox(short,short,short,short)
location: class org.apache.fontbox.util.BoundingBox
Stack trace :
org.apache.maven.lifecycle.LifecycleExecutionException: Failed to execute goal org.apache.maven.plugins:maven-compiler-plugin:2.3.2:compile (default-compile) on project fontbox: Compilation failure
<https://builds.apache.org/job/PDFBox-trunk/ws/trunk/fontbox/src/main/java/org/apache/fontbox/ttf/GlyphData.java>:[53,22] cannot find symbol
symbol : constructor BoundingBox(short,short,short,short)
location: class org.apache.fontbox.util.BoundingBox
at org.apache.maven.lifecycle.internal.MojoExecutor.execute(MojoExecutor.java:213)
at org.apache.maven.lifecycle.internal.MojoExecutor.execute(MojoExecutor.java:153)
at org.apache.maven.lifecycle.internal.MojoExecutor.execute(MojoExecutor.java:145)
at org.apache.maven.lifecycle.internal.LifecycleModuleBuilder.buildProject(LifecycleModuleBuilder.java:84)
at org.apache.maven.lifecycle.internal.LifecycleModuleBuilder.buildProject(LifecycleModuleBuilder.java:59)
at org.apache.maven.lifecycle.internal.LifecycleStarter.singleThreadedBuild(LifecycleStarter.java:183)
at org.apache.maven.lifecycle.internal.LifecycleStarter.execute(LifecycleStarter.java:161)
at org.apache.maven.DefaultMaven.doExecute(DefaultMaven.java:319)
at org.apache.maven.DefaultMaven.execute(DefaultMaven.java:156)
at org.jvnet.hudson.maven3.launcher.Maven3Launcher.main(Maven3Launcher.java:79)
at sun.reflect.NativeMethodAccessorImpl.invoke0(Native Method)
at sun.reflect.NativeMethodAccessorImpl.invoke(NativeMethodAccessorImpl.java:39)
at sun.reflect.DelegatingMethodAccessorImpl.invoke(DelegatingMethodAccessorImpl.java:25)
at java.lang.reflect.Method.invoke(Method.java:592)
at org.codehaus.plexus.classworlds.launcher.Launcher.launchStandard(Launcher.java:329)
at org.codehaus.plexus.classworlds.launcher.Launcher.launch(Launcher.java:239)
at org.jvnet.hudson.maven3.agent.Maven3Main.launch(Maven3Main.java:158)
at hudson.maven.Maven3Builder.call(Maven3Builder.java:104)
at hudson.maven.Maven3Builder.call(Maven3Builder.java:70)
at hudson.remoting.UserRequest.perform(UserRequest.java:118)
at hudson.remoting.UserRequest.perform(UserRequest.java:48)
at hudson.remoting.Request$2.run(Request.java:287)
at hudson.remoting.InterceptingExecutorService$1.call(InterceptingExecutorService.java:72)
at java.util.concurrent.FutureTask$Sync.innerRun(FutureTask.java:269)
at java.util.concurrent.FutureTask.run(FutureTask.java:123)
at java.util.concurrent.ThreadPoolExecutor$Worker.runTask(ThreadPoolExecutor.java:651)
at java.util.concurrent.ThreadPoolExecutor$Worker.run(ThreadPoolExecutor.java:676)
at java.lang.Thread.run(Thread.java:595)
Caused by: org.apache.maven.plugin.CompilationFailureException: Compilation failure
<https://builds.apache.org/job/PDFBox-trunk/ws/trunk/fontbox/src/main/java/org/apache/fontbox/ttf/GlyphData.java>:[53,22] cannot find symbol
symbol : constructor BoundingBox(short,short,short,short)
location: class org.apache.fontbox.util.BoundingBox
at org.apache.maven.plugin.AbstractCompilerMojo.execute(AbstractCompilerMojo.java:656)
at org.apache.maven.plugin.CompilerMojo.execute(CompilerMojo.java:128)
at org.apache.maven.plugin.DefaultBuildPluginManager.executeMojo(DefaultBuildPluginManager.java:101)
at org.apache.maven.lifecycle.internal.MojoExecutor.execute(MojoExecutor.java:209)
... 27 more
Sending e-mails to: dev@pdfbox.apache.org
channel stopped
Archiving artifacts