You are viewing a plain text version of this content. The canonical link for it is here.
Posted to dev@lucene.apache.org by Policeman Jenkins Server <je...@thetaphi.de> on 2017/02/12 09:16:27 UTC
[JENKINS-EA] Lucene-Solr-6.x-Linux (32bit/jdk-9-ea+155) - Build #
2839 - Still Unstable!
Build: https://jenkins.thetaphi.de/job/Lucene-Solr-6.x-Linux/2839/
Java: 32bit/jdk-9-ea+155 -client -XX:+UseSerialGC
2 tests failed.
FAILED: org.apache.solr.handler.admin.TestApiFramework.testFramework
Error Message:
Could not initialize class org.easymock.internal.ClassProxyFactory$2
Stack Trace:
java.lang.NoClassDefFoundError: Could not initialize class org.easymock.internal.ClassProxyFactory$2
at __randomizedtesting.SeedInfo.seed([6A49E6DF28DBD556:7D3F2CF82E0F396B]:0)
at org.easymock.internal.ClassProxyFactory.createEnhancer(ClassProxyFactory.java:259)
at org.easymock.internal.ClassProxyFactory.createProxy(ClassProxyFactory.java:174)
at org.easymock.internal.MocksControl.createMock(MocksControl.java:60)
at org.easymock.EasyMock.createMock(EasyMock.java:104)
at org.apache.solr.handler.admin.TestCoreAdminApis.getCoreContainerMock(TestCoreAdminApis.java:76)
at org.apache.solr.handler.admin.TestApiFramework.testFramework(TestApiFramework.java:59)
at java.base/jdk.internal.reflect.NativeMethodAccessorImpl.invoke0(Native Method)
at java.base/jdk.internal.reflect.NativeMethodAccessorImpl.invoke(NativeMethodAccessorImpl.java:62)
at java.base/jdk.internal.reflect.DelegatingMethodAccessorImpl.invoke(DelegatingMethodAccessorImpl.java:43)
at java.base/java.lang.reflect.Method.invoke(Method.java:543)
at com.carrotsearch.randomizedtesting.RandomizedRunner.invoke(RandomizedRunner.java:1713)
at com.carrotsearch.randomizedtesting.RandomizedRunner$8.evaluate(RandomizedRunner.java:907)
at com.carrotsearch.randomizedtesting.RandomizedRunner$9.evaluate(RandomizedRunner.java:943)
at com.carrotsearch.randomizedtesting.RandomizedRunner$10.evaluate(RandomizedRunner.java:957)
at com.carrotsearch.randomizedtesting.rules.SystemPropertiesRestoreRule$1.evaluate(SystemPropertiesRestoreRule.java:57)
at org.apache.lucene.util.TestRuleSetupTeardownChained$1.evaluate(TestRuleSetupTeardownChained.java:49)
at org.apache.lucene.util.AbstractBeforeAfterRule$1.evaluate(AbstractBeforeAfterRule.java:45)
at org.apache.lucene.util.TestRuleThreadAndTestName$1.evaluate(TestRuleThreadAndTestName.java:48)
at org.apache.lucene.util.TestRuleIgnoreAfterMaxFailures$1.evaluate(TestRuleIgnoreAfterMaxFailures.java:64)
at org.apache.lucene.util.TestRuleMarkFailure$1.evaluate(TestRuleMarkFailure.java:47)
at com.carrotsearch.randomizedtesting.rules.StatementAdapter.evaluate(StatementAdapter.java:36)
at com.carrotsearch.randomizedtesting.ThreadLeakControl$StatementRunner.run(ThreadLeakControl.java:368)
at com.carrotsearch.randomizedtesting.ThreadLeakControl.forkTimeoutingTask(ThreadLeakControl.java:817)
at com.carrotsearch.randomizedtesting.ThreadLeakControl$3.evaluate(ThreadLeakControl.java:468)
at com.carrotsearch.randomizedtesting.RandomizedRunner.runSingleTest(RandomizedRunner.java:916)
at com.carrotsearch.randomizedtesting.RandomizedRunner$5.evaluate(RandomizedRunner.java:802)
at com.carrotsearch.randomizedtesting.RandomizedRunner$6.evaluate(RandomizedRunner.java:852)
at com.carrotsearch.randomizedtesting.RandomizedRunner$7.evaluate(RandomizedRunner.java:863)
at com.carrotsearch.randomizedtesting.rules.StatementAdapter.evaluate(StatementAdapter.java:36)
at com.carrotsearch.randomizedtesting.rules.SystemPropertiesRestoreRule$1.evaluate(SystemPropertiesRestoreRule.java:57)
at org.apache.lucene.util.AbstractBeforeAfterRule$1.evaluate(AbstractBeforeAfterRule.java:45)
at com.carrotsearch.randomizedtesting.rules.StatementAdapter.evaluate(StatementAdapter.java:36)
at org.apache.lucene.util.TestRuleStoreClassName$1.evaluate(TestRuleStoreClassName.java:41)
at com.carrotsearch.randomizedtesting.rules.NoShadowingOrOverridesOnMethodsRule$1.evaluate(NoShadowingOrOverridesOnMethodsRule.java:40)
at com.carrotsearch.randomizedtesting.rules.NoShadowingOrOverridesOnMethodsRule$1.evaluate(NoShadowingOrOverridesOnMethodsRule.java:40)
at com.carrotsearch.randomizedtesting.rules.StatementAdapter.evaluate(StatementAdapter.java:36)
at com.carrotsearch.randomizedtesting.rules.StatementAdapter.evaluate(StatementAdapter.java:36)
at org.apache.lucene.util.TestRuleAssertionsRequired$1.evaluate(TestRuleAssertionsRequired.java:53)
at org.apache.lucene.util.TestRuleMarkFailure$1.evaluate(TestRuleMarkFailure.java:47)
at org.apache.lucene.util.TestRuleIgnoreAfterMaxFailures$1.evaluate(TestRuleIgnoreAfterMaxFailures.java:64)
at org.apache.lucene.util.TestRuleIgnoreTestSuites$1.evaluate(TestRuleIgnoreTestSuites.java:54)
at com.carrotsearch.randomizedtesting.rules.StatementAdapter.evaluate(StatementAdapter.java:36)
at com.carrotsearch.randomizedtesting.ThreadLeakControl$StatementRunner.run(ThreadLeakControl.java:368)
at java.base/java.lang.Thread.run(Thread.java:844)
FAILED: org.apache.solr.handler.admin.TestCoreAdminApis.testCalls
Error Message:
Stack Trace:
java.lang.ExceptionInInitializerError
at __randomizedtesting.SeedInfo.seed([6A49E6DF28DBD556:5888F9B4AD5766F1]:0)
at net.sf.cglib.core.KeyFactory$Generator.generateClass(KeyFactory.java:166)
at net.sf.cglib.core.DefaultGeneratorStrategy.generate(DefaultGeneratorStrategy.java:25)
at net.sf.cglib.core.AbstractClassGenerator.create(AbstractClassGenerator.java:216)
at net.sf.cglib.core.KeyFactory$Generator.create(KeyFactory.java:144)
at net.sf.cglib.core.KeyFactory.create(KeyFactory.java:116)
at net.sf.cglib.core.KeyFactory.create(KeyFactory.java:108)
at net.sf.cglib.core.KeyFactory.create(KeyFactory.java:104)
at net.sf.cglib.proxy.Enhancer.<clinit>(Enhancer.java:69)
at org.easymock.internal.ClassProxyFactory.createEnhancer(ClassProxyFactory.java:259)
at org.easymock.internal.ClassProxyFactory.createProxy(ClassProxyFactory.java:174)
at org.easymock.internal.MocksControl.createMock(MocksControl.java:60)
at org.easymock.EasyMock.createMock(EasyMock.java:104)
at org.apache.solr.handler.admin.TestCoreAdminApis.getCoreContainerMock(TestCoreAdminApis.java:76)
at org.apache.solr.handler.admin.TestCoreAdminApis.testCalls(TestCoreAdminApis.java:43)
at java.base/jdk.internal.reflect.NativeMethodAccessorImpl.invoke0(Native Method)
at java.base/jdk.internal.reflect.NativeMethodAccessorImpl.invoke(NativeMethodAccessorImpl.java:62)
at java.base/jdk.internal.reflect.DelegatingMethodAccessorImpl.invoke(DelegatingMethodAccessorImpl.java:43)
at java.base/java.lang.reflect.Method.invoke(Method.java:543)
at com.carrotsearch.randomizedtesting.RandomizedRunner.invoke(RandomizedRunner.java:1713)
at com.carrotsearch.randomizedtesting.RandomizedRunner$8.evaluate(RandomizedRunner.java:907)
at com.carrotsearch.randomizedtesting.RandomizedRunner$9.evaluate(RandomizedRunner.java:943)
at com.carrotsearch.randomizedtesting.RandomizedRunner$10.evaluate(RandomizedRunner.java:957)
at com.carrotsearch.randomizedtesting.rules.SystemPropertiesRestoreRule$1.evaluate(SystemPropertiesRestoreRule.java:57)
at org.apache.lucene.util.TestRuleSetupTeardownChained$1.evaluate(TestRuleSetupTeardownChained.java:49)
at org.apache.lucene.util.AbstractBeforeAfterRule$1.evaluate(AbstractBeforeAfterRule.java:45)
at org.apache.lucene.util.TestRuleThreadAndTestName$1.evaluate(TestRuleThreadAndTestName.java:48)
at org.apache.lucene.util.TestRuleIgnoreAfterMaxFailures$1.evaluate(TestRuleIgnoreAfterMaxFailures.java:64)
at org.apache.lucene.util.TestRuleMarkFailure$1.evaluate(TestRuleMarkFailure.java:47)
at com.carrotsearch.randomizedtesting.rules.StatementAdapter.evaluate(StatementAdapter.java:36)
at com.carrotsearch.randomizedtesting.ThreadLeakControl$StatementRunner.run(ThreadLeakControl.java:368)
at com.carrotsearch.randomizedtesting.ThreadLeakControl.forkTimeoutingTask(ThreadLeakControl.java:817)
at com.carrotsearch.randomizedtesting.ThreadLeakControl$3.evaluate(ThreadLeakControl.java:468)
at com.carrotsearch.randomizedtesting.RandomizedRunner.runSingleTest(RandomizedRunner.java:916)
at com.carrotsearch.randomizedtesting.RandomizedRunner$5.evaluate(RandomizedRunner.java:802)
at com.carrotsearch.randomizedtesting.RandomizedRunner$6.evaluate(RandomizedRunner.java:852)
at com.carrotsearch.randomizedtesting.RandomizedRunner$7.evaluate(RandomizedRunner.java:863)
at com.carrotsearch.randomizedtesting.rules.StatementAdapter.evaluate(StatementAdapter.java:36)
at com.carrotsearch.randomizedtesting.rules.SystemPropertiesRestoreRule$1.evaluate(SystemPropertiesRestoreRule.java:57)
at org.apache.lucene.util.AbstractBeforeAfterRule$1.evaluate(AbstractBeforeAfterRule.java:45)
at com.carrotsearch.randomizedtesting.rules.StatementAdapter.evaluate(StatementAdapter.java:36)
at org.apache.lucene.util.TestRuleStoreClassName$1.evaluate(TestRuleStoreClassName.java:41)
at com.carrotsearch.randomizedtesting.rules.NoShadowingOrOverridesOnMethodsRule$1.evaluate(NoShadowingOrOverridesOnMethodsRule.java:40)
at com.carrotsearch.randomizedtesting.rules.NoShadowingOrOverridesOnMethodsRule$1.evaluate(NoShadowingOrOverridesOnMethodsRule.java:40)
at com.carrotsearch.randomizedtesting.rules.StatementAdapter.evaluate(StatementAdapter.java:36)
at com.carrotsearch.randomizedtesting.rules.StatementAdapter.evaluate(StatementAdapter.java:36)
at org.apache.lucene.util.TestRuleAssertionsRequired$1.evaluate(TestRuleAssertionsRequired.java:53)
at org.apache.lucene.util.TestRuleMarkFailure$1.evaluate(TestRuleMarkFailure.java:47)
at org.apache.lucene.util.TestRuleIgnoreAfterMaxFailures$1.evaluate(TestRuleIgnoreAfterMaxFailures.java:64)
at org.apache.lucene.util.TestRuleIgnoreTestSuites$1.evaluate(TestRuleIgnoreTestSuites.java:54)
at com.carrotsearch.randomizedtesting.rules.StatementAdapter.evaluate(StatementAdapter.java:36)
at com.carrotsearch.randomizedtesting.ThreadLeakControl$StatementRunner.run(ThreadLeakControl.java:368)
at java.base/java.lang.Thread.run(Thread.java:844)
Caused by: java.lang.reflect.InaccessibleObjectException: Unable to make protected final java.lang.Class java.lang.ClassLoader.defineClass(java.lang.String,byte[],int,int,java.security.ProtectionDomain) throws java.lang.ClassFormatError accessible: module java.base does not "opens java.lang" to unnamed module @7ba215
at java.base/java.lang.reflect.AccessibleObject.checkCanSetAccessible(AccessibleObject.java:207)
at java.base/java.lang.reflect.Method.checkCanSetAccessible(Method.java:192)
at java.base/java.lang.reflect.Method.setAccessible(Method.java:186)
at net.sf.cglib.core.ReflectUtils$2.run(ReflectUtils.java:56)
at java.base/java.security.AccessController.doPrivileged(Native Method)
at net.sf.cglib.core.ReflectUtils.<clinit>(ReflectUtils.java:46)
... 52 more
Build Log:
[...truncated 10888 lines...]
[junit4] Suite: org.apache.solr.handler.admin.TestCoreAdminApis
[junit4] 2> Creating dataDir: /home/jenkins/workspace/Lucene-Solr-6.x-Linux/solr/build/solr-core/test/J1/temp/solr.handler.admin.TestCoreAdminApis_6A49E6DF28DBD556-001/init-core-data-001
[junit4] 2> 5446 INFO (SUITE-TestCoreAdminApis-seed#[6A49E6DF28DBD556]-worker) [ ] o.a.s.SolrTestCaseJ4 Randomized ssl (false) and clientAuth (true) via: @org.apache.solr.util.RandomizeSSL(reason="", ssl=0.0/0.0, value=0.0/0.0, clientAuth=0.0/0.0)
[junit4] 2> 5448 INFO (TEST-TestCoreAdminApis.testCalls-seed#[6A49E6DF28DBD556]) [ ] o.a.s.SolrTestCaseJ4 ###Starting testCalls
[junit4] 2> 5503 INFO (TEST-TestCoreAdminApis.testCalls-seed#[6A49E6DF28DBD556]) [ ] o.a.s.SolrTestCaseJ4 ###Ending testCalls
[junit4] 2> NOTE: reproduce with: ant test -Dtestcase=TestCoreAdminApis -Dtests.method=testCalls -Dtests.seed=6A49E6DF28DBD556 -Dtests.multiplier=3 -Dtests.slow=true -Dtests.locale=en-KN -Dtests.timezone=Europe/Zurich -Dtests.asserts=true -Dtests.file.encoding=UTF-8
[junit4] ERROR 0.06s J1 | TestCoreAdminApis.testCalls <<<
[junit4] > Throwable #1: java.lang.ExceptionInInitializerError
[junit4] > at __randomizedtesting.SeedInfo.seed([6A49E6DF28DBD556:5888F9B4AD5766F1]:0)
[junit4] > at net.sf.cglib.core.KeyFactory$Generator.generateClass(KeyFactory.java:166)
[junit4] > at net.sf.cglib.core.DefaultGeneratorStrategy.generate(DefaultGeneratorStrategy.java:25)
[junit4] > at net.sf.cglib.core.AbstractClassGenerator.create(AbstractClassGenerator.java:216)
[junit4] > at net.sf.cglib.core.KeyFactory$Generator.create(KeyFactory.java:144)
[junit4] > at net.sf.cglib.core.KeyFactory.create(KeyFactory.java:116)
[junit4] > at net.sf.cglib.core.KeyFactory.create(KeyFactory.java:108)
[junit4] > at net.sf.cglib.core.KeyFactory.create(KeyFactory.java:104)
[junit4] > at net.sf.cglib.proxy.Enhancer.<clinit>(Enhancer.java:69)
[junit4] > at org.easymock.internal.ClassProxyFactory.createEnhancer(ClassProxyFactory.java:259)
[junit4] > at org.easymock.internal.ClassProxyFactory.createProxy(ClassProxyFactory.java:174)
[junit4] > at org.easymock.internal.MocksControl.createMock(MocksControl.java:60)
[junit4] > at org.easymock.EasyMock.createMock(EasyMock.java:104)
[junit4] > at org.apache.solr.handler.admin.TestCoreAdminApis.getCoreContainerMock(TestCoreAdminApis.java:76)
[junit4] > at org.apache.solr.handler.admin.TestCoreAdminApis.testCalls(TestCoreAdminApis.java:43)
[junit4] > at java.base/jdk.internal.reflect.NativeMethodAccessorImpl.invoke0(Native Method)
[junit4] > at java.base/jdk.internal.reflect.NativeMethodAccessorImpl.invoke(NativeMethodAccessorImpl.java:62)
[junit4] > at java.base/jdk.internal.reflect.DelegatingMethodAccessorImpl.invoke(DelegatingMethodAccessorImpl.java:43)
[junit4] > at java.base/java.lang.reflect.Method.invoke(Method.java:543)
[junit4] > at java.base/java.lang.Thread.run(Thread.java:844)
[junit4] > Caused by: java.lang.reflect.InaccessibleObjectException: Unable to make protected final java.lang.Class java.lang.ClassLoader.defineClass(java.lang.String,byte[],int,int,java.security.ProtectionDomain) throws java.lang.ClassFormatError accessible: module java.base does not "opens java.lang" to unnamed module @7ba215
[junit4] > at java.base/java.lang.reflect.AccessibleObject.checkCanSetAccessible(AccessibleObject.java:207)
[junit4] > at java.base/java.lang.reflect.Method.checkCanSetAccessible(Method.java:192)
[junit4] > at java.base/java.lang.reflect.Method.setAccessible(Method.java:186)
[junit4] > at net.sf.cglib.core.ReflectUtils$2.run(ReflectUtils.java:56)
[junit4] > at java.base/java.security.AccessController.doPrivileged(Native Method)
[junit4] > at net.sf.cglib.core.ReflectUtils.<clinit>(ReflectUtils.java:46)
[junit4] > ... 52 more
[junit4] 2> 5507 INFO (SUITE-TestCoreAdminApis-seed#[6A49E6DF28DBD556]-worker) [ ] o.a.s.SolrTestCaseJ4 ###deleteCore
[junit4] 2> NOTE: leaving temporary files on disk at: /home/jenkins/workspace/Lucene-Solr-6.x-Linux/solr/build/solr-core/test/J1/temp/solr.handler.admin.TestCoreAdminApis_6A49E6DF28DBD556-001
[junit4] 2> NOTE: test params are: codec=Asserting(Lucene62): {}, docValues:{}, maxPointsInLeafNode=936, maxMBSortInHeap=6.905690288547995, sim=RandomSimilarity(queryNorm=true,coord=crazy): {}, locale=en-KN, timezone=Europe/Zurich
[junit4] 2> NOTE: Linux 4.4.0-53-generic i386/Oracle Corporation 9-ea (32-bit)/cpus=12,threads=1,free=38893328,total=64946176
[junit4] 2> NOTE: All tests run in this JVM: [TestConfigSets, TestInitParams, TestCoreAdminApis]
[junit4] Completed [5/691 (1!)] on J1 in 0.08s, 1 test, 1 error <<< FAILURES!
[...truncated 986 lines...]
[junit4] Suite: org.apache.solr.handler.admin.TestApiFramework
[junit4] 2> Creating dataDir: /home/jenkins/workspace/Lucene-Solr-6.x-Linux/solr/build/solr-core/test/J1/temp/solr.handler.admin.TestApiFramework_6A49E6DF28DBD556-001/init-core-data-001
[junit4] 2> 1224415 INFO (SUITE-TestApiFramework-seed#[6A49E6DF28DBD556]-worker) [ ] o.a.s.SolrTestCaseJ4 Randomized ssl (true) and clientAuth (false) via: @org.apache.solr.util.RandomizeSSL(reason="", ssl=0.0/0.0, value=0.0/0.0, clientAuth=0.0/0.0)
[junit4] 2> 1224418 INFO (TEST-TestApiFramework.testFramework-seed#[6A49E6DF28DBD556]) [ ] o.a.s.SolrTestCaseJ4 ###Starting testFramework
[junit4] 2> 1224419 INFO (TEST-TestApiFramework.testFramework-seed#[6A49E6DF28DBD556]) [ ] o.a.s.SolrTestCaseJ4 ###Ending testFramework
[junit4] 2> NOTE: reproduce with: ant test -Dtestcase=TestApiFramework -Dtests.method=testFramework -Dtests.seed=6A49E6DF28DBD556 -Dtests.multiplier=3 -Dtests.slow=true -Dtests.locale=en-AG -Dtests.timezone=Europe/Bratislava -Dtests.asserts=true -Dtests.file.encoding=UTF-8
[junit4] ERROR 0.00s J1 | TestApiFramework.testFramework <<<
[junit4] > Throwable #1: java.lang.NoClassDefFoundError: Could not initialize class org.easymock.internal.ClassProxyFactory$2
[junit4] > at __randomizedtesting.SeedInfo.seed([6A49E6DF28DBD556:7D3F2CF82E0F396B]:0)
[junit4] > at org.easymock.internal.ClassProxyFactory.createEnhancer(ClassProxyFactory.java:259)
[junit4] > at org.easymock.internal.ClassProxyFactory.createProxy(ClassProxyFactory.java:174)
[junit4] > at org.easymock.internal.MocksControl.createMock(MocksControl.java:60)
[junit4] > at org.easymock.EasyMock.createMock(EasyMock.java:104)
[junit4] > at org.apache.solr.handler.admin.TestCoreAdminApis.getCoreContainerMock(TestCoreAdminApis.java:76)
[junit4] > at org.apache.solr.handler.admin.TestApiFramework.testFramework(TestApiFramework.java:59)
[junit4] > at java.base/jdk.internal.reflect.NativeMethodAccessorImpl.invoke0(Native Method)
[junit4] > at java.base/jdk.internal.reflect.NativeMethodAccessorImpl.invoke(NativeMethodAccessorImpl.java:62)
[junit4] > at java.base/jdk.internal.reflect.DelegatingMethodAccessorImpl.invoke(DelegatingMethodAccessorImpl.java:43)
[junit4] > at java.base/java.lang.reflect.Method.invoke(Method.java:543)
[junit4] > at java.base/java.lang.Thread.run(Thread.java:844)
[junit4] 2> 1224422 INFO (TEST-TestApiFramework.testTrailingTemplatePaths-seed#[6A49E6DF28DBD556]) [ ] o.a.s.SolrTestCaseJ4 ###Starting testTrailingTemplatePaths
[junit4] 2> 1224423 INFO (TEST-TestApiFramework.testTrailingTemplatePaths-seed#[6A49E6DF28DBD556]) [ ] o.a.s.SolrTestCaseJ4 ###Ending testTrailingTemplatePaths
[junit4] 2> 1224423 INFO (SUITE-TestApiFramework-seed#[6A49E6DF28DBD556]-worker) [ ] o.a.s.SolrTestCaseJ4 ###deleteCore
[junit4] 2> NOTE: leaving temporary files on disk at: /home/jenkins/workspace/Lucene-Solr-6.x-Linux/solr/build/solr-core/test/J1/temp/solr.handler.admin.TestApiFramework_6A49E6DF28DBD556-001
[junit4] 2> NOTE: test params are: codec=Asserting(Lucene62): {}, docValues:{}, maxPointsInLeafNode=269, maxMBSortInHeap=6.684713354003067, sim=RandomSimilarity(queryNorm=true,coord=no): {}, locale=en-AG, timezone=Europe/Bratislava
[junit4] 2> NOTE: Linux 4.4.0-53-generic i386/Oracle Corporation 9-ea (32-bit)/cpus=12,threads=1,free=66062152,total=284033024
[junit4] 2> NOTE: All tests run in this JVM: [TestConfigSets, TestInitParams, TestCoreAdminApis, ConvertedLegacyTest, MultiTermTest, FacetPivotSmallTest, TestSolrConfigHandlerCloud, TestNumericTerms64, LoggingHandlerTest, TestSystemIdResolver, TestSortByMinMaxFunction, ConcurrentDeleteAndCreateCollectionTest, V2ApiIntegrationTest, HttpPartitionTest, TestCloudPseudoReturnFields, TestRebalanceLeaders, CoreMergeIndexesAdminHandlerTest, DistributedMLTComponentTest, DateRangeFieldTest, SolrCmdDistributorTest, CollectionTooManyReplicasTest, TestMiniSolrCloudCluster, TestHdfsBackupRestoreCore, LeaderFailureAfterFreshStartTest, MetricUtilsTest, DistributedVersionInfoTest, TestDistributedGrouping, TestQueryTypes, HighlighterTest, TestShortCircuitedRequests, ZkSolrClientTest, TestUniqueKeyFieldResource, OverseerModifyCollectionTest, TestFieldCacheSort, TestComplexPhraseLeadingWildcard, HdfsDirectoryTest, MigrateRouteKeyTest, HdfsBasicDistributedZk2Test, TestJsonFacets, OutOfBoxZkACLAndCredentialsProvidersTest, IndexSchemaRuntimeFieldTest, TestDynamicFieldResource, DistributedFacetExistsSmallTest, BlockCacheTest, TestEmbeddedSolrServerConstructors, TestLRUStatsCache, ShufflingReplicaListTransformerTest, TestClusterStateMutator, WordBreakSolrSpellCheckerTest, TestRestManager, HdfsRecoverLeaseTest, TestQuerySenderListener, TestNamedUpdateProcessors, TestCSVResponseWriter, TestHdfsCloudBackupRestore, TestShardHandlerFactory, TestStandardQParsers, HdfsSyncSliceTest, TestRawResponseWriter, CloudExitableDirectoryReaderTest, TestSearcherReuse, OverseerTaskQueueTest, CdcrReplicationDistributedZkTest, TestTrie, DeleteShardTest, TestSolrXml, TestSolr4Spatial2, SpatialFilterTest, HdfsDirectoryFactoryTest, TestFieldTypeCollectionResource, ZkCLITest, AddSchemaFieldsUpdateProcessorFactoryTest, HighlighterMaxOffsetTest, DocValuesTest, TestSchemalessBufferedUpdates, TestDFISimilarityFactory, DistributedQueryComponentCustomSortTest, SpellCheckCollatorTest, TestConfigOverlay, RequestLoggingTest, ManagedSchemaRoundRobinCloudTest, SpellingQueryConverterTest, TestCloudSchemaless, BadCopyFieldTest, SolrMetricReporterTest, TestLMDirichletSimilarityFactory, TestFieldCacheWithThreads, TestSimpleTrackingShardHandler, UpdateRequestProcessorFactoryTest, TestManagedSchemaAPI, SimplePostToolTest, ShardRoutingCustomTest, BitVectorTest, ChaosMonkeySafeLeaderTest, TestRTGBase, TestAuthorizationFramework, JvmMetricsTest, TestCoreContainer, TestRequestStatusCollectionAPI, TestSearchPerf, TestApiFramework]
[junit4] Completed [305/691 (2!)] on J1 in 0.03s, 2 tests, 1 error <<< FAILURES!
[...truncated 52889 lines...]