You are viewing a plain text version of this content. The canonical link for it is here.
Posted to issues@camel.apache.org by "Önder Sezgin (JIRA)" <ji...@apache.org> on 2017/10/24 08:31:02 UTC
[jira] [Created] (CAMEL-11942) camel-spring build failure on
windows
Önder Sezgin created CAMEL-11942:
------------------------------------
Summary: camel-spring build failure on windows
Key: CAMEL-11942
URL: https://issues.apache.org/jira/browse/CAMEL-11942
Project: Camel
Issue Type: Bug
Components: camel-spring
Affects Versions: 2.20.0
Reporter: Önder Sezgin
Priority: Minor
[INFO] Executed tasks
[INFO]
[INFO] --- exec-maven-plugin:1.1.1:exec (generate schema) @ camel-spring ---
[INFO] ------------------------------------------------------------------------
[INFO] BUILD FAILURE
[INFO] ------------------------------------------------------------------------
[INFO] Total time: 03:33 min
[INFO] Finished at: 2017-10-24T10:27:33+03:00
[INFO] Final Memory: 37M/240M
[INFO] ------------------------------------------------------------------------
[ERROR] Failed to execute goal org.codehaus.mojo:exec-maven-plugin:1.1.1:exec (g
enerate schema) on project camel-spring: Command execution failed. Error while e
xecuting process. Cannot run program "cmd.exe" (in directory "D:\dev\github\came
l\components\camel-spring"): CreateProcess error=206, The filename or extension
is too long -> [Help 1]
[ERROR]
--
This message was sent by Atlassian JIRA
(v6.4.14#64029)