You are viewing a plain text version of this content. The canonical link for it is here.
Posted to notifications@maven.apache.org by Apache Jenkins Server <je...@builds.apache.org> on 2019/10/06 01:21:58 UTC
Build failed in Jenkins: Maven TLP » maven-surefire » master #65
See https://builds.apache.org/job/maven-box/job/maven-surefire/job/master/65/
Changes:
* temporarily disabled JUnit5 1.6.0-SNAPSHOT due to Sonatype issue
All tests passed
Build log:
[...truncated 121974 lines...]
[2019-10-06T01:18:08.559Z] [INFO] --- maven-failsafe-plugin:3.0.0-M3:verify (default) @ surefire-its ---
[2019-10-06T01:18:08.559Z] [INFO] Failsafe report directory: C:\Users\jenkins\AppData\Local\Temp\3\jenkins-maven-box-maven-surefire-master-65\surefire-its\target\failsafe-reports
[2019-10-06T01:18:08.559Z] [INFO]
[2019-10-06T01:18:08.559Z] [INFO] --- maven-install-plugin:2.5.2:install (default-install) @ surefire-its ---
[2019-10-06T01:18:08.559Z] [INFO] Skipping artifact installation
[2019-10-06T01:18:08.559Z] [INFO] ------------------------------------------------------------------------
[2019-10-06T01:18:08.559Z] [INFO] Reactor Summary for Apache Maven Surefire 3.0.0-SNAPSHOT:
[2019-10-06T01:18:08.559Z] [INFO]
[2019-10-06T01:18:08.559Z] [INFO] Apache Maven Surefire .............................. SUCCESS [01:17 min]
[2019-10-06T01:18:08.559Z] [INFO] SureFire Logger API ................................ SUCCESS [ 28.821 s]
[2019-10-06T01:18:08.559Z] [INFO] SureFire API ....................................... SUCCESS [ 18.758 s]
[2019-10-06T01:18:08.559Z] [INFO] Surefire Extensions API ............................ SUCCESS [ 3.426 s]
[2019-10-06T01:18:08.559Z] [INFO] SureFire Booter .................................... SUCCESS [ 19.246 s]
[2019-10-06T01:18:08.559Z] [INFO] Maven Surefire Test-Grouping Support ............... SUCCESS [ 12.979 s]
[2019-10-06T01:18:08.559Z] [INFO] SureFire Providers ................................. SUCCESS [ 1.261 s]
[2019-10-06T01:18:08.559Z] [INFO] Shared JUnit3 Provider Code ........................ SUCCESS [ 5.260 s]
[2019-10-06T01:18:08.559Z] [INFO] Shared Java 5 Provider Base ........................ SUCCESS [ 7.114 s]
[2019-10-06T01:18:08.559Z] [INFO] Shared JUnit4 Provider Code ........................ SUCCESS [ 7.954 s]
[2019-10-06T01:18:08.559Z] [INFO] Shared JUnit48 Provider Code ....................... SUCCESS [ 8.203 s]
[2019-10-06T01:18:08.559Z] [INFO] SureFire JUnit Runner .............................. SUCCESS [ 6.059 s]
[2019-10-06T01:18:08.559Z] [INFO] SureFire JUnit4 Runner ............................. SUCCESS [ 15.252 s]
[2019-10-06T01:18:08.559Z] [INFO] Maven Surefire Common .............................. SUCCESS [ 50.026 s]
[2019-10-06T01:18:08.559Z] [INFO] SureFire JUnitCore Runner .......................... SUCCESS [02:24 min]
[2019-10-06T01:18:08.559Z] [INFO] SureFire JUnit Platform Runner ..................... SUCCESS [ 13.243 s]
[2019-10-06T01:18:08.559Z] [INFO] SureFire TestNG Utils .............................. SUCCESS [ 6.068 s]
[2019-10-06T01:18:08.559Z] [INFO] SureFire TestNG Runner ............................. SUCCESS [ 8.133 s]
[2019-10-06T01:18:08.559Z] [INFO] ShadeFire JUnit3 Provider .......................... SUCCESS [ 2.465 s]
[2019-10-06T01:18:08.559Z] [INFO] Surefire Report Parser ............................. SUCCESS [ 10.001 s]
[2019-10-06T01:18:08.559Z] [INFO] Maven Surefire Plugin .............................. SUCCESS [ 19.918 s]
[2019-10-06T01:18:08.559Z] [INFO] Maven Failsafe Plugin .............................. SUCCESS [02:09 min]
[2019-10-06T01:18:08.559Z] [INFO] Maven Surefire Report Plugin ....................... SUCCESS [ 19.480 s]
[2019-10-06T01:18:08.559Z] [INFO] Maven Surefire Integration Tests ................... SUCCESS [ 01:20 h]
[2019-10-06T01:18:08.559Z] [INFO] ------------------------------------------------------------------------
[2019-10-06T01:18:08.559Z] [INFO] BUILD SUCCESS
[2019-10-06T01:18:08.559Z] [INFO] ------------------------------------------------------------------------
[2019-10-06T01:18:08.559Z] [INFO] Total time: 01:30 h
[2019-10-06T01:18:08.559Z] [INFO] Finished at: 2019-10-05T18:18:08-07:00
[2019-10-06T01:18:08.559Z] [INFO] ------------------------------------------------------------------------
[Pipeline] }
[Pipeline] // withEnv
[Pipeline] }
[Pipeline] // stage
[Pipeline] fileExists
[Pipeline] zip
[2019-10-06T01:18:08.710Z] Writing zip file of C:\Users\jenkins\AppData\Local\Temp\3\jenkins-maven-box-maven-surefire-master-65\maven-failsafe-plugin\target\it to C:\Users\jenkins\AppData\Local\Temp\3\jenkins-maven-box-maven-surefire-master-65\maven-failsafe-plugin--windows-jdk11-maven3.6.x.zip
[2019-10-06T01:18:08.924Z] Zipped 78 entries.
[2019-10-06T01:18:08.924Z] Archiving C:\Users\jenkins\AppData\Local\Temp\3\jenkins-maven-box-maven-surefire-master-65\maven-failsafe-plugin--windows-jdk11-maven3.6.x.zip
[2019-10-06T01:18:08.924Z] [Fast Archiver] No artifacts from Maven TLP » maven-surefire » master #55 to compare, so performing full copy of artifacts
[Pipeline] fileExists
[Pipeline] zip
[2019-10-06T01:18:09.005Z] Writing zip file of C:\Users\jenkins\AppData\Local\Temp\3\jenkins-maven-box-maven-surefire-master-65\surefire-its\target to C:\Users\jenkins\AppData\Local\Temp\3\jenkins-maven-box-maven-surefire-master-65\surefire-its--windows-jdk11-maven3.6.x.zip
[2019-10-06T01:18:22.490Z] Zipped 17079 entries.
[2019-10-06T01:18:22.490Z] Archiving C:\Users\jenkins\AppData\Local\Temp\3\jenkins-maven-box-maven-surefire-master-65\surefire-its--windows-jdk11-maven3.6.x.zip
[2019-10-06T01:18:22.506Z] [Fast Archiver] No artifacts from Maven TLP » maven-surefire » master #55 to compare, so performing full copy of artifacts
[Pipeline] archiveArtifacts
[2019-10-06T01:18:23.831Z] Archiving artifacts
[2019-10-06T01:18:23.852Z] [Fast Archiver] No artifacts from Maven TLP » maven-surefire » master #55 to compare, so performing full copy of artifacts
[2019-10-06T01:18:24.245Z] [INFO] Tests run: 4, Failures: 0, Errors: 0, Skipped: 0, Time elapsed: 53.925 s - in org.apache.maven.surefire.its.jiras.Surefire855AllowFailsafeUseArtifactFileIT
[2019-10-06T01:18:24.245Z] [INFO] Running org.apache.maven.surefire.its.jiras.Surefire901MIssingResultfileWhenNoTestsIT
[Pipeline] cleanWs
[2019-10-06T01:18:25.273Z] [WS-CLEANUP] Deleting project workspace...
[2019-10-06T01:18:25.273Z] [WS-CLEANUP] Deferred wipeout is used...
[2019-10-06T01:18:25.401Z] [WS-CLEANUP] done
[Pipeline] }
[Pipeline] // ws
[Pipeline] }
[Pipeline] // timestamps
[Pipeline] }
[Pipeline] // node
[Pipeline] }
[2019-10-06T01:18:26.542Z] [INFO] Tests run: 1, Failures: 0, Errors: 0, Skipped: 0, Time elapsed: 5.514 s - in org.apache.maven.surefire.its.jiras.Surefire901MIssingResultfileWhenNoTestsIT
[2019-10-06T01:18:26.542Z] [INFO] Running org.apache.maven.surefire.its.jiras.Surefire907PerThreadWithoutThreadCountIT
[2019-10-06T01:18:31.797Z] [INFO] Tests run: 1, Failures: 0, Errors: 0, Skipped: 0, Time elapsed: 5.04 s - in org.apache.maven.surefire.its.jiras.Surefire907PerThreadWithoutThreadCountIT
[2019-10-06T01:18:31.797Z] [INFO] Running org.apache.maven.surefire.its.jiras.Surefire920TestFailureIgnoreWithTimeoutIT
[2019-10-06T01:18:50.161Z] [INFO] Tests run: 2, Failures: 0, Errors: 0, Skipped: 0, Time elapsed: 17.14 s - in org.apache.maven.surefire.its.jiras.Surefire920TestFailureIgnoreWithTimeoutIT
[2019-10-06T01:18:50.161Z] [INFO] Running org.apache.maven.surefire.its.jiras.Surefire926FailureWith2ProvidersIT
[2019-10-06T01:18:54.327Z] [INFO] Tests run: 1, Failures: 0, Errors: 0, Skipped: 0, Time elapsed: 5.203 s - in org.apache.maven.surefire.its.jiras.Surefire926FailureWith2ProvidersIT
[2019-10-06T01:18:54.327Z] [INFO] Running org.apache.maven.surefire.its.jiras.Surefire930TestNgSuiteXmlIT
[2019-10-06T01:19:02.139Z] [INFO] Tests run: 1, Failures: 0, Errors: 0, Skipped: 0, Time elapsed: 8.212 s - in org.apache.maven.surefire.its.jiras.Surefire930TestNgSuiteXmlIT
[2019-10-06T01:19:02.139Z] [INFO] Running org.apache.maven.surefire.its.jiras.Surefire943ReportContentIT
[2019-10-06T01:19:37.464Z] [INFO] Tests run: 2, Failures: 0, Errors: 0, Skipped: 0, Time elapsed: 32.202 s - in org.apache.maven.surefire.its.jiras.Surefire943ReportContentIT
[2019-10-06T01:19:37.464Z] [INFO] Running org.apache.maven.surefire.its.jiras.Surefire946KillMainProcessInReusableForkIT
[2019-10-06T01:20:34.084Z] [INFO] Tests run: 6, Failures: 0, Errors: 0, Skipped: 0, Time elapsed: 52.901 s - in org.apache.maven.surefire.its.jiras.Surefire946KillMainProcessInReusableForkIT
[2019-10-06T01:20:34.084Z] [INFO] Running org.apache.maven.surefire.its.jiras.Surefire972BizarreNoClassDefIT
[2019-10-06T01:20:37.276Z] [INFO] Tests run: 1, Failures: 0, Errors: 0, Skipped: 0, Time elapsed: 9.96 s - in org.apache.maven.surefire.its.jiras.Surefire972BizarreNoClassDefIT
[2019-10-06T01:20:37.276Z] [INFO] Running org.apache.maven.surefire.its.jiras.Surefire975DefaultVMEncodingIT
[2019-10-06T01:20:45.101Z] [INFO] Tests run: 1, Failures: 0, Errors: 0, Skipped: 0, Time elapsed: 6.881 s - in org.apache.maven.surefire.its.jiras.Surefire975DefaultVMEncodingIT
[2019-10-06T01:20:45.101Z] [INFO] Running org.apache.maven.surefire.its.jiras.Surefire979WrongClassLoaderIT
[2019-10-06T01:20:52.929Z] [INFO] Tests run: 1, Failures: 0, Errors: 0, Skipped: 0, Time elapsed: 7.399 s - in org.apache.maven.surefire.its.jiras.Surefire979WrongClassLoaderIT
[2019-10-06T01:20:52.929Z] [INFO] Running org.apache.maven.surefire.its.jiras.Surefire985ParameterizedRunnerAndCategoriesIT
[2019-10-06T01:20:59.408Z] [INFO] Tests run: 1, Failures: 0, Errors: 0, Skipped: 0, Time elapsed: 6.413 s - in org.apache.maven.surefire.its.jiras.Surefire985ParameterizedRunnerAndCategoriesIT
[2019-10-06T01:20:59.408Z] [INFO] Running org.apache.maven.surefire.its.jiras.Surefire995CategoryInheritanceIT
[2019-10-06T01:21:34.074Z] [INFO] Tests run: 5, Failures: 0, Errors: 0, Skipped: 0, Time elapsed: 34.238 s - in org.apache.maven.surefire.its.jiras.Surefire995CategoryInheritanceIT
[2019-10-06T01:21:34.074Z] [INFO]
[2019-10-06T01:21:34.074Z] [INFO] Results:
[2019-10-06T01:21:34.074Z] [INFO]
[2019-10-06T01:21:34.074Z] [ERROR] Errors:
[2019-10-06T01:21:34.074Z] [ERROR] JUnitPlatformIT.testJupiterEngineWithDisplayNames:89 » SurefireVerifier Exit c...
[2019-10-06T01:21:34.074Z] [ERROR] JUnitPlatformIT.testJupiterEngine:79 » SurefireVerifier Exit code was non-zero...
[2019-10-06T01:21:34.074Z] [ERROR] JUnitPlatformIT.testMultipleEngines:144 » SurefireVerifier Exit code was non-z...
[2019-10-06T01:21:34.074Z] [ERROR] JUnitPlatformIT.testTags:153 » SurefireVerifier Exit code was non-zero: 1; com...
[2019-10-06T01:21:34.074Z] [ERROR] JUnitPlatformIT.testVintageEngine:124 » SurefireVerifier Exit code was non-zer...
[2019-10-06T01:21:34.074Z] [INFO]
[2019-10-06T01:21:34.074Z] [ERROR] Tests run: 849, Failures: 0, Errors: 5, Skipped: 134
[2019-10-06T01:21:34.074Z] [INFO]
[2019-10-06T01:21:34.074Z] [INFO]
[2019-10-06T01:21:34.074Z] [INFO] --- maven-checkstyle-plugin:3.0.0:check (checkstyle-check) @ surefire-its ---
[2019-10-06T01:21:34.074Z] [INFO]
[2019-10-06T01:21:34.074Z] [INFO] --- maven-failsafe-plugin:3.0.0-M3:verify (default) @ surefire-its ---
[2019-10-06T01:21:34.074Z] [INFO] Failsafe report directory: /home/jenkins/jenkins-slave/workspace/maven-box_maven-surefire_master@2/surefire-its/target/failsafe-reports
[2019-10-06T01:21:34.074Z] [INFO] ------------------------------------------------------------------------
[2019-10-06T01:21:34.074Z] [INFO] Reactor Summary for Apache Maven Surefire 3.0.0-SNAPSHOT:
[2019-10-06T01:21:34.074Z] [INFO]
[2019-10-06T01:21:34.074Z] [INFO] Apache Maven Surefire .............................. SUCCESS [ 21.242 s]
[2019-10-06T01:21:34.074Z] [INFO] SureFire Logger API ................................ SUCCESS [ 12.558 s]
[2019-10-06T01:21:34.074Z] [INFO] SureFire API ....................................... SUCCESS [ 13.819 s]
[2019-10-06T01:21:34.074Z] [INFO] Surefire Extensions API ............................ SUCCESS [ 2.881 s]
[2019-10-06T01:21:34.074Z] [INFO] SureFire Booter .................................... SUCCESS [ 16.106 s]
[2019-10-06T01:21:34.074Z] [INFO] Maven Surefire Test-Grouping Support ............... SUCCESS [ 6.640 s]
[2019-10-06T01:21:34.074Z] [INFO] SureFire Providers ................................. SUCCESS [ 1.404 s]
[2019-10-06T01:21:34.074Z] [INFO] Shared JUnit3 Provider Code ........................ SUCCESS [ 4.671 s]
[2019-10-06T01:21:34.074Z] [INFO] Shared Java 5 Provider Base ........................ SUCCESS [ 5.575 s]
[2019-10-06T01:21:34.074Z] [INFO] Shared JUnit4 Provider Code ........................ SUCCESS [ 5.574 s]
[2019-10-06T01:21:34.074Z] [INFO] Shared JUnit48 Provider Code ....................... SUCCESS [ 6.676 s]
[2019-10-06T01:21:34.074Z] [INFO] SureFire JUnit Runner .............................. SUCCESS [ 4.873 s]
[2019-10-06T01:21:34.074Z] [INFO] SureFire JUnit4 Runner ............................. SUCCESS [ 4.953 s]
[2019-10-06T01:21:34.074Z] [INFO] Maven Surefire Common .............................. SUCCESS [ 56.702 s]
[2019-10-06T01:21:34.074Z] [INFO] SureFire JUnitCore Runner .......................... SUCCESS [02:20 min]
[2019-10-06T01:21:34.074Z] [INFO] SureFire JUnit Platform Runner ..................... SUCCESS [ 12.079 s]
[2019-10-06T01:21:34.074Z] [INFO] SureFire TestNG Utils .............................. SUCCESS [ 4.974 s]
[2019-10-06T01:21:34.074Z] [INFO] SureFire TestNG Runner ............................. SUCCESS [ 5.819 s]
[2019-10-06T01:21:34.074Z] [INFO] ShadeFire JUnit3 Provider .......................... SUCCESS [ 2.407 s]
[2019-10-06T01:21:34.074Z] [INFO] Surefire Report Parser ............................. SUCCESS [ 6.954 s]
[2019-10-06T01:21:34.074Z] [INFO] Maven Surefire Plugin .............................. SUCCESS [ 12.298 s]
[2019-10-06T01:21:34.074Z] [INFO] Maven Failsafe Plugin .............................. SUCCESS [01:22 min]
[2019-10-06T01:21:34.074Z] [INFO] Maven Surefire Report Plugin ....................... SUCCESS [ 19.631 s]
[2019-10-06T01:21:34.074Z] [INFO] Maven Surefire Integration Tests ................... FAILURE [ 01:27 h]
[2019-10-06T01:21:34.074Z] [INFO] ------------------------------------------------------------------------
[2019-10-06T01:21:34.074Z] [INFO] BUILD FAILURE
[2019-10-06T01:21:34.074Z] [INFO] ------------------------------------------------------------------------
[2019-10-06T01:21:34.074Z] [INFO] Total time: 01:34 h
[2019-10-06T01:21:34.074Z] [INFO] Finished at: 2019-10-06T01:21:33Z
[2019-10-06T01:21:34.074Z] [INFO] ------------------------------------------------------------------------
[2019-10-06T01:21:34.074Z] [ERROR] Failed to execute goal org.apache.maven.plugins:maven-failsafe-plugin:3.0.0-M3:verify (default) on project surefire-its: There are test failures.
[2019-10-06T01:21:34.075Z] [ERROR]
[2019-10-06T01:21:34.075Z] [ERROR] Please refer to /home/jenkins/jenkins-slave/workspace/maven-box_maven-surefire_master@2/surefire-its/target/failsafe-reports for the individual test results.
[2019-10-06T01:21:34.075Z] [ERROR] Please refer to dump files (if any exist) [date].dump, [date]-jvmRun[N].dump and [date].dumpstream.
[2019-10-06T01:21:34.075Z] [ERROR] -> [Help 1]
[2019-10-06T01:21:34.075Z] org.apache.maven.lifecycle.LifecycleExecutionException: Failed to execute goal org.apache.maven.plugins:maven-failsafe-plugin:3.0.0-M3:verify (default) on project surefire-its: There are test failures.
[2019-10-06T01:21:34.075Z]
[2019-10-06T01:21:34.075Z] Please refer to /home/jenkins/jenkins-slave/workspace/maven-box_maven-surefire_master@2/surefire-its/target/failsafe-reports for the individual test results.
[2019-10-06T01:21:34.075Z] Please refer to dump files (if any exist) [date].dump, [date]-jvmRun[N].dump and [date].dumpstream.
[2019-10-06T01:21:34.075Z] at org.apache.maven.lifecycle.internal.MojoExecutor.execute (MojoExecutor.java:215)
[2019-10-06T01:21:34.075Z] at org.apache.maven.lifecycle.internal.MojoExecutor.execute (MojoExecutor.java:156)
[2019-10-06T01:21:34.075Z] at org.apache.maven.lifecycle.internal.MojoExecutor.execute (MojoExecutor.java:148)
[2019-10-06T01:21:34.075Z] at org.apache.maven.lifecycle.internal.LifecycleModuleBuilder.buildProject (LifecycleModuleBuilder.java:117)
[2019-10-06T01:21:34.075Z] at org.apache.maven.lifecycle.internal.LifecycleModuleBuilder.buildProject (LifecycleModuleBuilder.java:81)
[2019-10-06T01:21:34.075Z] at org.apache.maven.lifecycle.internal.builder.singlethreaded.SingleThreadedBuilder.build (SingleThreadedBuilder.java:56)
[2019-10-06T01:21:34.075Z] at org.apache.maven.lifecycle.internal.LifecycleStarter.execute (LifecycleStarter.java:128)
[2019-10-06T01:21:34.075Z] at org.apache.maven.DefaultMaven.doExecute (DefaultMaven.java:305)
[2019-10-06T01:21:34.075Z] at org.apache.maven.DefaultMaven.doExecute (DefaultMaven.java:192)
[2019-10-06T01:21:34.075Z] at org.apache.maven.DefaultMaven.execute (DefaultMaven.java:105)
[2019-10-06T01:21:34.075Z] at org.apache.maven.cli.MavenCli.execute (MavenCli.java:956)
[2019-10-06T01:21:34.075Z] at org.apache.maven.cli.MavenCli.doMain (MavenCli.java:288)
[2019-10-06T01:21:34.075Z] at org.apache.maven.cli.MavenCli.main (MavenCli.java:192)
[2019-10-06T01:21:34.075Z] at sun.reflect.NativeMethodAccessorImpl.invoke0 (Native Method)
[2019-10-06T01:21:34.075Z] at sun.reflect.NativeMethodAccessorImpl.invoke (NativeMethodAccessorImpl.java:62)
[2019-10-06T01:21:34.075Z] at sun.reflect.DelegatingMethodAccessorImpl.invoke (DelegatingMethodAccessorImpl.java:43)
[2019-10-06T01:21:34.075Z] at java.lang.reflect.Method.invoke (Method.java:498)
[2019-10-06T01:21:34.075Z] at org.codehaus.plexus.classworlds.launcher.Launcher.launchEnhanced (Launcher.java:289)
[2019-10-06T01:21:34.075Z] at org.codehaus.plexus.classworlds.launcher.Launcher.launch (Launcher.java:229)
[2019-10-06T01:21:34.075Z] at org.codehaus.plexus.classworlds.launcher.Launcher.mainWithExitCode (Launcher.java:415)
[2019-10-06T01:21:34.075Z] at org.codehaus.plexus.classworlds.launcher.Launcher.main (Launcher.java:356)
[2019-10-06T01:21:34.075Z] Caused by: org.apache.maven.plugin.MojoFailureException: There are test failures.
[2019-10-06T01:21:34.075Z]
[2019-10-06T01:21:34.075Z] Please refer to /home/jenkins/jenkins-slave/workspace/maven-box_maven-surefire_master@2/surefire-its/target/failsafe-reports for the individual test results.
[2019-10-06T01:21:34.075Z] Please refer to dump files (if any exist) [date].dump, [date]-jvmRun[N].dump and [date].dumpstream.
[2019-10-06T01:21:34.075Z] at org.apache.maven.plugin.surefire.SurefireHelper.throwException (SurefireHelper.java:271)
[2019-10-06T01:21:34.075Z] at org.apache.maven.plugin.surefire.SurefireHelper.reportExecution (SurefireHelper.java:159)
[2019-10-06T01:21:34.075Z] at org.apache.maven.plugin.failsafe.VerifyMojo.execute (VerifyMojo.java:192)
[2019-10-06T01:21:34.075Z] at org.apache.maven.plugin.DefaultBuildPluginManager.executeMojo (DefaultBuildPluginManager.java:137)
[2019-10-06T01:21:34.075Z] at org.apache.maven.lifecycle.internal.MojoExecutor.execute (MojoExecutor.java:210)
[2019-10-06T01:21:34.075Z] at org.apache.maven.lifecycle.internal.MojoExecutor.execute (MojoExecutor.java:156)
[2019-10-06T01:21:34.075Z] at org.apache.maven.lifecycle.internal.MojoExecutor.execute (MojoExecutor.java:148)
[2019-10-06T01:21:34.075Z] at org.apache.maven.lifecycle.internal.LifecycleModuleBuilder.buildProject (LifecycleModuleBuilder.java:117)
[2019-10-06T01:21:34.075Z] at org.apache.maven.lifecycle.internal.LifecycleModuleBuilder.buildProject (LifecycleModuleBuilder.java:81)
[2019-10-06T01:21:34.075Z] at org.apache.maven.lifecycle.internal.builder.singlethreaded.SingleThreadedBuilder.build (SingleThreadedBuilder.java:56)
[2019-10-06T01:21:34.075Z] at org.apache.maven.lifecycle.internal.LifecycleStarter.execute (LifecycleStarter.java:128)
[2019-10-06T01:21:34.075Z] at org.apache.maven.DefaultMaven.doExecute (DefaultMaven.java:305)
[2019-10-06T01:21:34.075Z] at org.apache.maven.DefaultMaven.doExecute (DefaultMaven.java:192)
[2019-10-06T01:21:34.075Z] at org.apache.maven.DefaultMaven.execute (DefaultMaven.java:105)
[2019-10-06T01:21:34.075Z] at org.apache.maven.cli.MavenCli.execute (MavenCli.java:956)
[2019-10-06T01:21:34.075Z] at org.apache.maven.cli.MavenCli.doMain (MavenCli.java:288)
[2019-10-06T01:21:34.075Z] at org.apache.maven.cli.MavenCli.main (MavenCli.java:192)
[2019-10-06T01:21:34.075Z] at sun.reflect.NativeMethodAccessorImpl.invoke0 (Native Method)
[2019-10-06T01:21:34.075Z] at sun.reflect.NativeMethodAccessorImpl.invoke (NativeMethodAccessorImpl.java:62)
[2019-10-06T01:21:34.076Z] at sun.reflect.DelegatingMethodAccessorImpl.invoke (DelegatingMethodAccessorImpl.java:43)
[2019-10-06T01:21:34.076Z] at java.lang.reflect.Method.invoke (Method.java:498)
[2019-10-06T01:21:34.076Z] at org.codehaus.plexus.classworlds.launcher.Launcher.launchEnhanced (Launcher.java:289)
[2019-10-06T01:21:34.076Z] at org.codehaus.plexus.classworlds.launcher.Launcher.launch (Launcher.java:229)
[2019-10-06T01:21:34.076Z] at org.codehaus.plexus.classworlds.launcher.Launcher.mainWithExitCode (Launcher.java:415)
[2019-10-06T01:21:34.076Z] at org.codehaus.plexus.classworlds.launcher.Launcher.main (Launcher.java:356)
[2019-10-06T01:21:34.076Z] [ERROR]
[2019-10-06T01:21:34.076Z] [ERROR] Re-run Maven using the -X switch to enable full debug logging.
[2019-10-06T01:21:34.076Z] [ERROR]
[2019-10-06T01:21:34.076Z] [ERROR] For more information about the errors and possible solutions, please read the following articles:
[2019-10-06T01:21:34.076Z] [ERROR] [Help 1] http://cwiki.apache.org/confluence/display/MAVEN/MojoFailureException
[2019-10-06T01:21:34.076Z] [ERROR]
[2019-10-06T01:21:34.076Z] [ERROR] After correcting the problems, you can resume the build with the command
[2019-10-06T01:21:34.076Z] [ERROR] mvn <goals> -rf :surefire-its
[Pipeline] }
[Pipeline] // withEnv
[Pipeline] }
[Pipeline] // stage
[Pipeline] fileExists
[Pipeline] zip
[2019-10-06T01:21:35.129Z] Writing zip file of /home/jenkins/jenkins-slave/workspace/maven-box_maven-surefire_master@2/maven-failsafe-plugin/target/it to /home/jenkins/jenkins-slave/workspace/maven-box_maven-surefire_master@2/maven-failsafe-plugin--linux-jdk12-maven3.6.x.zip
[2019-10-06T01:21:35.336Z] Zipped 78 entries.
[2019-10-06T01:21:35.336Z] Archiving /home/jenkins/jenkins-slave/workspace/maven-box_maven-surefire_master@2/maven-failsafe-plugin--linux-jdk12-maven3.6.x.zip
[2019-10-06T01:21:35.337Z] [Fast Archiver] No artifacts from Maven TLP » maven-surefire » master #55 to compare, so performing full copy of artifacts
[Pipeline] fileExists
[Pipeline] zip
[2019-10-06T01:21:36.290Z] Writing zip file of /home/jenkins/jenkins-slave/workspace/maven-box_maven-surefire_master@2/surefire-its/target to /home/jenkins/jenkins-slave/workspace/maven-box_maven-surefire_master@2/surefire-its--linux-jdk12-maven3.6.x.zip
[2019-10-06T01:21:47.893Z] Zipped 18172 entries.
[2019-10-06T01:21:47.893Z] Archiving /home/jenkins/jenkins-slave/workspace/maven-box_maven-surefire_master@2/surefire-its--linux-jdk12-maven3.6.x.zip
[2019-10-06T01:21:47.894Z] [Fast Archiver] No artifacts from Maven TLP » maven-surefire » master #55 to compare, so performing full copy of artifacts
[Pipeline] archiveArtifacts
[2019-10-06T01:21:52.965Z] Archiving artifacts
[2019-10-06T01:21:53.138Z] [Fast Archiver] No artifacts from Maven TLP » maven-surefire » master #55 to compare, so performing full copy of artifacts
[Pipeline] cleanWs
[2019-10-06T01:21:57.734Z] [WS-CLEANUP] Deleting project workspace...
[2019-10-06T01:21:57.734Z] [WS-CLEANUP] Deferred wipeout is used...
[2019-10-06T01:21:58.079Z] [WS-CLEANUP] done
[Pipeline] }
[Pipeline] // ws
[Pipeline] }
[Pipeline] // timestamps
[Pipeline] }
[Pipeline] // node
[Pipeline] }
[Pipeline] // parallel
[Pipeline] echo
Build result: FAILURE
[Pipeline] jiraIssueSelector
[Pipeline] echo
The authors of changes [tibordigana].
[Pipeline] echo
Sending email ...
[Pipeline] emailext
Build succeeded in Jenkins: Maven TLP » maven-surefire » master #66
Posted by Apache Jenkins Server <je...@builds.apache.org>.
See https://builds.apache.org/job/maven-box/job/maven-surefire/job/master/66/
Changes:
* temporarily disabled JUnit5 1.6.0-SNAPSHOT due to Sonatype issue
All tests passed