You are viewing a plain text version of this content. The canonical link for it is here.
Posted to dev@brooklyn.apache.org by Apache Jenkins Server <je...@builds.apache.org> on 2017/10/06 13:24:10 UTC

Build failed in Jenkins: brooklyn-client-master #67

See <https://builds.apache.org/job/brooklyn-client-master/67/display/redirect?page=changes>

Changes:

[duncan.godwin] Change version to 1.0.0-SNAPSHOT

------------------------------------------
Started by an SCM change
[EnvInject] - Loading node environment variables.
Building remotely on qnode1 (ubuntu xenial) in workspace <https://builds.apache.org/job/brooklyn-client-master/ws/>
 > git rev-parse --is-inside-work-tree # timeout=10
Fetching changes from the remote Git repository
 > git config remote.origin.url https://git-wip-us.apache.org/repos/asf/brooklyn-client.git # timeout=10
Fetching upstream changes from https://git-wip-us.apache.org/repos/asf/brooklyn-client.git
 > git --version # timeout=10
 > git fetch --tags --progress https://git-wip-us.apache.org/repos/asf/brooklyn-client.git +refs/heads/*:refs/remotes/origin/*
 > git rev-parse origin/master^{commit} # timeout=10
Checking out Revision 66b01f2b84c7d63d506db693f504fcecd157e2dc (origin/master)
Commit message: "Change version to 1.0.0-SNAPSHOT"
 > git config core.sparsecheckout # timeout=10
 > git checkout -f 66b01f2b84c7d63d506db693f504fcecd157e2dc
 > git rev-list e0c0409d0fc3b3763b52cbcb6c195be2744733a6 # timeout=10
Parsing POMs
Failed to transfer Could not find metadata org.apache.brooklyn:brooklyn-parent:1.0.0-SNAPSHOT/maven-metadata.xml in Nexus (http://repository.apache.org/snapshots)
Failed to transfer Could not find artifact org.apache.brooklyn:brooklyn-parent:pom:1.0.0-SNAPSHOT in Nexus (http://repository.apache.org/snapshots)
ERROR: Failed to parse POMs
java.io.IOException: remote file operation failed: <https://builds.apache.org/job/brooklyn-client-master/ws/> at hudson.remoting.Channel@4085889d:qnode1: hudson.remoting.ProxyException: hudson.maven.MavenModuleSetBuild$MavenExecutionException: org.apache.maven.project.ProjectBuildingException: Some problems were encountered while processing the POMs:
[FATAL] Non-resolvable parent POM: Could not find artifact org.apache.brooklyn:brooklyn-parent:pom:1.0.0-SNAPSHOT in Nexus (http://repository.apache.org/snapshots) and 'parent.relativePath' points at wrong local POM @ line 24, column 13

	at hudson.FilePath.act(FilePath.java:994)
	at hudson.FilePath.act(FilePath.java:976)
	at hudson.maven.MavenModuleSetBuild$MavenModuleSetBuildExecution.parsePoms(MavenModuleSetBuild.java:986)
	at hudson.maven.MavenModuleSetBuild$MavenModuleSetBuildExecution.doRun(MavenModuleSetBuild.java:691)
	at hudson.model.AbstractBuild$AbstractBuildExecution.run(AbstractBuild.java:496)
	at hudson.model.Run.execute(Run.java:1737)
	at hudson.maven.MavenModuleSetBuild.run(MavenModuleSetBuild.java:543)
	at hudson.model.ResourceController.execute(ResourceController.java:97)
	at hudson.model.Executor.run(Executor.java:419)
Caused by: hudson.remoting.ProxyException: hudson.maven.MavenModuleSetBuild$MavenExecutionException: org.apache.maven.project.ProjectBuildingException: Some problems were encountered while processing the POMs:
[FATAL] Non-resolvable parent POM: Could not find artifact org.apache.brooklyn:brooklyn-parent:pom:1.0.0-SNAPSHOT in Nexus (http://repository.apache.org/snapshots) and 'parent.relativePath' points at wrong local POM @ line 24, column 13

	at hudson.maven.MavenModuleSetBuild$PomParser.invoke(MavenModuleSetBuild.java:1391)
	at hudson.maven.MavenModuleSetBuild$PomParser.invoke(MavenModuleSetBuild.java:1125)
	at hudson.FilePath$FileCallableWrapper.call(FilePath.java:2750)
	at hudson.remoting.UserRequest.perform(UserRequest.java:181)
	at hudson.remoting.UserRequest.perform(UserRequest.java:52)
	at hudson.remoting.Request$2.run(Request.java:336)
	at hudson.remoting.InterceptingExecutorService$1.call(InterceptingExecutorService.java:68)
	at java.util.concurrent.FutureTask.run(FutureTask.java:266)
	at java.util.concurrent.ThreadPoolExecutor.runWorker(ThreadPoolExecutor.java:1142)
	at java.util.concurrent.ThreadPoolExecutor$Worker.run(ThreadPoolExecutor.java:617)
	at java.lang.Thread.run(Thread.java:748)
	at ......remote call to qnode1(Native Method)
	at hudson.remoting.Channel.attachCallSiteStackTrace(Channel.java:1554)
	at hudson.remoting.UserResponse.retrieve(UserRequest.java:281)
	at hudson.remoting.Channel.call(Channel.java:839)
	at hudson.FilePath.act(FilePath.java:987)
	... 8 more
Caused by: hudson.remoting.ProxyException: org.apache.maven.project.ProjectBuildingException: Some problems were encountered while processing the POMs:
[FATAL] Non-resolvable parent POM: Could not find artifact org.apache.brooklyn:brooklyn-parent:pom:1.0.0-SNAPSHOT in Nexus (http://repository.apache.org/snapshots) and 'parent.relativePath' points at wrong local POM @ line 24, column 13

	at org.apache.maven.project.DefaultProjectBuilder.build(DefaultProjectBuilder.java:364)
	at hudson.maven.MavenEmbedder.buildProjects(MavenEmbedder.java:361)
	at hudson.maven.MavenEmbedder.readProjects(MavenEmbedder.java:331)
	at hudson.maven.MavenModuleSetBuild$PomParser.invoke(MavenModuleSetBuild.java:1328)
	at hudson.maven.MavenModuleSetBuild$PomParser.invoke(MavenModuleSetBuild.java:1125)
	at hudson.FilePath$FileCallableWrapper.call(FilePath.java:2750)
	at hudson.remoting.UserRequest.perform(UserRequest.java:181)
	at hudson.remoting.UserRequest.perform(UserRequest.java:52)
	at hudson.remoting.Request$2.run(Request.java:336)
	at hudson.remoting.InterceptingExecutorService$1.call(InterceptingExecutorService.java:68)
	at java.util.concurrent.FutureTask.run(FutureTask.java:266)
	at java.util.concurrent.ThreadPoolExecutor.runWorker(ThreadPoolExecutor.java:1142)
	at java.util.concurrent.ThreadPoolExecutor$Worker.run(ThreadPoolExecutor.java:617)
	at java.lang.Thread.run(Thread.java:748)

Jenkins build is back to normal : brooklyn-client-master #69

Posted by Apache Jenkins Server <je...@builds.apache.org>.
See <https://builds.apache.org/job/brooklyn-client-master/69/display/redirect>


Build failed in Jenkins: brooklyn-client-master #68

Posted by Apache Jenkins Server <je...@builds.apache.org>.
See <https://builds.apache.org/job/brooklyn-client-master/68/display/redirect>

------------------------------------------
[...truncated 61.32 KB...]
[GC (Allocation Failure)  242457K->74786K(743936K), 0.0234231 secs]
[GC (Allocation Failure)  249890K->74869K(741888K), 0.0380018 secs]
[GC (Allocation Failure)  249973K->55467K(739840K), 0.0062806 secs]
2017-10-10 07:58:43,073 WARN  Error adding Brooklyn items from bundle brooklyn-catalog-bom-FjkuHYmP:0.0.0.SNAPSHOT, uninstalling, restoring any old bundle and items, then re-throwing error: Error installing catalog items: Failed to install brooklyn-catalog-bom-FjkuHYmP:0.0.0.SNAPSHOT, types [BasicRegisteredType[org.apache.brooklyn.policy.ha.ServiceRestarter:0.0.0-SNAPSHOT;null], BasicRegisteredType[org.apache.brooklyn.enricher.stock.Aggregator:0.0.0-SNAPSHOT;null], BasicRegisteredType[org.apache.brooklyn.enricher.stock.Joiner:0.0.0-SNAPSHOT;null], BasicRegisteredType[org.apache.brooklyn.enricher.stock.Propagator:0.0.0-SNAPSHOT;null], BasicRegisteredType[org.apache.brooklyn.policy.ha.ConnectionFailureDetector:0.0.0-SNAPSHOT;null], BasicRegisteredType[org.apache.brooklyn.policy.autoscaling.AutoScalerPolicy:0.0.0-SNAPSHOT;null], BasicRegisteredType[org.apache.brooklyn.enricher.stock.reducer.Reducer:0.0.0-SNAPSHOT;null], BasicRegisteredType[org.apache.brooklyn.enricher.stock.UpdatingMap:0.0.0-SNAPSHOT;null], BasicRegisteredType[org.apache.brooklyn.enricher.stock.Transformer:0.0.0-SNAPSHOT;null], BasicRegisteredType[org.apache.brooklyn.entity.machine.pool.ServerPool:0.0.0-SNAPSHOT;null], BasicRegisteredType[org.apache.brooklyn.enricher.stock.YamlRollingTimeWindowMeanEnricher:0.0.0-SNAPSHOT;null], BasicRegisteredType[org.apache.brooklyn.entity.brooklynnode.BrooklynNode:0.0.0-SNAPSHOT;null], BasicRegisteredType[org.apache.brooklyn.policy.enricher.TimeWeightedDeltaEnricher:0.0.0-SNAPSHOT;null], BasicRegisteredType[org.apache.brooklyn.core.network.OnSubnetNetworkEnricher:0.0.0-SNAPSHOT;null], BasicRegisteredType[org.apache.brooklyn.entity.brooklynnode.BrooklynEntityMirror:0.0.0-SNAPSHOT;null], BasicRegisteredType[org.apache.brooklyn.enricher.stock.PercentageEnricher:0.0.0-SNAPSHOT;null], BasicRegisteredType[org.apache.brooklyn.enricher.stock.Combiner:0.0.0-SNAPSHOT;null], BasicRegisteredType[org.apache.brooklyn.policy.enricher.RollingTimeWindowMeanEnricher:0.0.0-SNAPSHOT;null], BasicRegisteredType[org.apache.brooklyn.enricher.stock.YamlTimeWeightedDeltaEnricher:0.0.0-SNAPSHOT;null], BasicRegisteredType[org.apache.brooklyn.policy.enricher.DeltaEnricher:0.0.0-SNAPSHOT;null], BasicRegisteredType[org.apache.brooklyn.policy.enricher.TimeFractionDeltaEnricher:0.0.0-SNAPSHOT;null], BasicRegisteredType[org.apache.brooklyn.policy.ha.SshMachineFailureDetector:0.0.0-SNAPSHOT;null], BasicRegisteredType[org.apache.brooklyn.policy.enricher.HttpLatencyDetector:0.0.0-SNAPSHOT;null], BasicRegisteredType[org.apache.brooklyn.entity.software.base.VanillaSoftwareProcess:0.0.0-SNAPSHOT;null], BasicRegisteredType[org.apache.brooklyn.core.network.OnPublicNetworkEnricher:0.0.0-SNAPSHOT;null], BasicRegisteredType[org.apache.brooklyn.enricher.stock.MapAggregator:0.0.0-SNAPSHOT;null], BasicRegisteredType[org.apache.brooklyn.entity.software.base.VanillaWindowsProcess:0.0.0-SNAPSHOT;null], BasicRegisteredType[org.apache.brooklyn.entity.machine.MachineEntity:0.0.0-SNAPSHOT;null], BasicRegisteredType[org.apache.brooklyn.policy.enricher.RollingMeanEnricher:0.0.0-SNAPSHOT;null], BasicRegisteredType[org.apache.brooklyn.rest.resources.DummyIconEntity:0.0.0-SNAPSHOT;null]] gave errors; 120 errors including: Transformer for Brooklyn OASIS CAMP interpreter gave an error creating this plan: No CAMP Platform is registered with this Brooklyn management context.
2017-10-10 07:58:43,102 WARN  Error importing catalog from classpath://brooklyn/scanning.catalog.bom: java.lang.IllegalStateException: Bundle BasicManagedBundle{symbolicName=brooklyn-catalog-bom-FjkuHYmP, version=0.0.0.SNAPSHOT, url=null} failed installation: Error installing catalog items: Failed to install brooklyn-catalog-bom-FjkuHYmP:0.0.0.SNAPSHOT, types [BasicRegisteredType[org.apache.brooklyn.policy.ha.ServiceRestarter:0.0.0-SNAPSHOT;null], BasicRegisteredType[org.apache.brooklyn.enricher.stock.Aggregator:0.0.0-SNAPSHOT;null], BasicRegisteredType[org.apache.brooklyn.enricher.stock.Joiner:0.0.0-SNAPSHOT;null], BasicRegisteredType[org.apache.brooklyn.enricher.stock.Propagator:0.0.0-SNAPSHOT;null], BasicRegisteredType[org.apache.brooklyn.policy.ha.ConnectionFailureDetector:0.0.0-SNAPSHOT;null], BasicRegisteredType[org.apache.brooklyn.policy.autoscaling.AutoScalerPolicy:0.0.0-SNAPSHOT;null], BasicRegisteredType[org.apache.brooklyn.enricher.stock.reducer.Reducer:0.0.0-SNAPSHOT;null], BasicRegisteredType[org.apache.brooklyn.enricher.stock.UpdatingMap:0.0.0-SNAPSHOT;null], BasicRegisteredType[org.apache.brooklyn.enricher.stock.Transformer:0.0.0-SNAPSHOT;null], BasicRegisteredType[org.apache.brooklyn.entity.machine.pool.ServerPool:0.0.0-SNAPSHOT;null], BasicRegisteredType[org.apache.brooklyn.enricher.stock.YamlRollingTimeWindowMeanEnricher:0.0.0-SNAPSHOT;null], BasicRegisteredType[org.apache.brooklyn.entity.brooklynnode.BrooklynNode:0.0.0-SNAPSHOT;null], BasicRegisteredType[org.apache.brooklyn.policy.enricher.TimeWeightedDeltaEnricher:0.0.0-SNAPSHOT;null], BasicRegisteredType[org.apache.brooklyn.core.network.OnSubnetNetworkEnricher:0.0.0-SNAPSHOT;null], BasicRegisteredType[org.apache.brooklyn.entity.brooklynnode.BrooklynEntityMirror:0.0.0-SNAPSHOT;null], BasicRegisteredType[org.apache.brooklyn.enricher.stock.PercentageEnricher:0.0.0-SNAPSHOT;null], BasicRegisteredType[org.apache.brooklyn.enricher.stock.Combiner:0.0.0-SNAPSHOT;null], BasicRegisteredType[org.apache.brooklyn.policy.enricher.RollingTimeWindowMeanEnricher:0.0.0-SNAPSHOT;null], BasicRegisteredType[org.apache.brooklyn.enricher.stock.YamlTimeWeightedDeltaEnricher:0.0.0-SNAPSHOT;null], BasicRegisteredType[org.apache.brooklyn.policy.enricher.DeltaEnricher:0.0.0-SNAPSHOT;null], BasicRegisteredType[org.apache.brooklyn.policy.enricher.TimeFractionDeltaEnricher:0.0.0-SNAPSHOT;null], BasicRegisteredType[org.apache.brooklyn.policy.ha.SshMachineFailureDetector:0.0.0-SNAPSHOT;null], BasicRegisteredType[org.apache.brooklyn.policy.enricher.HttpLatencyDetector:0.0.0-SNAPSHOT;null], BasicRegisteredType[org.apache.brooklyn.entity.software.base.VanillaSoftwareProcess:0.0.0-SNAPSHOT;null], BasicRegisteredType[org.apache.brooklyn.core.network.OnPublicNetworkEnricher:0.0.0-SNAPSHOT;null], BasicRegisteredType[org.apache.brooklyn.enricher.stock.MapAggregator:0.0.0-SNAPSHOT;null], BasicRegisteredType[org.apache.brooklyn.entity.software.base.VanillaWindowsProcess:0.0.0-SNAPSHOT;null], BasicRegisteredType[org.apache.brooklyn.entity.machine.MachineEntity:0.0.0-SNAPSHOT;null], BasicRegisteredType[org.apache.brooklyn.policy.enricher.RollingMeanEnricher:0.0.0-SNAPSHOT;null], BasicRegisteredType[org.apache.brooklyn.rest.resources.DummyIconEntity:0.0.0-SNAPSHOT;null]] gave errors; 120 errors including: Transformer for Brooklyn OASIS CAMP interpreter gave an error creating this plan: No CAMP Platform is registered with this Brooklyn management context.
java.lang.IllegalStateException: Bundle BasicManagedBundle{symbolicName=brooklyn-catalog-bom-FjkuHYmP, version=0.0.0.SNAPSHOT, url=null} failed installation: Error installing catalog items: Failed to install brooklyn-catalog-bom-FjkuHYmP:0.0.0.SNAPSHOT, types [BasicRegisteredType[org.apache.brooklyn.policy.ha.ServiceRestarter:0.0.0-SNAPSHOT;null], BasicRegisteredType[org.apache.brooklyn.enricher.stock.Aggregator:0.0.0-SNAPSHOT;null], BasicRegisteredType[org.apache.brooklyn.enricher.stock.Joiner:0.0.0-SNAPSHOT;null], BasicRegisteredType[org.apache.brooklyn.enricher.stock.Propagator:0.0.0-SNAPSHOT;null], BasicRegisteredType[org.apache.brooklyn.policy.ha.ConnectionFailureDetector:0.0.0-SNAPSHOT;null], BasicRegisteredType[org.apache.brooklyn.policy.autoscaling.AutoScalerPolicy:0.0.0-SNAPSHOT;null], BasicRegisteredType[org.apache.brooklyn.enricher.stock.reducer.Reducer:0.0.0-SNAPSHOT;null], BasicRegisteredType[org.apache.brooklyn.enricher.stock.UpdatingMap:0.0.0-SNAPSHOT;null], BasicRegisteredType[org.apache.brooklyn.enricher.stock.Transformer:0.0.0-SNAPSHOT;null], BasicRegisteredType[org.apache.brooklyn.entity.machine.pool.ServerPool:0.0.0-SNAPSHOT;null], BasicRegisteredType[org.apache.brooklyn.enricher.stock.YamlRollingTimeWindowMeanEnricher:0.0.0-SNAPSHOT;null], BasicRegisteredType[org.apache.brooklyn.entity.brooklynnode.BrooklynNode:0.0.0-SNAPSHOT;null], BasicRegisteredType[org.apache.brooklyn.policy.enricher.TimeWeightedDeltaEnricher:0.0.0-SNAPSHOT;null], BasicRegisteredType[org.apache.brooklyn.core.network.OnSubnetNetworkEnricher:0.0.0-SNAPSHOT;null], BasicRegisteredType[org.apache.brooklyn.entity.brooklynnode.BrooklynEntityMirror:0.0.0-SNAPSHOT;null], BasicRegisteredType[org.apache.brooklyn.enricher.stock.PercentageEnricher:0.0.0-SNAPSHOT;null], BasicRegisteredType[org.apache.brooklyn.enricher.stock.Combiner:0.0.0-SNAPSHOT;null], BasicRegisteredType[org.apache.brooklyn.policy.enricher.RollingTimeWindowMeanEnricher:0.0.0-SNAPSHOT;null], BasicRegisteredType[org.apache.brooklyn.enricher.stock.YamlTimeWeightedDeltaEnricher:0.0.0-SNAPSHOT;null], BasicRegisteredType[org.apache.brooklyn.policy.enricher.DeltaEnricher:0.0.0-SNAPSHOT;null], BasicRegisteredType[org.apache.brooklyn.policy.enricher.TimeFractionDeltaEnricher:0.0.0-SNAPSHOT;null], BasicRegisteredType[org.apache.brooklyn.policy.ha.SshMachineFailureDetector:0.0.0-SNAPSHOT;null], BasicRegisteredType[org.apache.brooklyn.policy.enricher.HttpLatencyDetector:0.0.0-SNAPSHOT;null], BasicRegisteredType[org.apache.brooklyn.entity.software.base.VanillaSoftwareProcess:0.0.0-SNAPSHOT;null], BasicRegisteredType[org.apache.brooklyn.core.network.OnPublicNetworkEnricher:0.0.0-SNAPSHOT;null], BasicRegisteredType[org.apache.brooklyn.enricher.stock.MapAggregator:0.0.0-SNAPSHOT;null], BasicRegisteredType[org.apache.brooklyn.entity.software.base.VanillaWindowsProcess:0.0.0-SNAPSHOT;null], BasicRegisteredType[org.apache.brooklyn.entity.machine.MachineEntity:0.0.0-SNAPSHOT;null], BasicRegisteredType[org.apache.brooklyn.policy.enricher.RollingMeanEnricher:0.0.0-SNAPSHOT;null], BasicRegisteredType[org.apache.brooklyn.rest.resources.DummyIconEntity:0.0.0-SNAPSHOT;null]] gave errors; 120 errors including: Transformer for Brooklyn OASIS CAMP interpreter gave an error creating this plan: No CAMP Platform is registered with this Brooklyn management context.
	at org.apache.brooklyn.core.mgmt.ha.OsgiArchiveInstaller.install(OsgiArchiveInstaller.java:643) ~[brooklyn-core-1.0.0-SNAPSHOT.jar:1.0.0-SNAPSHOT]
Caused by: java.lang.IllegalArgumentException: Error installing catalog items
	at org.apache.brooklyn.core.mgmt.ha.OsgiManager.loadCatalogBom(OsgiManager.java:524) ~[brooklyn-core-1.0.0-SNAPSHOT.jar:1.0.0-SNAPSHOT]
Caused by: org.apache.brooklyn.util.exceptions.CompoundRuntimeException: Failed to install brooklyn-catalog-bom-FjkuHYmP:0.0.0.SNAPSHOT, types [BasicRegisteredType[org.apache.brooklyn.policy.ha.ServiceRestarter:0.0.0-SNAPSHOT;null], BasicRegisteredType[org.apache.brooklyn.enricher.stock.Aggregator:0.0.0-SNAPSHOT;null], BasicRegisteredType[org.apache.brooklyn.enricher.stock.Joiner:0.0.0-SNAPSHOT;null], BasicRegisteredType[org.apache.brooklyn.enricher.stock.Propagator:0.0.0-SNAPSHOT;null], BasicRegisteredType[org.apache.brooklyn.policy.ha.ConnectionFailureDetector:0.0.0-SNAPSHOT;null], BasicRegisteredType[org.apache.brooklyn.policy.autoscaling.AutoScalerPolicy:0.0.0-SNAPSHOT;null], BasicRegisteredType[org.apache.brooklyn.enricher.stock.reducer.Reducer:0.0.0-SNAPSHOT;null], BasicRegisteredType[org.apache.brooklyn.enricher.stock.UpdatingMap:0.0.0-SNAPSHOT;null], BasicRegisteredType[org.apache.brooklyn.enricher.stock.Transformer:0.0.0-SNAPSHOT;null], BasicRegisteredType[org.apache.brooklyn.entity.machine.pool.ServerPool:0.0.0-SNAPSHOT;null], BasicRegisteredType[org.apache.brooklyn.enricher.stock.YamlRollingTimeWindowMeanEnricher:0.0.0-SNAPSHOT;null], BasicRegisteredType[org.apache.brooklyn.entity.brooklynnode.BrooklynNode:0.0.0-SNAPSHOT;null], BasicRegisteredType[org.apache.brooklyn.policy.enricher.TimeWeightedDeltaEnricher:0.0.0-SNAPSHOT;null], BasicRegisteredType[org.apache.brooklyn.core.network.OnSubnetNetworkEnricher:0.0.0-SNAPSHOT;null], BasicRegisteredType[org.apache.brooklyn.entity.brooklynnode.BrooklynEntityMirror:0.0.0-SNAPSHOT;null], BasicRegisteredType[org.apache.brooklyn.enricher.stock.PercentageEnricher:0.0.0-SNAPSHOT;null], BasicRegisteredType[org.apache.brooklyn.enricher.stock.Combiner:0.0.0-SNAPSHOT;null], BasicRegisteredType[org.apache.brooklyn.policy.enricher.RollingTimeWindowMeanEnricher:0.0.0-SNAPSHOT;null], BasicRegisteredType[org.apache.brooklyn.enricher.stock.YamlTimeWeightedDeltaEnricher:0.0.0-SNAPSHOT;null], BasicRegisteredType[org.apache.brooklyn.policy.enricher.DeltaEnricher:0.0.0-SNAPSHOT;null], BasicRegisteredType[org.apache.brooklyn.policy.enricher.TimeFractionDeltaEnricher:0.0.0-SNAPSHOT;null], BasicRegisteredType[org.apache.brooklyn.policy.ha.SshMachineFailureDetector:0.0.0-SNAPSHOT;null], BasicRegisteredType[org.apache.brooklyn.policy.enricher.HttpLatencyDetector:0.0.0-SNAPSHOT;null], BasicRegisteredType[org.apache.brooklyn.entity.software.base.VanillaSoftwareProcess:0.0.0-SNAPSHOT;null], BasicRegisteredType[org.apache.brooklyn.core.network.OnPublicNetworkEnricher:0.0.0-SNAPSHOT;null], BasicRegisteredType[org.apache.brooklyn.enricher.stock.MapAggregator:0.0.0-SNAPSHOT;null], BasicRegisteredType[org.apache.brooklyn.entity.software.base.VanillaWindowsProcess:0.0.0-SNAPSHOT;null], BasicRegisteredType[org.apache.brooklyn.entity.machine.MachineEntity:0.0.0-SNAPSHOT;null], BasicRegisteredType[org.apache.brooklyn.policy.enricher.RollingMeanEnricher:0.0.0-SNAPSHOT;null], BasicRegisteredType[org.apache.brooklyn.rest.resources.DummyIconEntity:0.0.0-SNAPSHOT;null]] gave errors; 120 errors including: Transformer for Brooklyn OASIS CAMP interpreter gave an error creating this plan: No CAMP Platform is registered with this Brooklyn management context.
	at org.apache.brooklyn.util.exceptions.Exceptions.create(Exceptions.java:488) ~[brooklyn-utils-common-1.0.0-SNAPSHOT.jar:1.0.0-SNAPSHOT]
Caused by: java.lang.IllegalStateException: Transformer for Brooklyn OASIS CAMP interpreter gave an error creating this plan: No CAMP Platform is registered with this Brooklyn management context.
	at org.apache.brooklyn.util.guava.IllegalStateExceptionSupplier.get(IllegalStateExceptionSupplier.java:40) ~[brooklyn-utils-common-1.0.0-SNAPSHOT.jar:1.0.0-SNAPSHOT]
Caused by: org.apache.brooklyn.util.exceptions.PropagatedRuntimeException: 
	at org.apache.brooklyn.util.exceptions.Exceptions.create(Exceptions.java:480) ~[brooklyn-utils-common-1.0.0-SNAPSHOT.jar:1.0.0-SNAPSHOT]
Caused by: org.apache.brooklyn.util.exceptions.PropagatedRuntimeException: Transformer for Brooklyn OASIS CAMP interpreter gave an error creating this plan: No CAMP Platform is registered with this Brooklyn management context.
	at org.apache.brooklyn.core.plan.PlanToSpecFactory.attemptWithLoaders(PlanToSpecFactory.java:138) ~[brooklyn-core-1.0.0-SNAPSHOT.jar:1.0.0-SNAPSHOT]
Caused by: java.lang.IllegalStateException: No CAMP Platform is registered with this Brooklyn management context.
	at org.apache.brooklyn.camp.brooklyn.spi.creation.CampInternalUtils.getCampPlatform(CampInternalUtils.java:232) ~[brooklyn-camp-1.0.0-SNAPSHOT.jar:1.0.0-SNAPSHOT]
[GC (Metadata GC Threshold)  138902K->57053K(702464K), 0.0120948 secs]
[Full GC (Metadata GC Threshold)  57053K->25912K(702464K), 0.1180498 secs]
Oct 10, 2017 7:58:44 AM org.apache.cxf.endpoint.ServerImpl initDestination
INFO: Setting the server's publish address to be /
2017-10-10 07:58:45,047 INFO  Brooklyn REST server started (programmatic Jersey ServletContainer servlet) on
2017-10-10 07:58:45,048 INFO    http://localhost:8081/
2017-10-10 07:58:45,111 INFO  TESTNG PASSED CONFIGURATION: "Surefire test" - @BeforeClass org.apache.brooklyn.rest.client.BrooklynApiRestClientTest.setUp() finished in 14446 ms
2017-10-10 07:58:45,112 INFO  TESTNG INVOKING: "Surefire test" - org.apache.brooklyn.rest.client.BrooklynApiRestClientTest.testApplicationApiCreate()
2017-10-10 07:58:45,358 INFO  REST using security provider org.apache.brooklyn.rest.security.provider.TestSecurityProvider
2017-10-10 07:58:46,439 INFO  Launched from YAML: name: test-1234
services: [ { type: org.apache.brooklyn.core.test.entity.TestEntity } ] -> BasicApplicationImpl{id=gnyi6gx362} (Task[start]@TdlpaawZ)
2017-10-10 07:58:46,484 INFO  Started application BasicApplicationImpl{id=gnyi6gx362}
2017-10-10 07:58:46,735 INFO  creation result: TaskSummary{id='TdlpaawZ', displayName='start', entityId='gnyi6gx362', entityDisplayName='test-1234', description='Invoking effector start on test-1234 with parameters {locations=[]}', tags=[EFFECTOR, {entitlementContext={user=test, sourceIp=127.0.0.1, requestUri=/v1/applications, requestUniqueIdentifier=ahJGLg}}, inessential, {entityId=gnyi6gx362, effectorName=start}, {type=org.apache.brooklyn.api.mgmt.ManagementContext}, {wrappingType=contextEntity, entity={type=org.apache.brooklyn.api.entity.Entity, id=gnyi6gx362}}, {wrappingType=targetEntity, entity={type=org.apache.brooklyn.api.entity.Entity, id=gnyi6gx362}}, {wrappingType=callerEntity, entity={type=org.apache.brooklyn.api.entity.Entity, id=gnyi6gx362}}], submitTimeUtc=1507622326411, startTimeUtc=1507622326412, endTimeUtc=1507622326485, currentStatus='Completed', result=null, isError=false, isCancelled=false, children=[LinkWithMetadata{link='/v1/activities/V1Hst8QX', metadata={id=V1Hst8QX, taskName=invoking start[locations] on 1 node, entityId=gnyi6gx362, entityDisplayName=test-1234}}], submittedByTask=null, blockingTask=null, blockingDetails='null', detailedStatus='Completed after 74ms

No return value (null)', streams={}, links={self=/v1/activities/TdlpaawZ, children=/v1/activities/TdlpaawZ/children, entity=/v1/applications/gnyi6gx362/entities/gnyi6gx362}}
2017-10-10 07:58:46,798 INFO  apps with test: [ApplicationSummary{id='gnyi6gx362', spec=ApplicationSpec{name='test-1234', type='org.apache.brooklyn.entity.stock.BasicApplication', entities=null, locations=[], config={}}, status=RUNNING, links={self=/v1/applications/gnyi6gx362, entities=/v1/applications/gnyi6gx362/entities}}]
2017-10-10 07:58:46,799 INFO  TESTNG PASSED: "Surefire test" - org.apache.brooklyn.rest.client.BrooklynApiRestClientTest.testApplicationApiCreate() finished in 1687 ms
2017-10-10 07:58:46,800 INFO  TESTNG INVOKING: "Surefire test" - org.apache.brooklyn.rest.client.BrooklynApiRestClientTest.testApplicationApiHandledError()
2017-10-10 07:58:46,829 WARN  Failed REST deployment, could not create spec: org.apache.brooklyn.util.exceptions.CompoundRuntimeException: Unable to instantiate item; 2 errors including: UnsupportedTypePlanException: Invalid plan; format could not be recognized, trying with: [Java type instantiator (org.apache.brooklyn.core.catalog.internal.JavaCatalogToSpecTransformer parses only old-style catalog items containing only 'type: JavaClass' or javaType in DTO)]
[GC (Allocation Failure)  199992K->39810K(742400K), 0.0156144 secs]
2017-10-10 07:58:46,885 INFO  TESTNG PASSED: "Surefire test" - org.apache.brooklyn.rest.client.BrooklynApiRestClientTest.testApplicationApiHandledError() finished in 84 ms
2017-10-10 07:58:46,886 INFO  TESTNG INVOKING: "Surefire test" - org.apache.brooklyn.rest.client.BrooklynApiRestClientTest.testApplicationApiList()
2017-10-10 07:58:46,909 INFO  apps are: [ApplicationSummary{id='gnyi6gx362', spec=ApplicationSpec{name='test-1234', type='org.apache.brooklyn.entity.stock.BasicApplication', entities=null, locations=[], config={}}, status=RUNNING, links={self=/v1/applications/gnyi6gx362, entities=/v1/applications/gnyi6gx362/entities}}]
2017-10-10 07:58:46,909 INFO  TESTNG PASSED: "Surefire test" - org.apache.brooklyn.rest.client.BrooklynApiRestClientTest.testApplicationApiList() finished in 24 ms
2017-10-10 07:58:46,910 INFO  TESTNG INVOKING: "Surefire test" - org.apache.brooklyn.rest.client.BrooklynApiRestClientTest.testApplicationApiThrownError()
2017-10-10 07:58:46,941 INFO  TESTNG PASSED: "Surefire test" - org.apache.brooklyn.rest.client.BrooklynApiRestClientTest.testApplicationApiThrownError() finished in 31 ms
2017-10-10 07:58:46,942 INFO  TESTNG INVOKING: "Surefire test" - org.apache.brooklyn.rest.client.BrooklynApiRestClientTest.testCatalogApiLocations()
2017-10-10 07:58:47,039 INFO  locations from catalog are: []
2017-10-10 07:58:47,040 INFO  TESTNG PASSED: "Surefire test" - org.apache.brooklyn.rest.client.BrooklynApiRestClientTest.testCatalogApiLocations() finished in 97 ms
2017-10-10 07:58:47,040 INFO  TESTNG INVOKING: "Surefire test" - org.apache.brooklyn.rest.client.BrooklynApiRestClientTest.testCatalogCreate()
2017-10-10 07:58:47,410 INFO  Installed Brooklyn catalog bundle simple-tomcat:1.0.0 with ID wp5kkrgg47 [167], items: [simple-tomcat:1.0]
2017-10-10 07:58:47,412 INFO  REST created catalog items: [BasicRegisteredType[simple-tomcat:1.0;null]]
2017-10-10 07:58:47,599 WARN  Unable to create spec for BasicRegisteredType[simple-tomcat:1.0;null]: org.apache.brooklyn.core.typereg.ReferencedUnresolvedTypeException: Reference to known type simple-tomcat:1.0 in plan but it's definition is unresolved (recursive plan or premature evaluation?)
org.apache.brooklyn.core.typereg.ReferencedUnresolvedTypeException: Reference to known type simple-tomcat:1.0 in plan but it's definition is unresolved (recursive plan or premature evaluation?)
	at org.apache.brooklyn.core.typereg.BasicBrooklynTypeRegistry.createSpec(BasicBrooklynTypeRegistry.java:213) ~[brooklyn-core-1.0.0-SNAPSHOT.jar:1.0.0-SNAPSHOT]
2017-10-10 07:58:47,626 INFO  TESTNG PASSED: "Surefire test" - org.apache.brooklyn.rest.client.BrooklynApiRestClientTest.testCatalogCreate() finished in 586 ms
2017-10-10 07:58:47,627 INFO  TESTNG INVOKING: "Surefire test" - org.apache.brooklyn.rest.client.BrooklynApiRestClientTest.testLocationApi()
2017-10-10 07:58:47,627 INFO  Testing location API
2017-10-10 07:58:47,650 INFO  locations located are: {}
2017-10-10 07:58:47,651 INFO  TESTNG PASSED: "Surefire test" - org.apache.brooklyn.rest.client.BrooklynApiRestClientTest.testLocationApi() finished in 24 ms
2017-10-10 07:58:47,653 INFO  TESTNG INVOKING: "Surefire test" - org.apache.brooklyn.rest.client.BrooklynApiRestClientTest.testNoV1InUrl()
[GC (Allocation Failure)  212866K->38339K(741376K), 0.0284444 secs]
2017-10-10 07:58:48,147 INFO  TESTNG PASSED: "Surefire test" - org.apache.brooklyn.rest.client.BrooklynApiRestClientTest.testNoV1InUrl() finished in 494 ms
2017-10-10 07:58:48,148 INFO  TESTNG INVOKING CONFIGURATION: "Surefire test" - @AfterClass org.apache.brooklyn.rest.client.BrooklynApiRestClientTest.tearDown()
2017-10-10 07:58:48,152 INFO  Stopping application BasicApplicationImpl{id=gnyi6gx362}
2017-10-10 07:58:48,166 INFO  Stopped application BasicApplicationImpl{id=gnyi6gx362}
2017-10-10 07:58:48,386 INFO  TESTNG PASSED CONFIGURATION: "Surefire test" - @AfterClass org.apache.brooklyn.rest.client.BrooklynApiRestClientTest.tearDown() finished in 238 ms
2017-10-10 07:58:48,396 INFO  TESTNG INVOKING: "Surefire test" - org.apache.brooklyn.rest.client.BrooklynApiGetEntityTest.testGetEntityAllowsEmptyMaps()
2017-10-10 07:58:48,495 INFO  TESTNG PASSED: "Surefire test" - org.apache.brooklyn.rest.client.BrooklynApiGetEntityTest.testGetEntityAllowsEmptyMaps() finished in 98 ms
2017-10-10 07:58:48,496 INFO  TESTNG INVOKING: "Surefire test" - org.apache.brooklyn.rest.client.BrooklynApiGetEntityTest.testGetEntityAllowsNull()
2017-10-10 07:58:48,496 INFO  TESTNG PASSED: "Surefire test" - org.apache.brooklyn.rest.client.BrooklynApiGetEntityTest.testGetEntityAllowsNull() finished in 0 ms
2017-10-10 07:58:48,497 INFO  TESTNG INVOKING: "Surefire test" - org.apache.brooklyn.rest.client.BrooklynApiGetEntityTest.testGetEntityDisallowsNull()
2017-10-10 07:58:48,498 INFO  TESTNG PASSED: "Surefire test" - org.apache.brooklyn.rest.client.BrooklynApiGetEntityTest.testGetEntityDisallowsNull() finished in 1 ms
2017-10-10 07:58:48,499 INFO  TESTNG INVOKING: "Surefire test" - org.apache.brooklyn.rest.client.BrooklynApiGetEntityTest.testGetEntityFailsIfLooksLikeApiError()
2017-10-10 07:58:48,505 INFO  TESTNG PASSED: "Surefire test" - org.apache.brooklyn.rest.client.BrooklynApiGetEntityTest.testGetEntityFailsIfLooksLikeApiError() finished in 6 ms
2017-10-10 07:58:48,505 INFO  TESTNG INVOKING: "Surefire test" - org.apache.brooklyn.rest.client.BrooklynApiGetEntityTest.testGetEntityFailsOnNonJson()
2017-10-10 07:58:48,509 INFO  TESTNG PASSED: "Surefire test" - org.apache.brooklyn.rest.client.BrooklynApiGetEntityTest.testGetEntityFailsOnNonJson() finished in 3 ms
2017-10-10 07:58:48,509 INFO  TESTNG INVOKING: "Surefire test" - org.apache.brooklyn.rest.client.BrooklynApiGetEntityTest.testGetEntityFailsWithMessageIfLooksLikeApiErrorWithMessage()
2017-10-10 07:58:48,510 INFO  TESTNG PASSED: "Surefire test" - org.apache.brooklyn.rest.client.BrooklynApiGetEntityTest.testGetEntityFailsWithMessageIfLooksLikeApiErrorWithMessage() finished in 1 ms
2017-10-10 07:58:48,511 INFO  TESTNG INVOKING: "Surefire test" - org.apache.brooklyn.rest.client.BrooklynApiGetEntityTest.testGetEntityIgnoresErrorResponseCodeInBasicResponse()
2017-10-10 07:58:48,514 INFO  TESTNG PASSED: "Surefire test" - org.apache.brooklyn.rest.client.BrooklynApiGetEntityTest.testGetEntityIgnoresErrorResponseCodeInBasicResponse() finished in 3 ms
2017-10-10 07:58:48,515 INFO  TESTNG INVOKING: "Surefire test" - org.apache.brooklyn.rest.client.BrooklynApiGetEntityTest.testGetEntityIgnoresErrorResponseCodeInBuiltResponse()
2017-10-10 07:58:48,518 INFO  TESTNG PASSED: "Surefire test" - org.apache.brooklyn.rest.client.BrooklynApiGetEntityTest.testGetEntityIgnoresErrorResponseCodeInBuiltResponse() finished in 3 ms
2017-10-10 07:58:48,518 INFO  TESTNG INVOKING: "Surefire test" - org.apache.brooklyn.rest.client.BrooklynApiGetEntityTest.testGetEntityIgnoresExtraFields()
2017-10-10 07:58:48,521 INFO  TESTNG PASSED: "Surefire test" - org.apache.brooklyn.rest.client.BrooklynApiGetEntityTest.testGetEntityIgnoresExtraFields() finished in 3 ms
2017-10-10 07:58:48,522 INFO  TESTNG INVOKING: "Surefire test" - org.apache.brooklyn.rest.client.BrooklynApiGetEntityTest.testGetEntitySucceedsIfLooksLikeApiErrorWhenWantingApiError()
2017-10-10 07:58:48,523 INFO  TESTNG PASSED: "Surefire test" - org.apache.brooklyn.rest.client.BrooklynApiGetEntityTest.testGetEntitySucceedsIfLooksLikeApiErrorWhenWantingApiError() finished in 1 ms
2017-10-10 07:58:48,524 INFO  TESTNG INVOKING: "Surefire test" - org.apache.brooklyn.rest.client.BrooklynApiGetEntityTest.testGetEntitySucceedsIfNoErrorCodeWhenApiError()
2017-10-10 07:58:48,527 INFO  TESTNG PASSED: "Surefire test" - org.apache.brooklyn.rest.client.BrooklynApiGetEntityTest.testGetEntitySucceedsIfNoErrorCodeWhenApiError() finished in 3 ms
2017-10-10 07:58:48,527 INFO  TESTNG INVOKING: "Surefire test" - org.apache.brooklyn.rest.client.BrooklynApiGetEntityTest.testGetSuccessfulEntityFailsOnAnyError()
2017-10-10 07:58:48,528 INFO  TESTNG PASSED: "Surefire test" - org.apache.brooklyn.rest.client.BrooklynApiGetEntityTest.testGetSuccessfulEntityFailsOnAnyError() finished in 1 ms
2017-10-10 07:58:48,529 INFO  TESTNG INVOKING: "Surefire test" - org.apache.brooklyn.rest.client.BrooklynApiGetEntityTest.testGetSuccessfulEntitySucceedsOnNoErrorApiError()
2017-10-10 07:58:48,530 INFO  TESTNG PASSED: "Surefire test" - org.apache.brooklyn.rest.client.BrooklynApiGetEntityTest.testGetSuccessfulEntitySucceedsOnNoErrorApiError() finished in 1 ms
2017-10-10 07:58:48,568 INFO  TESTNG 
===============================================
    Surefire test
    Tests run: 25, Failures: 0, Skips: 0
===============================================
Tests run: 25, Failures: 0, Errors: 0, Skipped: 0, Time elapsed: 22.479 sec - in TestSuite

Results :

Tests run: 25, Failures: 0, Errors: 0, Skipped: 0

[JENKINS] Recording test results
[INFO] 
[INFO] --- maven-jar-plugin:2.6:jar (default-jar) @ brooklyn-rest-client ---
[INFO] Building jar: <https://builds.apache.org/job/brooklyn-client-master/ws/java/target/brooklyn-rest-client-1.0.0-SNAPSHOT.jar>
[INFO] 
[INFO] --- maven-site-plugin:3.4:attach-descriptor (attach-descriptor) @ brooklyn-rest-client ---
[INFO] 
[INFO] --- maven-jar-plugin:2.6:test-jar (test-jar-creation) @ brooklyn-rest-client ---
[INFO] Building jar: <https://builds.apache.org/job/brooklyn-client-master/ws/java/target/brooklyn-rest-client-1.0.0-SNAPSHOT-tests.jar>
[INFO] 
[INFO] --- apache-rat-plugin:0.12:check (default) @ brooklyn-rest-client ---
[INFO] Enabled default license matchers.
[INFO] Will parse SCM ignores for exclusions...
[INFO] Finished adding exclusions from SCM ignore files.
[INFO] 61 implicit excludes (use -debug for more details).
[INFO] Exclude: sandbox/**
[INFO] Exclude: release/**
[INFO] Exclude: README.md
[INFO] Exclude: **/.git/**
[INFO] Exclude: **/.gitignore
[INFO] Exclude: **/.repository/**
[INFO] Exclude: **/.idea/**
[INFO] Exclude: **/*.iml
[INFO] Exclude: **/.classpath/**
[INFO] Exclude: **/.project
[INFO] Exclude: **/.settings/**
[INFO] Exclude: **/*.log
[INFO] Exclude: **/brooklyn*.log.*
[INFO] Exclude: **/target/**
[INFO] Exclude: **/nbactions.xml
[INFO] Exclude: **/nb-configuration.xml
[INFO] Exclude: ignored/**
[INFO] Exclude: LICENSE.md
[INFO] Exclude: .mvn/jvm.config
[INFO] Exclude: **/src/main/license/**
[INFO] Exclude: **/src/test/license/**
[INFO] Exclude: **/MANIFEST.MF
[INFO] Exclude: **/test-output/**
[INFO] Exclude: **/*.pem.pub
[INFO] Exclude: **/*.pem
[INFO] Exclude: **/*_rsa.pub
[INFO] Exclude: **/*_rsa
[INFO] Exclude: **/*.svg
[INFO] Exclude: **/*.crt
[INFO] Exclude: **/*.csr
[INFO] Exclude: **/*.key
[INFO] Exclude: **/*.key.org
[INFO] Exclude: **/*.psd
[INFO] Exclude: **/*.json
[INFO] Exclude: **/*.plxarc
[INFO] Exclude: **/src/test/resources/org/apache/brooklyn/entity/software/base/template_with_extra_substitutions.txt
[INFO] Exclude: **/src/main/resources/banner.txt
[INFO] Exclude: **/src/test/resources/ssl/certs/localhost/info.txt
[INFO] Exclude: **/src/main/history/dependencies.xml
[INFO] Exclude: **/sandbox/examples/src/main/scripts/amis.txt
[INFO] Exclude: docs/**
[INFO] 10 resources included (use -debug for more details)
[INFO] Rat check: Summary over all files. Unapproved: 0, unknown: 0, generated: 0, approved: 10 licenses.
[INFO] 
[INFO] --- maven-source-plugin:2.4:jar-no-fork (attach-sources) @ brooklyn-rest-client ---
[INFO] Building jar: <https://builds.apache.org/job/brooklyn-client-master/ws/java/target/brooklyn-rest-client-1.0.0-SNAPSHOT-sources.jar>
[INFO] 
[INFO] --- maven-source-plugin:2.4:test-jar-no-fork (attach-sources) @ brooklyn-rest-client ---
[INFO] Building jar: <https://builds.apache.org/job/brooklyn-client-master/ws/java/target/brooklyn-rest-client-1.0.0-SNAPSHOT-test-sources.jar>
[INFO] 
[INFO] --- maven-install-plugin:2.5.2:install (default-install) @ brooklyn-rest-client ---
[INFO] Installing <https://builds.apache.org/job/brooklyn-client-master/ws/java/target/brooklyn-rest-client-1.0.0-SNAPSHOT.jar> to /home/jenkins/jenkins-slave/maven-repositories/1/org/apache/brooklyn/brooklyn-rest-client/1.0.0-SNAPSHOT/brooklyn-rest-client-1.0.0-SNAPSHOT.jar
[INFO] Installing <https://builds.apache.org/job/brooklyn-client-master/ws/java/pom.xml> to /home/jenkins/jenkins-slave/maven-repositories/1/org/apache/brooklyn/brooklyn-rest-client/1.0.0-SNAPSHOT/brooklyn-rest-client-1.0.0-SNAPSHOT.pom
[INFO] Installing <https://builds.apache.org/job/brooklyn-client-master/ws/java/target/brooklyn-rest-client-1.0.0-SNAPSHOT-tests.jar> to /home/jenkins/jenkins-slave/maven-repositories/1/org/apache/brooklyn/brooklyn-rest-client/1.0.0-SNAPSHOT/brooklyn-rest-client-1.0.0-SNAPSHOT-tests.jar
[INFO] Installing <https://builds.apache.org/job/brooklyn-client-master/ws/java/target/brooklyn-rest-client-1.0.0-SNAPSHOT-sources.jar> to /home/jenkins/jenkins-slave/maven-repositories/1/org/apache/brooklyn/brooklyn-rest-client/1.0.0-SNAPSHOT/brooklyn-rest-client-1.0.0-SNAPSHOT-sources.jar
[INFO] Installing <https://builds.apache.org/job/brooklyn-client-master/ws/java/target/brooklyn-rest-client-1.0.0-SNAPSHOT-test-sources.jar> to /home/jenkins/jenkins-slave/maven-repositories/1/org/apache/brooklyn/brooklyn-rest-client/1.0.0-SNAPSHOT/brooklyn-rest-client-1.0.0-SNAPSHOT-test-sources.jar
[INFO] ------------------------------------------------------------------------
[INFO] Reactor Summary:
[INFO] 
[INFO] Brooklyn Client .................................... SUCCESS [ 13.195 s]
[INFO] Brooklyn Client Command Line Interface ............. SUCCESS [01:40 min]
[INFO] Brooklyn REST java Client .......................... SUCCESS [02:00 min]
[INFO] ------------------------------------------------------------------------
[INFO] BUILD SUCCESS
[INFO] ------------------------------------------------------------------------
[INFO] Total time: 04:28 min
[INFO] Finished at: 2017-10-10T08:00:04+00:00
[INFO] Final Memory: 71M/662M
[INFO] ------------------------------------------------------------------------
Waiting for Jenkins to finish collecting data
[JENKINS] Archiving <https://builds.apache.org/job/brooklyn-client-master/ws/cli/pom.xml> to org.apache.brooklyn/brooklyn-client-cli/1.0.0-SNAPSHOT/brooklyn-client-cli-1.0.0-SNAPSHOT.pom
[JENKINS] Archiving <https://builds.apache.org/job/brooklyn-client-master/ws/cli/target/brooklyn-client-cli-1.0.0-SNAPSHOT-bin.zip> to org.apache.brooklyn/brooklyn-client-cli/1.0.0-SNAPSHOT/brooklyn-client-cli-1.0.0-SNAPSHOT-bin.zip
[Fast Archiver] Compressed 6.76 MB of artifacts by 40.7% relative to #66
[JENKINS] Archiving <https://builds.apache.org/job/brooklyn-client-master/ws/java/pom.xml> to org.apache.brooklyn/brooklyn-rest-client/1.0.0-SNAPSHOT/brooklyn-rest-client-1.0.0-SNAPSHOT.pom
[JENKINS] Archiving <https://builds.apache.org/job/brooklyn-client-master/ws/java/target/brooklyn-rest-client-1.0.0-SNAPSHOT.jar> to org.apache.brooklyn/brooklyn-rest-client/1.0.0-SNAPSHOT/brooklyn-rest-client-1.0.0-SNAPSHOT.jar
[JENKINS] Archiving <https://builds.apache.org/job/brooklyn-client-master/ws/java/target/brooklyn-rest-client-1.0.0-SNAPSHOT-tests.jar> to org.apache.brooklyn/brooklyn-rest-client/1.0.0-SNAPSHOT/brooklyn-rest-client-1.0.0-SNAPSHOT-tests.jar
[JENKINS] Archiving <https://builds.apache.org/job/brooklyn-client-master/ws/java/target/brooklyn-rest-client-1.0.0-SNAPSHOT-sources.jar> to org.apache.brooklyn/brooklyn-rest-client/1.0.0-SNAPSHOT/brooklyn-rest-client-1.0.0-SNAPSHOT-sources.jar
[JENKINS] Archiving <https://builds.apache.org/job/brooklyn-client-master/ws/java/target/brooklyn-rest-client-1.0.0-SNAPSHOT-test-sources.jar> to org.apache.brooklyn/brooklyn-rest-client/1.0.0-SNAPSHOT/brooklyn-rest-client-1.0.0-SNAPSHOT-test-sources.jar
[JENKINS] Archiving <https://builds.apache.org/job/brooklyn-client-master/ws/pom.xml> to org.apache.brooklyn/brooklyn-client/1.0.0-SNAPSHOT/brooklyn-client-1.0.0-SNAPSHOT.pom
channel stopped
Maven RedeployPublisher use remote qnode1 maven settings from : /home/jenkins/.m2/settings.xml
[INFO] Deployment in https://repository.apache.org/content/repositories/snapshots (id=apache.snapshots.https,uniqueVersion=true)
Deploying the main artifact brooklyn-client-1.0.0-SNAPSHOT.pom
Downloading: https://repository.apache.org/content/repositories/snapshots/org/apache/brooklyn/brooklyn-client/1.0.0-SNAPSHOT/maven-metadata.xml
Uploading: https://repository.apache.org/content/repositories/snapshots/org/apache/brooklyn/brooklyn-client/1.0.0-SNAPSHOT/brooklyn-client-1.0.0-20171010.080142-1.pom
Uploaded: https://repository.apache.org/content/repositories/snapshots/org/apache/brooklyn/brooklyn-client/1.0.0-SNAPSHOT/brooklyn-client-1.0.0-20171010.080142-1.pom (4 KB at 0.2 KB/sec)
Downloading: https://repository.apache.org/content/repositories/snapshots/org/apache/brooklyn/brooklyn-client/maven-metadata.xml
Downloaded: https://repository.apache.org/content/repositories/snapshots/org/apache/brooklyn/brooklyn-client/maven-metadata.xml (356 B at 0.0 KB/sec)
Uploading: https://repository.apache.org/content/repositories/snapshots/org/apache/brooklyn/brooklyn-client/1.0.0-SNAPSHOT/maven-metadata.xml
Uploaded: https://repository.apache.org/content/repositories/snapshots/org/apache/brooklyn/brooklyn-client/1.0.0-SNAPSHOT/maven-metadata.xml (611 B at 0.5 KB/sec)
Uploading: https://repository.apache.org/content/repositories/snapshots/org/apache/brooklyn/brooklyn-client/maven-metadata.xml
ERROR: Failed to deploy metadata: Could not transfer metadata org.apache.brooklyn:brooklyn-client/maven-metadata.xml from/to apache.snapshots.https (https://repository.apache.org/content/repositories/snapshots): Failed to transfer file: https://repository.apache.org/content/repositories/snapshots/org/apache/brooklyn/brooklyn-client/maven-metadata.xml. Return code is: 400, ReasonPhrase: Bad Request.
org.apache.maven.artifact.deployer.ArtifactDeploymentException: Failed to deploy metadata: Could not transfer metadata org.apache.brooklyn:brooklyn-client/maven-metadata.xml from/to apache.snapshots.https (https://repository.apache.org/content/repositories/snapshots): Failed to transfer file: https://repository.apache.org/content/repositories/snapshots/org/apache/brooklyn/brooklyn-client/maven-metadata.xml. Return code is: 400, ReasonPhrase: Bad Request.
	at org.apache.maven.artifact.deployer.DefaultArtifactDeployer.deploy(DefaultArtifactDeployer.java:143)
	at hudson.maven.reporters.MavenArtifactRecord.deploy(MavenArtifactRecord.java:193)
	at hudson.maven.RedeployPublisher.perform(RedeployPublisher.java:176)
	at hudson.tasks.BuildStepMonitor$1.perform(BuildStepMonitor.java:20)
	at hudson.model.AbstractBuild$AbstractBuildExecution.perform(AbstractBuild.java:736)
	at hudson.model.AbstractBuild$AbstractBuildExecution.performAllBuildSteps(AbstractBuild.java:682)
	at hudson.maven.MavenModuleSetBuild$MavenModuleSetBuildExecution.post2(MavenModuleSetBuild.java:1073)
	at hudson.model.AbstractBuild$AbstractBuildExecution.post(AbstractBuild.java:627)
	at hudson.model.Run.execute(Run.java:1762)
	at hudson.maven.MavenModuleSetBuild.run(MavenModuleSetBuild.java:543)
	at hudson.model.ResourceController.execute(ResourceController.java:97)
	at hudson.model.Executor.run(Executor.java:419)
Caused by: org.eclipse.aether.deployment.DeploymentException: Failed to deploy metadata: Could not transfer metadata org.apache.brooklyn:brooklyn-client/maven-metadata.xml from/to apache.snapshots.https (https://repository.apache.org/content/repositories/snapshots): Failed to transfer file: https://repository.apache.org/content/repositories/snapshots/org/apache/brooklyn/brooklyn-client/maven-metadata.xml. Return code is: 400, ReasonPhrase: Bad Request.
	at org.eclipse.aether.internal.impl.DefaultDeployer.deploy(DefaultDeployer.java:348)
	at org.eclipse.aether.internal.impl.DefaultDeployer.deploy(DefaultDeployer.java:245)
	at org.eclipse.aether.internal.impl.DefaultRepositorySystem.deploy(DefaultRepositorySystem.java:420)
	at org.apache.maven.artifact.deployer.DefaultArtifactDeployer.deploy(DefaultArtifactDeployer.java:139)
	... 11 more
Caused by: org.eclipse.aether.transfer.MetadataTransferException: Could not transfer metadata org.apache.brooklyn:brooklyn-client/maven-metadata.xml from/to apache.snapshots.https (https://repository.apache.org/content/repositories/snapshots): Failed to transfer file: https://repository.apache.org/content/repositories/snapshots/org/apache/brooklyn/brooklyn-client/maven-metadata.xml. Return code is: 400, ReasonPhrase: Bad Request.
	at org.eclipse.aether.connector.basic.MetadataTransportListener.transferFailed(MetadataTransportListener.java:43)
	at org.eclipse.aether.connector.basic.BasicRepositoryConnector$TaskRunner.run(BasicRepositoryConnector.java:355)
	at org.eclipse.aether.connector.basic.BasicRepositoryConnector.put(BasicRepositoryConnector.java:288)
	at org.eclipse.aether.internal.impl.DefaultDeployer.deploy(DefaultDeployer.java:342)
	... 14 more
Caused by: org.apache.maven.wagon.TransferFailedException: Failed to transfer file: https://repository.apache.org/content/repositories/snapshots/org/apache/brooklyn/brooklyn-client/maven-metadata.xml. Return code is: 400, ReasonPhrase: Bad Request.
	at org.apache.maven.wagon.shared.http.AbstractHttpClientWagon.put(AbstractHttpClientWagon.java:635)
	at org.apache.maven.wagon.shared.http.AbstractHttpClientWagon.put(AbstractHttpClientWagon.java:557)
	at org.apache.maven.wagon.shared.http.AbstractHttpClientWagon.put(AbstractHttpClientWagon.java:539)
	at org.apache.maven.wagon.shared.http.AbstractHttpClientWagon.put(AbstractHttpClientWagon.java:533)
	at org.apache.maven.wagon.shared.http.AbstractHttpClientWagon.put(AbstractHttpClientWagon.java:513)
	at org.eclipse.aether.transport.wagon.WagonTransporter$PutTaskRunner.run(WagonTransporter.java:644)
	at org.eclipse.aether.transport.wagon.WagonTransporter.execute(WagonTransporter.java:427)
	at org.eclipse.aether.transport.wagon.WagonTransporter.put(WagonTransporter.java:410)
	at org.eclipse.aether.connector.basic.BasicRepositoryConnector$PutTaskRunner.runTask(BasicRepositoryConnector.java:510)
	at org.eclipse.aether.connector.basic.BasicRepositoryConnector$TaskRunner.run(BasicRepositoryConnector.java:350)
	... 16 more
[INFO] Deployment failed after 1 min 0 sec
Build step 'Deploy artifacts to Maven repository' changed build result to FAILURE