You are viewing a plain text version of this content. The canonical link for it is here.
Posted to builds@beam.apache.org by Apache Jenkins Server <je...@builds.apache.org> on 2019/09/26 18:14:42 UTC

Build failed in Jenkins: beam_PostCommit_Python35 #573

See <https://builds.apache.org/job/beam_PostCommit_Python35/573/display/redirect?page=changes>

Changes:

[github] Fixing issue in AvroCoder documentation.

------------------------------------------
[...truncated 121.12 KB...]
        "output_info": [
          {
            "encoding": {
              "@type": "kind:windowed_value",
              "component_encodings": [
                {
                  "@type": "kind:bytes"
                },
                {
                  "@type": "kind:global_window"
                }
              ],
              "is_wrapper": true
            },
            "output_name": "out",
            "user_name": "ReadFromPubSub/Read.out"
          }
        ],
        "pubsub_subscription": "projects/apache-beam-testing/subscriptions/exercise_streaming_metrics_subscription_input2c7f5656-f914-42cb-bded-d40483d6e8b0",
        "user_name": "ReadFromPubSub/Read"
      }
    },
    {
      "kind": "ParallelDo",
      "name": "s2",
      "properties": {
        "display_data": [
          {
            "key": "fn",
            "label": "Transform Function",
            "namespace": "apache_beam.transforms.core.ParDo",
            "shortValue": "StreamingUserMetricsDoFn",
            "type": "STRING",
            "value": "apache_beam.runners.dataflow.dataflow_exercise_streaming_metrics_pipeline.StreamingUserMetricsDoFn"
          }
        ],
        "non_parallel_inputs": {},
        "output_info": [
          {
            "encoding": {
              "@type": "kind:windowed_value",
              "component_encodings": [
                {
                  "@type": "kind:bytes"
                },
                {
                  "@type": "kind:global_window"
                }
              ],
              "is_wrapper": true
            },
            "output_name": "out",
            "user_name": "generate_metrics.out"
          }
        ],
        "parallel_input": {
          "@type": "OutputReference",
          "output_name": "out",
          "step_name": "s1"
        },
        "serialized_fn": "ref_AppliedPTransform_generate_metrics_4",
        "user_name": "generate_metrics"
      }
    },
    {
      "kind": "ParallelWrite",
      "name": "s3",
      "properties": {
        "display_data": [],
        "encoding": {
          "@type": "kind:windowed_value",
          "component_encodings": [
            {
              "@type": "kind:bytes"
            },
            {
              "@type": "kind:global_window"
            }
          ],
          "is_wrapper": true
        },
        "format": "pubsub",
        "parallel_input": {
          "@type": "OutputReference",
          "output_name": "out",
          "step_name": "s2"
        },
        "pubsub_topic": "projects/apache-beam-testing/topics/exercise_streaming_metrics_topic_output2c7f5656-f914-42cb-bded-d40483d6e8b0",
        "user_name": "dump_to_pub/Write/NativeWrite"
      }
    }
  ],
  "type": "JOB_TYPE_STREAMING"
}
root: INFO: Create job: <Job
 createTime: '2019-09-26T17:59:14.171658Z'
 currentStateTime: '1970-01-01T00:00:00Z'
 id: '2019-09-26_10_59_12-13412874813737181990'
 location: 'us-central1'
 name: 'beamapp-jenkins-0926175845-468323'
 projectId: 'apache-beam-testing'
 stageStates: []
 startTime: '2019-09-26T17:59:14.171658Z'
 steps: []
 tempFiles: []
 type: TypeValueValuesEnum(JOB_TYPE_STREAMING, 2)>
root: INFO: Created job with id: [2019-09-26_10_59_12-13412874813737181990]
root: INFO: To access the Dataflow monitoring console, please navigate to https://console.cloud.google.com/dataflow/jobsDetail/locations/us-central1/jobs/2019-09-26_10_59_12-13412874813737181990?project=apache-beam-testing
root: INFO: Job 2019-09-26_10_59_12-13412874813737181990 is in state JOB_STATE_RUNNING
root: INFO: 2019-09-26T17:59:17.165Z: JOB_MESSAGE_DETAILED: Checking permissions granted to controller Service Account.
root: INFO: 2019-09-26T17:59:17.900Z: JOB_MESSAGE_BASIC: Worker configuration: n1-standard-4 in us-central1-f.
root: INFO: 2019-09-26T17:59:18.522Z: JOB_MESSAGE_DETAILED: Expanding SplittableParDo operations into optimizable parts.
root: INFO: 2019-09-26T17:59:18.528Z: JOB_MESSAGE_DETAILED: Expanding CollectionToSingleton operations into optimizable parts.
root: INFO: 2019-09-26T17:59:18.536Z: JOB_MESSAGE_DETAILED: Expanding CoGroupByKey operations into optimizable parts.
root: INFO: 2019-09-26T17:59:18.547Z: JOB_MESSAGE_DETAILED: Expanding SplittableProcessKeyed operations into optimizable parts.
root: INFO: 2019-09-26T17:59:18.551Z: JOB_MESSAGE_DETAILED: Expanding GroupByKey operations into streaming Read/Write steps
root: INFO: 2019-09-26T17:59:18.554Z: JOB_MESSAGE_DEBUG: Annotating graph with Autotuner information.
root: INFO: 2019-09-26T17:59:18.572Z: JOB_MESSAGE_DETAILED: Fusing adjacent ParDo, Read, Write, and Flatten operations
root: INFO: 2019-09-26T17:59:18.576Z: JOB_MESSAGE_DETAILED: Fusing consumer generate_metrics into ReadFromPubSub/Read
root: INFO: 2019-09-26T17:59:18.580Z: JOB_MESSAGE_DETAILED: Fusing consumer dump_to_pub/Write/NativeWrite into generate_metrics
root: INFO: 2019-09-26T17:59:18.593Z: JOB_MESSAGE_DEBUG: Adding StepResource setup and teardown to workflow graph.
root: INFO: 2019-09-26T17:59:18.608Z: JOB_MESSAGE_DEBUG: Adding workflow start and stop steps.
root: INFO: 2019-09-26T17:59:18.643Z: JOB_MESSAGE_DEBUG: Assigning stage ids.
root: INFO: 2019-09-26T17:59:18.805Z: JOB_MESSAGE_DEBUG: Executing wait step start2
root: INFO: 2019-09-26T17:59:18.825Z: JOB_MESSAGE_DEBUG: Starting worker pool setup.
root: INFO: 2019-09-26T17:59:18.832Z: JOB_MESSAGE_BASIC: Starting 1 workers...
root: INFO: 2019-09-26T17:59:22.599Z: JOB_MESSAGE_BASIC: Executing operation ReadFromPubSub/Read+generate_metrics+dump_to_pub/Write/NativeWrite
root: INFO: 2019-09-26T17:59:45.495Z: JOB_MESSAGE_DEBUG: Executing input step topology_init_attach_disk_input_step
root: INFO: 2019-09-26T17:59:45.757Z: JOB_MESSAGE_DETAILED: Checking permissions granted to controller Service Account.
root: INFO: 2019-09-26T17:59:46.609Z: JOB_MESSAGE_BASIC: Worker configuration: n1-standard-4 in us-central1-f.
root: INFO: 2019-09-26T18:00:17.833Z: JOB_MESSAGE_DETAILED: Workers have started successfully.
root: WARNING: Timing out on waiting for job 2019-09-26_10_59_12-13412874813737181990 after 61 seconds
google.auth.transport._http_client: DEBUG: Making request: GET http://169.254.169.254
google.auth.transport._http_client: DEBUG: Making request: GET http://metadata.google.internal/computeMetadata/v1/project/project-id
google.auth.transport.requests: DEBUG: Making request: GET http://metadata.google.internal/computeMetadata/v1/instance/service-accounts/default/?recursive=true
urllib3.connectionpool: DEBUG: Starting new HTTP connection (1): metadata.google.internal:80
urllib3.connectionpool: DEBUG: http://metadata.google.internal:80 "GET /computeMetadata/v1/instance/service-accounts/default/?recursive=true HTTP/1.1" 200 144
google.auth.transport.requests: DEBUG: Making request: GET http://metadata.google.internal/computeMetadata/v1/instance/service-accounts/844138762903-compute@developer.gserviceaccount.com/token
urllib3.connectionpool: DEBUG: http://metadata.google.internal:80 "GET /computeMetadata/v1/instance/service-accounts/844138762903-compute@developer.gserviceaccount.com/token HTTP/1.1" 200 181
--------------------- >> end captured logging << ---------------------
Worker logs: https://console.cloud.google.com/dataflow/jobsDetail/locations/us-central1/jobs/2019-09-26_10_16_06-6851874063617451452?project=apache-beam-testing
<https://builds.apache.org/job/beam_PostCommit_Python35/ws/src/sdks/python/apache_beam/io/gcp/bigquery.py>:1145: BeamDeprecationWarning: options is deprecated since First stable release. References to <pipeline>.options will not be supported
Worker logs: https://console.cloud.google.com/dataflow/jobsDetail/locations/us-central1/jobs/2019-09-26_10_32_42-10745700534315470171?project=apache-beam-testing
  experiments = p.options.view_as(DebugOptions).experiments or []
Worker logs: https://console.cloud.google.com/dataflow/jobsDetail/locations/us-central1/jobs/2019-09-26_10_44_34-10660431705992169176?project=apache-beam-testing
Worker logs: https://console.cloud.google.com/dataflow/jobsDetail/locations/us-central1/jobs/2019-09-26_10_56_04-16659853269524434785?project=apache-beam-testing
Worker logs: https://console.cloud.google.com/dataflow/jobsDetail/locations/us-central1/jobs/2019-09-26_11_04_39-13756240198513841119?project=apache-beam-testing
<https://builds.apache.org/job/beam_PostCommit_Python35/ws/src/sdks/python/apache_beam/runners/dataflow/dataflow_runner.py>:695: BeamDeprecationWarning: BigQuerySink is deprecated since 2.11.0. Use WriteToBigQuery instead.
Worker logs: https://console.cloud.google.com/dataflow/jobsDetail/locations/us-central1/jobs/2019-09-26_10_16_00-9314121034506207406?project=apache-beam-testing
  kms_key=transform.kms_key))
Worker logs: https://console.cloud.google.com/dataflow/jobsDetail/locations/us-central1/jobs/2019-09-26_10_40_29-8491335526324859282?project=apache-beam-testing
<https://builds.apache.org/job/beam_PostCommit_Python35/ws/src/sdks/python/apache_beam/io/gcp/bigquery.py>:1142: BeamDeprecationWarning: options is deprecated since First stable release. References to <pipeline>.options will not be supported
  self.table_reference.projectId = pcoll.pipeline.options.view_as(
Worker logs: https://console.cloud.google.com/dataflow/jobsDetail/locations/us-central1/jobs/2019-09-26_10_16_04-1241391296962927825?project=apache-beam-testing
<https://builds.apache.org/job/beam_PostCommit_Python35/ws/src/sdks/python/apache_beam/io/gcp/bigquery.py>:1145: BeamDeprecationWarning: options is deprecated since First stable release. References to <pipeline>.options will not be supported
  experiments = p.options.view_as(DebugOptions).experiments or []
Worker logs: https://console.cloud.google.com/dataflow/jobsDetail/locations/us-central1/jobs/2019-09-26_10_31_08-7073280156235130627?project=apache-beam-testing
<https://builds.apache.org/job/beam_PostCommit_Python35/ws/src/sdks/python/apache_beam/runners/dataflow/dataflow_runner.py>:695: BeamDeprecationWarning: BigQuerySink is deprecated since 2.11.0. Use WriteToBigQuery instead.
Worker logs: https://console.cloud.google.com/dataflow/jobsDetail/locations/us-central1/jobs/2019-09-26_10_42_04-15185553220771719515?project=apache-beam-testing
  kms_key=transform.kms_key))
Worker logs: https://console.cloud.google.com/dataflow/jobsDetail/locations/us-central1/jobs/2019-09-26_10_50_45-4826036875550629667?project=apache-beam-testing
Worker logs: https://console.cloud.google.com/dataflow/jobsDetail/locations/us-central1/jobs/2019-09-26_10_59_34-5296025004488038273?project=apache-beam-testing
Worker logs: https://console.cloud.google.com/dataflow/jobsDetail/locations/us-central1/jobs/2019-09-26_10_16_00-1634087082425099412?project=apache-beam-testing
<https://builds.apache.org/job/beam_PostCommit_Python35/ws/src/sdks/python/apache_beam/io/gcp/bigquery.py>:1145: BeamDeprecationWarning: options is deprecated since First stable release. References to <pipeline>.options will not be supported
Worker logs: https://console.cloud.google.com/dataflow/jobsDetail/locations/us-central1/jobs/2019-09-26_10_39_32-5174805299102571464?project=apache-beam-testing
  experiments = p.options.view_as(DebugOptions).experiments or []
Worker logs: https://console.cloud.google.com/dataflow/jobsDetail/locations/us-central1/jobs/2019-09-26_10_50_16-12186631367742300632?project=apache-beam-testing
<https://builds.apache.org/job/beam_PostCommit_Python35/ws/src/sdks/python/apache_beam/io/gcp/bigquery_file_loads.py>:793: BeamDeprecationWarning: options is deprecated since First stable release. References to <pipeline>.options will not be supported
Worker logs: https://console.cloud.google.com/dataflow/jobsDetail/locations/us-central1/jobs/2019-09-26_10_59_12-13412874813737181990?project=apache-beam-testing
  temp_location = p.options.view_as(GoogleCloudOptions).temp_location
<https://builds.apache.org/job/beam_PostCommit_Python35/ws/src/sdks/python/apache_beam/io/fileio_test.py>:232: FutureWarning: MatchAll is experimental.
  | 'GetPath' >> beam.Map(lambda metadata: metadata.path))
<https://builds.apache.org/job/beam_PostCommit_Python35/ws/src/sdks/python/apache_beam/io/fileio_test.py>:243: FutureWarning: MatchAll is experimental.
  | 'Checksums' >> beam.Map(compute_hash))
<https://builds.apache.org/job/beam_PostCommit_Python35/ws/src/sdks/python/apache_beam/io/fileio_test.py>:243: FutureWarning: ReadMatches is experimental.
  | 'Checksums' >> beam.Map(compute_hash))
Worker logs: https://console.cloud.google.com/dataflow/jobsDetail/locations/us-central1/jobs/2019-09-26_10_15_59-17696533600794835446?project=apache-beam-testing
<https://builds.apache.org/job/beam_PostCommit_Python35/ws/src/sdks/python/apache_beam/runners/dataflow/dataflow_runner.py>:695: BeamDeprecationWarning: BigQuerySink is deprecated since 2.11.0. Use WriteToBigQuery instead.
Worker logs: https://console.cloud.google.com/dataflow/jobsDetail/locations/us-central1/jobs/2019-09-26_10_27_20-4753723057006334840?project=apache-beam-testing
Worker logs: https://console.cloud.google.com/dataflow/jobsDetail/locations/us-central1/jobs/2019-09-26_10_36_45-3538579748210952741?project=apache-beam-testing
  kms_key=transform.kms_key))
Worker logs: https://console.cloud.google.com/dataflow/jobsDetail/locations/us-central1/jobs/2019-09-26_10_47_51-4872239001582126730?project=apache-beam-testing
Worker logs: https://console.cloud.google.com/dataflow/jobsDetail/locations/us-central1/jobs/2019-09-26_10_56_45-16292393193490937530?project=apache-beam-testing
Worker logs: https://console.cloud.google.com/dataflow/jobsDetail/locations/us-central1/jobs/2019-09-26_11_05_20-14255032259390320748?project=apache-beam-testing
<https://builds.apache.org/job/beam_PostCommit_Python35/ws/src/sdks/python/apache_beam/io/gcp/bigquery_test.py>:577: BeamDeprecationWarning: options is deprecated since First stable release. References to <pipeline>.options will not be supported
Worker logs: https://console.cloud.google.com/dataflow/jobsDetail/locations/us-central1/jobs/2019-09-26_10_16_00-17150478142468134671?project=apache-beam-testing
  streaming = self.test_pipeline.options.view_as(StandardOptions).streaming
Worker logs: https://console.cloud.google.com/dataflow/jobsDetail/locations/us-central1/jobs/2019-09-26_10_27_00-11034781140114085164?project=apache-beam-testing
<https://builds.apache.org/job/beam_PostCommit_Python35/ws/src/sdks/python/apache_beam/io/gcp/bigquery.py>:1145: BeamDeprecationWarning: options is deprecated since First stable release. References to <pipeline>.options will not be supported
Worker logs: https://console.cloud.google.com/dataflow/jobsDetail/locations/us-central1/jobs/2019-09-26_10_36_57-14908398162276347447?project=apache-beam-testing
  experiments = p.options.view_as(DebugOptions).experiments or []
Worker logs: https://console.cloud.google.com/dataflow/jobsDetail/locations/us-central1/jobs/2019-09-26_10_49_22-17464124218435454833?project=apache-beam-testing
Worker logs: https://console.cloud.google.com/dataflow/jobsDetail/locations/us-central1/jobs/2019-09-26_10_56_56-3737337045438577078?project=apache-beam-testing
Worker logs: https://console.cloud.google.com/dataflow/jobsDetail/locations/us-central1/jobs/2019-09-26_10_16_06-1912935894605761650?project=apache-beam-testing
<https://builds.apache.org/job/beam_PostCommit_Python35/ws/src/sdks/python/apache_beam/runners/dataflow/dataflow_runner.py>:695: BeamDeprecationWarning: BigQuerySink is deprecated since 2.11.0. Use WriteToBigQuery instead.
  kms_key=transform.kms_key))
Worker logs: https://console.cloud.google.com/dataflow/jobsDetail/locations/us-central1/jobs/2019-09-26_10_28_01-15892781896057656217?project=apache-beam-testing
Worker logs: https://console.cloud.google.com/dataflow/jobsDetail/locations/us-central1/jobs/2019-09-26_10_38_19-17396474153225731496?project=apache-beam-testing
<https://builds.apache.org/job/beam_PostCommit_Python35/ws/src/sdks/python/apache_beam/io/gcp/big_query_query_to_table_pipeline.py>:73: BeamDeprecationWarning: BigQuerySink is deprecated since 2.11.0. Use WriteToBigQuery instead.
Worker logs: https://console.cloud.google.com/dataflow/jobsDetail/locations/us-central1/jobs/2019-09-26_10_50_26-7392598893535726942?project=apache-beam-testing
  kms_key=kms_key))
Worker logs: https://console.cloud.google.com/dataflow/jobsDetail/locations/us-central1/jobs/2019-09-26_10_59_04-4491723876693044877?project=apache-beam-testing
Worker logs: https://console.cloud.google.com/dataflow/jobsDetail/locations/us-central1/jobs/2019-09-26_10_16_01-15783942949975812794?project=apache-beam-testing
<https://builds.apache.org/job/beam_PostCommit_Python35/ws/src/sdks/python/apache_beam/io/gcp/bigquery.py>:1145: BeamDeprecationWarning: options is deprecated since First stable release. References to <pipeline>.options will not be supported
Worker logs: https://console.cloud.google.com/dataflow/jobsDetail/locations/us-central1/jobs/2019-09-26_10_28_32-16622704853644945557?project=apache-beam-testing
Worker logs: https://console.cloud.google.com/dataflow/jobsDetail/locations/us-central1/jobs/2019-09-26_10_41_53-1584463594465605327?project=apache-beam-testing
  experiments = p.options.view_as(DebugOptions).experiments or []
Worker logs: https://console.cloud.google.com/dataflow/jobsDetail/locations/us-central1/jobs/2019-09-26_10_51_27-11630650180614916190?project=apache-beam-testing
<https://builds.apache.org/job/beam_PostCommit_Python35/ws/src/sdks/python/apache_beam/io/gcp/bigquery_file_loads.py>:793: BeamDeprecationWarning: options is deprecated since First stable release. References to <pipeline>.options will not be supported
Worker logs: https://console.cloud.google.com/dataflow/jobsDetail/locations/us-central1/jobs/2019-09-26_11_00_16-15742695944826736886?project=apache-beam-testing
  temp_location = p.options.view_as(GoogleCloudOptions).temp_location

----------------------------------------------------------------------
XML: nosetests-postCommitIT-df-py35.xml
----------------------------------------------------------------------
XML: <https://builds.apache.org/job/beam_PostCommit_Python35/ws/src/sdks/python/nosetests.xml>
----------------------------------------------------------------------
Ran 45 tests in 3564.935s

FAILED (SKIP=6, failures=1)

> Task :sdks:python:test-suites:dataflow:py35:postCommitIT FAILED

FAILURE: Build failed with an exception.

* Where:
Build file '<https://builds.apache.org/job/beam_PostCommit_Python35/ws/src/sdks/python/test-suites/dataflow/py35/build.gradle'> line: 56

* What went wrong:
Execution failed for task ':sdks:python:test-suites:dataflow:py35:postCommitIT'.
> Process 'command 'sh'' finished with non-zero exit value 1

* Try:
Run with --stacktrace option to get the stack trace. Run with --info or --debug option to get more log output. Run with --scan to get full insights.

* Get more help at https://help.gradle.org

Deprecated Gradle features were used in this build, making it incompatible with Gradle 6.0.
Use '--warning-mode all' to show the individual deprecation warnings.
See https://docs.gradle.org/5.2.1/userguide/command_line_interface.html#sec:command_line_warnings

BUILD FAILED in 1h 0m 39s
64 actionable tasks: 47 executed, 17 from cache

Publishing build scan...
https://gradle.com/s/q5fhaakppz7jo

Build step 'Invoke Gradle script' changed build result to FAILURE
Build step 'Invoke Gradle script' marked build as failure

---------------------------------------------------------------------
To unsubscribe, e-mail: builds-unsubscribe@beam.apache.org
For additional commands, e-mail: builds-help@beam.apache.org


Jenkins build is back to normal : beam_PostCommit_Python35 #574

Posted by Apache Jenkins Server <je...@builds.apache.org>.
See <https://builds.apache.org/job/beam_PostCommit_Python35/574/display/redirect>


---------------------------------------------------------------------
To unsubscribe, e-mail: builds-unsubscribe@beam.apache.org
For additional commands, e-mail: builds-help@beam.apache.org