You are viewing a plain text version of this content. The canonical link for it is here.
Posted to issues@nifi.apache.org by "Pierre Villard (Jira)" <ji...@apache.org> on 2026/06/02 21:48:00 UTC

[jira] [Created] (NIFI-15991) Flaky test TestFileSystemRepository.testClaimsArchivedWhenMarkedDestructable

Pierre Villard created NIFI-15991:
-------------------------------------

             Summary: Flaky test TestFileSystemRepository.testClaimsArchivedWhenMarkedDestructable
                 Key: NIFI-15991
                 URL: https://issues.apache.org/jira/browse/NIFI-15991
             Project: Apache NiFi
          Issue Type: Test
          Components: Core Framework
            Reporter: Pierre Villard
            Assignee: Pierre Villard


{code:java}
Error:  Tests run: 38, Failures: 0, Errors: 1, Skipped: 1, Time elapsed: 72.03 s <<< FAILURE! -- in org.apache.nifi.controller.repository.TestFileSystemRepository
Error:  org.apache.nifi.controller.repository.TestFileSystemRepository.testClaimsArchivedWhenMarkedDestructable -- Time elapsed: 30.45 s <<< ERROR!
java.util.concurrent.TimeoutException: testClaimsArchivedWhenMarkedDestructable() timed out after 30 seconds
	at java.base/java.util.ArrayList.forEach(ArrayList.java:1596)
	at java.base/java.util.ArrayList.forEach(ArrayList.java:1596)
	Suppressed: java.lang.InterruptedException: sleep interrupted
		at java.base/java.lang.Thread.sleep0(Native Method)
		at java.base/java.lang.Thread.sleep(Thread.java:509)
		at org.apache.nifi.controller.repository.TestFileSystemRepository.testClaimsArchivedWhenMarkedDestructable(TestFileSystemRepository.java:178) {code}



--
This message was sent by Atlassian Jira
(v8.20.10#820010)