You are viewing a plain text version of this content. The canonical link for it is here.
Posted to dev@lucene.apache.org by Policeman Jenkins Server <je...@thetaphi.de> on 2017/10/14 13:20:49 UTC
[JENKINS] Lucene-Solr-master-MacOSX (64bit/jdk1.8.0) - Build # 4225
- Still unstable!
Build: https://jenkins.thetaphi.de/job/Lucene-Solr-master-MacOSX/4225/
Java: 64bit/jdk1.8.0 -XX:+UseCompressedOops -XX:+UseParallelGC
78 tests failed.
FAILED: junit.framework.TestSuite.org.apache.solr.BasicFunctionalityTest
Error Message:
org.apache.solr.BasicFunctionalityTest
Stack Trace:
java.lang.ClassNotFoundException: org.apache.solr.BasicFunctionalityTest
at java.net.URLClassLoader$1.run(URLClassLoader.java:370)
at java.net.URLClassLoader$1.run(URLClassLoader.java:362)
at java.security.AccessController.doPrivileged(Native Method)
at java.net.URLClassLoader.findClass(URLClassLoader.java:361)
at java.lang.ClassLoader.loadClass(ClassLoader.java:424)
at sun.misc.Launcher$AppClassLoader.loadClass(Launcher.java:335)
at java.lang.ClassLoader.loadClass(ClassLoader.java:357)
at java.lang.Class.forName0(Native Method)
at java.lang.Class.forName(Class.java:348)
at com.carrotsearch.ant.tasks.junit4.slave.SlaveMain.instantiate(SlaveMain.java:280)
at com.carrotsearch.ant.tasks.junit4.slave.SlaveMain.execute(SlaveMain.java:240)
at com.carrotsearch.ant.tasks.junit4.slave.SlaveMain.main(SlaveMain.java:368)
at com.carrotsearch.ant.tasks.junit4.slave.SlaveMainSafe.main(SlaveMainSafe.java:13)
Caused by: java.io.FileNotFoundException: /Users/jenkins/workspace/Lucene-Solr-master-MacOSX/solr/build/solr-core/classes/test/org/apache/solr/BasicFunctionalityTest.class (Too many open files)
at java.io.FileInputStream.open0(Native Method)
at java.io.FileInputStream.open(FileInputStream.java:195)
at java.io.FileInputStream.<init>(FileInputStream.java:138)
at sun.misc.URLClassPath$FileLoader$1.getInputStream(URLClassPath.java:1288)
at sun.misc.Resource.cachedInputStream(Resource.java:77)
at sun.misc.Resource.getByteBuffer(Resource.java:160)
at java.net.URLClassLoader.defineClass(URLClassLoader.java:454)
at java.net.URLClassLoader.access$100(URLClassLoader.java:73)
at java.net.URLClassLoader$1.run(URLClassLoader.java:368)
... 12 more
FAILED: junit.framework.TestSuite.org.apache.solr.cloud.BasicDistributedZk2Test
Error Message:
org.apache.solr.cloud.BasicDistributedZk2Test
Stack Trace:
java.lang.ClassNotFoundException: org.apache.solr.cloud.BasicDistributedZk2Test
at java.net.URLClassLoader$1.run(URLClassLoader.java:370)
at java.net.URLClassLoader$1.run(URLClassLoader.java:362)
at java.security.AccessController.doPrivileged(Native Method)
at java.net.URLClassLoader.findClass(URLClassLoader.java:361)
at java.lang.ClassLoader.loadClass(ClassLoader.java:424)
at sun.misc.Launcher$AppClassLoader.loadClass(Launcher.java:335)
at java.lang.ClassLoader.loadClass(ClassLoader.java:357)
at java.lang.Class.forName0(Native Method)
at java.lang.Class.forName(Class.java:348)
at com.carrotsearch.ant.tasks.junit4.slave.SlaveMain.instantiate(SlaveMain.java:280)
at com.carrotsearch.ant.tasks.junit4.slave.SlaveMain.execute(SlaveMain.java:240)
at com.carrotsearch.ant.tasks.junit4.slave.SlaveMain.main(SlaveMain.java:368)
at com.carrotsearch.ant.tasks.junit4.slave.SlaveMainSafe.main(SlaveMainSafe.java:13)
Caused by: java.io.FileNotFoundException: /Users/jenkins/workspace/Lucene-Solr-master-MacOSX/solr/build/solr-core/classes/test/org/apache/solr/cloud/BasicDistributedZk2Test.class (Too many open files)
at java.io.FileInputStream.open0(Native Method)
at java.io.FileInputStream.open(FileInputStream.java:195)
at java.io.FileInputStream.<init>(FileInputStream.java:138)
at sun.misc.URLClassPath$FileLoader$1.getInputStream(URLClassPath.java:1288)
at sun.misc.Resource.cachedInputStream(Resource.java:77)
at sun.misc.Resource.getByteBuffer(Resource.java:160)
at java.net.URLClassLoader.defineClass(URLClassLoader.java:454)
at java.net.URLClassLoader.access$100(URLClassLoader.java:73)
at java.net.URLClassLoader$1.run(URLClassLoader.java:368)
... 12 more
FAILED: junit.framework.TestSuite.org.apache.solr.cloud.CdcrBootstrapTest
Error Message:
org.apache.solr.cloud.CdcrBootstrapTest
Stack Trace:
java.lang.ClassNotFoundException: org.apache.solr.cloud.CdcrBootstrapTest
at java.net.URLClassLoader$1.run(URLClassLoader.java:370)
at java.net.URLClassLoader$1.run(URLClassLoader.java:362)
at java.security.AccessController.doPrivileged(Native Method)
at java.net.URLClassLoader.findClass(URLClassLoader.java:361)
at java.lang.ClassLoader.loadClass(ClassLoader.java:424)
at sun.misc.Launcher$AppClassLoader.loadClass(Launcher.java:335)
at java.lang.ClassLoader.loadClass(ClassLoader.java:357)
at java.lang.Class.forName0(Native Method)
at java.lang.Class.forName(Class.java:348)
at com.carrotsearch.ant.tasks.junit4.slave.SlaveMain.instantiate(SlaveMain.java:280)
at com.carrotsearch.ant.tasks.junit4.slave.SlaveMain.execute(SlaveMain.java:240)
at com.carrotsearch.ant.tasks.junit4.slave.SlaveMain.main(SlaveMain.java:368)
at com.carrotsearch.ant.tasks.junit4.slave.SlaveMainSafe.main(SlaveMainSafe.java:13)
Caused by: java.io.FileNotFoundException: /Users/jenkins/workspace/Lucene-Solr-master-MacOSX/solr/build/solr-core/classes/test/org/apache/solr/cloud/CdcrBootstrapTest.class (Too many open files)
at java.io.FileInputStream.open0(Native Method)
at java.io.FileInputStream.open(FileInputStream.java:195)
at java.io.FileInputStream.<init>(FileInputStream.java:138)
at sun.misc.URLClassPath$FileLoader$1.getInputStream(URLClassPath.java:1288)
at sun.misc.Resource.cachedInputStream(Resource.java:77)
at sun.misc.Resource.getByteBuffer(Resource.java:160)
at java.net.URLClassLoader.defineClass(URLClassLoader.java:454)
at java.net.URLClassLoader.access$100(URLClassLoader.java:73)
at java.net.URLClassLoader$1.run(URLClassLoader.java:368)
... 12 more
FAILED: junit.framework.TestSuite.org.apache.solr.cloud.CdcrReplicationHandlerTest
Error Message:
org.apache.solr.cloud.CdcrReplicationHandlerTest
Stack Trace:
java.lang.ClassNotFoundException: org.apache.solr.cloud.CdcrReplicationHandlerTest
at java.net.URLClassLoader$1.run(URLClassLoader.java:370)
at java.net.URLClassLoader$1.run(URLClassLoader.java:362)
at java.security.AccessController.doPrivileged(Native Method)
at java.net.URLClassLoader.findClass(URLClassLoader.java:361)
at java.lang.ClassLoader.loadClass(ClassLoader.java:424)
at sun.misc.Launcher$AppClassLoader.loadClass(Launcher.java:335)
at java.lang.ClassLoader.loadClass(ClassLoader.java:357)
at java.lang.Class.forName0(Native Method)
at java.lang.Class.forName(Class.java:348)
at com.carrotsearch.ant.tasks.junit4.slave.SlaveMain.instantiate(SlaveMain.java:280)
at com.carrotsearch.ant.tasks.junit4.slave.SlaveMain.execute(SlaveMain.java:240)
at com.carrotsearch.ant.tasks.junit4.slave.SlaveMain.main(SlaveMain.java:368)
at com.carrotsearch.ant.tasks.junit4.slave.SlaveMainSafe.main(SlaveMainSafe.java:13)
Caused by: java.io.FileNotFoundException: /Users/jenkins/workspace/Lucene-Solr-master-MacOSX/solr/build/solr-core/classes/test/org/apache/solr/cloud/CdcrReplicationHandlerTest.class (Too many open files)
at java.io.FileInputStream.open0(Native Method)
at java.io.FileInputStream.open(FileInputStream.java:195)
at java.io.FileInputStream.<init>(FileInputStream.java:138)
at sun.misc.URLClassPath$FileLoader$1.getInputStream(URLClassPath.java:1288)
at sun.misc.Resource.cachedInputStream(Resource.java:77)
at sun.misc.Resource.getByteBuffer(Resource.java:160)
at java.net.URLClassLoader.defineClass(URLClassLoader.java:454)
at java.net.URLClassLoader.access$100(URLClassLoader.java:73)
at java.net.URLClassLoader$1.run(URLClassLoader.java:368)
... 12 more
FAILED: junit.framework.TestSuite.org.apache.solr.cloud.ChaosMonkeySafeLeaderWithPullReplicasTest
Error Message:
org.apache.solr.cloud.ChaosMonkeySafeLeaderWithPullReplicasTest
Stack Trace:
java.lang.ClassNotFoundException: org.apache.solr.cloud.ChaosMonkeySafeLeaderWithPullReplicasTest
at java.net.URLClassLoader$1.run(URLClassLoader.java:370)
at java.net.URLClassLoader$1.run(URLClassLoader.java:362)
at java.security.AccessController.doPrivileged(Native Method)
at java.net.URLClassLoader.findClass(URLClassLoader.java:361)
at java.lang.ClassLoader.loadClass(ClassLoader.java:424)
at sun.misc.Launcher$AppClassLoader.loadClass(Launcher.java:335)
at java.lang.ClassLoader.loadClass(ClassLoader.java:357)
at java.lang.Class.forName0(Native Method)
at java.lang.Class.forName(Class.java:348)
at com.carrotsearch.ant.tasks.junit4.slave.SlaveMain.instantiate(SlaveMain.java:280)
at com.carrotsearch.ant.tasks.junit4.slave.SlaveMain.execute(SlaveMain.java:240)
at com.carrotsearch.ant.tasks.junit4.slave.SlaveMain.main(SlaveMain.java:368)
at com.carrotsearch.ant.tasks.junit4.slave.SlaveMainSafe.main(SlaveMainSafe.java:13)
Caused by: java.io.FileNotFoundException: /Users/jenkins/workspace/Lucene-Solr-master-MacOSX/solr/build/solr-core/classes/test/org/apache/solr/cloud/ChaosMonkeySafeLeaderWithPullReplicasTest.class (Too many open files)
at java.io.FileInputStream.open0(Native Method)
at java.io.FileInputStream.open(FileInputStream.java:195)
at java.io.FileInputStream.<init>(FileInputStream.java:138)
at sun.misc.URLClassPath$FileLoader$1.getInputStream(URLClassPath.java:1288)
at sun.misc.Resource.cachedInputStream(Resource.java:77)
at sun.misc.Resource.getByteBuffer(Resource.java:160)
at java.net.URLClassLoader.defineClass(URLClassLoader.java:454)
at java.net.URLClassLoader.access$100(URLClassLoader.java:73)
at java.net.URLClassLoader$1.run(URLClassLoader.java:368)
... 12 more
FAILED: junit.framework.TestSuite.org.apache.solr.cloud.CollectionReloadTest
Error Message:
org.apache.solr.cloud.CollectionReloadTest
Stack Trace:
java.lang.ClassNotFoundException: org.apache.solr.cloud.CollectionReloadTest
at java.net.URLClassLoader$1.run(URLClassLoader.java:370)
at java.net.URLClassLoader$1.run(URLClassLoader.java:362)
at java.security.AccessController.doPrivileged(Native Method)
at java.net.URLClassLoader.findClass(URLClassLoader.java:361)
at java.lang.ClassLoader.loadClass(ClassLoader.java:424)
at sun.misc.Launcher$AppClassLoader.loadClass(Launcher.java:335)
at java.lang.ClassLoader.loadClass(ClassLoader.java:357)
at java.lang.Class.forName0(Native Method)
at java.lang.Class.forName(Class.java:348)
at com.carrotsearch.ant.tasks.junit4.slave.SlaveMain.instantiate(SlaveMain.java:280)
at com.carrotsearch.ant.tasks.junit4.slave.SlaveMain.execute(SlaveMain.java:240)
at com.carrotsearch.ant.tasks.junit4.slave.SlaveMain.main(SlaveMain.java:368)
at com.carrotsearch.ant.tasks.junit4.slave.SlaveMainSafe.main(SlaveMainSafe.java:13)
Caused by: java.io.FileNotFoundException: /Users/jenkins/workspace/Lucene-Solr-master-MacOSX/solr/build/solr-core/classes/test/org/apache/solr/cloud/CollectionReloadTest.class (Too many open files)
at java.io.FileInputStream.open0(Native Method)
at java.io.FileInputStream.open(FileInputStream.java:195)
at java.io.FileInputStream.<init>(FileInputStream.java:138)
at sun.misc.URLClassPath$FileLoader$1.getInputStream(URLClassPath.java:1288)
at sun.misc.Resource.cachedInputStream(Resource.java:77)
at sun.misc.Resource.getByteBuffer(Resource.java:160)
at java.net.URLClassLoader.defineClass(URLClassLoader.java:454)
at java.net.URLClassLoader.access$100(URLClassLoader.java:73)
at java.net.URLClassLoader$1.run(URLClassLoader.java:368)
... 12 more
FAILED: junit.framework.TestSuite.org.apache.solr.cloud.CollectionsAPIDistributedZkTest
Error Message:
org.apache.solr.cloud.CollectionsAPIDistributedZkTest
Stack Trace:
java.lang.ClassNotFoundException: org.apache.solr.cloud.CollectionsAPIDistributedZkTest
at java.net.URLClassLoader$1.run(URLClassLoader.java:370)
at java.net.URLClassLoader$1.run(URLClassLoader.java:362)
at java.security.AccessController.doPrivileged(Native Method)
at java.net.URLClassLoader.findClass(URLClassLoader.java:361)
at java.lang.ClassLoader.loadClass(ClassLoader.java:424)
at sun.misc.Launcher$AppClassLoader.loadClass(Launcher.java:335)
at java.lang.ClassLoader.loadClass(ClassLoader.java:357)
at java.lang.Class.forName0(Native Method)
at java.lang.Class.forName(Class.java:348)
at com.carrotsearch.ant.tasks.junit4.slave.SlaveMain.instantiate(SlaveMain.java:280)
at com.carrotsearch.ant.tasks.junit4.slave.SlaveMain.execute(SlaveMain.java:240)
at com.carrotsearch.ant.tasks.junit4.slave.SlaveMain.main(SlaveMain.java:368)
at com.carrotsearch.ant.tasks.junit4.slave.SlaveMainSafe.main(SlaveMainSafe.java:13)
Caused by: java.io.FileNotFoundException: /Users/jenkins/workspace/Lucene-Solr-master-MacOSX/solr/build/solr-core/classes/test/org/apache/solr/cloud/CollectionsAPIDistributedZkTest.class (Too many open files)
at java.io.FileInputStream.open0(Native Method)
at java.io.FileInputStream.open(FileInputStream.java:195)
at java.io.FileInputStream.<init>(FileInputStream.java:138)
at sun.misc.URLClassPath$FileLoader$1.getInputStream(URLClassPath.java:1288)
at sun.misc.Resource.cachedInputStream(Resource.java:77)
at sun.misc.Resource.getByteBuffer(Resource.java:160)
at java.net.URLClassLoader.defineClass(URLClassLoader.java:454)
at java.net.URLClassLoader.access$100(URLClassLoader.java:73)
at java.net.URLClassLoader$1.run(URLClassLoader.java:368)
... 12 more
FAILED: junit.framework.TestSuite.org.apache.solr.cloud.DeleteShardTest
Error Message:
org.apache.solr.cloud.DeleteShardTest
Stack Trace:
java.lang.ClassNotFoundException: org.apache.solr.cloud.DeleteShardTest
at java.net.URLClassLoader$1.run(URLClassLoader.java:370)
at java.net.URLClassLoader$1.run(URLClassLoader.java:362)
at java.security.AccessController.doPrivileged(Native Method)
at java.net.URLClassLoader.findClass(URLClassLoader.java:361)
at java.lang.ClassLoader.loadClass(ClassLoader.java:424)
at sun.misc.Launcher$AppClassLoader.loadClass(Launcher.java:335)
at java.lang.ClassLoader.loadClass(ClassLoader.java:357)
at java.lang.Class.forName0(Native Method)
at java.lang.Class.forName(Class.java:348)
at com.carrotsearch.ant.tasks.junit4.slave.SlaveMain.instantiate(SlaveMain.java:280)
at com.carrotsearch.ant.tasks.junit4.slave.SlaveMain.execute(SlaveMain.java:240)
at com.carrotsearch.ant.tasks.junit4.slave.SlaveMain.main(SlaveMain.java:368)
at com.carrotsearch.ant.tasks.junit4.slave.SlaveMainSafe.main(SlaveMainSafe.java:13)
Caused by: java.io.FileNotFoundException: /Users/jenkins/workspace/Lucene-Solr-master-MacOSX/solr/build/solr-core/classes/test/org/apache/solr/cloud/DeleteShardTest.class (Too many open files)
at java.io.FileInputStream.open0(Native Method)
at java.io.FileInputStream.open(FileInputStream.java:195)
at java.io.FileInputStream.<init>(FileInputStream.java:138)
at sun.misc.URLClassPath$FileLoader$1.getInputStream(URLClassPath.java:1288)
at sun.misc.Resource.cachedInputStream(Resource.java:77)
at sun.misc.Resource.getByteBuffer(Resource.java:160)
at java.net.URLClassLoader.defineClass(URLClassLoader.java:454)
at java.net.URLClassLoader.access$100(URLClassLoader.java:73)
at java.net.URLClassLoader$1.run(URLClassLoader.java:368)
... 12 more
FAILED: junit.framework.TestSuite.org.apache.solr.cloud.MoveReplicaTest
Error Message:
org.apache.solr.cloud.MoveReplicaTest
Stack Trace:
java.lang.ClassNotFoundException: org.apache.solr.cloud.MoveReplicaTest
at java.net.URLClassLoader$1.run(URLClassLoader.java:370)
at java.net.URLClassLoader$1.run(URLClassLoader.java:362)
at java.security.AccessController.doPrivileged(Native Method)
at java.net.URLClassLoader.findClass(URLClassLoader.java:361)
at java.lang.ClassLoader.loadClass(ClassLoader.java:424)
at sun.misc.Launcher$AppClassLoader.loadClass(Launcher.java:335)
at java.lang.ClassLoader.loadClass(ClassLoader.java:357)
at java.lang.Class.forName0(Native Method)
at java.lang.Class.forName(Class.java:348)
at com.carrotsearch.ant.tasks.junit4.slave.SlaveMain.instantiate(SlaveMain.java:280)
at com.carrotsearch.ant.tasks.junit4.slave.SlaveMain.execute(SlaveMain.java:240)
at com.carrotsearch.ant.tasks.junit4.slave.SlaveMain.main(SlaveMain.java:368)
at com.carrotsearch.ant.tasks.junit4.slave.SlaveMainSafe.main(SlaveMainSafe.java:13)
Caused by: java.io.FileNotFoundException: /Users/jenkins/workspace/Lucene-Solr-master-MacOSX/solr/build/solr-core/classes/test/org/apache/solr/cloud/MoveReplicaTest.class (Too many open files)
at java.io.FileInputStream.open0(Native Method)
at java.io.FileInputStream.open(FileInputStream.java:195)
at java.io.FileInputStream.<init>(FileInputStream.java:138)
at sun.misc.URLClassPath$FileLoader$1.getInputStream(URLClassPath.java:1288)
at sun.misc.Resource.cachedInputStream(Resource.java:77)
at sun.misc.Resource.getByteBuffer(Resource.java:160)
at java.net.URLClassLoader.defineClass(URLClassLoader.java:454)
at java.net.URLClassLoader.access$100(URLClassLoader.java:73)
at java.net.URLClassLoader$1.run(URLClassLoader.java:368)
... 12 more
FAILED: junit.framework.TestSuite.org.apache.solr.cloud.OverseerModifyCollectionTest
Error Message:
org.apache.solr.cloud.OverseerModifyCollectionTest
Stack Trace:
java.lang.ClassNotFoundException: org.apache.solr.cloud.OverseerModifyCollectionTest
at java.net.URLClassLoader$1.run(URLClassLoader.java:370)
at java.net.URLClassLoader$1.run(URLClassLoader.java:362)
at java.security.AccessController.doPrivileged(Native Method)
at java.net.URLClassLoader.findClass(URLClassLoader.java:361)
at java.lang.ClassLoader.loadClass(ClassLoader.java:424)
at sun.misc.Launcher$AppClassLoader.loadClass(Launcher.java:335)
at java.lang.ClassLoader.loadClass(ClassLoader.java:357)
at java.lang.Class.forName0(Native Method)
at java.lang.Class.forName(Class.java:348)
at com.carrotsearch.ant.tasks.junit4.slave.SlaveMain.instantiate(SlaveMain.java:280)
at com.carrotsearch.ant.tasks.junit4.slave.SlaveMain.execute(SlaveMain.java:240)
at com.carrotsearch.ant.tasks.junit4.slave.SlaveMain.main(SlaveMain.java:368)
at com.carrotsearch.ant.tasks.junit4.slave.SlaveMainSafe.main(SlaveMainSafe.java:13)
Caused by: java.io.FileNotFoundException: /Users/jenkins/workspace/Lucene-Solr-master-MacOSX/solr/build/solr-core/classes/test/org/apache/solr/cloud/OverseerModifyCollectionTest.class (Too many open files)
at java.io.FileInputStream.open0(Native Method)
at java.io.FileInputStream.open(FileInputStream.java:195)
at java.io.FileInputStream.<init>(FileInputStream.java:138)
at sun.misc.URLClassPath$FileLoader$1.getInputStream(URLClassPath.java:1288)
at sun.misc.Resource.cachedInputStream(Resource.java:77)
at sun.misc.Resource.getByteBuffer(Resource.java:160)
at java.net.URLClassLoader.defineClass(URLClassLoader.java:454)
at java.net.URLClassLoader.access$100(URLClassLoader.java:73)
at java.net.URLClassLoader$1.run(URLClassLoader.java:368)
... 12 more
FAILED: junit.framework.TestSuite.org.apache.solr.cloud.ReplicationFactorTest
Error Message:
org.apache.solr.cloud.ReplicationFactorTest
Stack Trace:
java.lang.ClassNotFoundException: org.apache.solr.cloud.ReplicationFactorTest
at java.net.URLClassLoader$1.run(URLClassLoader.java:370)
at java.net.URLClassLoader$1.run(URLClassLoader.java:362)
at java.security.AccessController.doPrivileged(Native Method)
at java.net.URLClassLoader.findClass(URLClassLoader.java:361)
at java.lang.ClassLoader.loadClass(ClassLoader.java:424)
at sun.misc.Launcher$AppClassLoader.loadClass(Launcher.java:335)
at java.lang.ClassLoader.loadClass(ClassLoader.java:357)
at java.lang.Class.forName0(Native Method)
at java.lang.Class.forName(Class.java:348)
at com.carrotsearch.ant.tasks.junit4.slave.SlaveMain.instantiate(SlaveMain.java:280)
at com.carrotsearch.ant.tasks.junit4.slave.SlaveMain.execute(SlaveMain.java:240)
at com.carrotsearch.ant.tasks.junit4.slave.SlaveMain.main(SlaveMain.java:368)
at com.carrotsearch.ant.tasks.junit4.slave.SlaveMainSafe.main(SlaveMainSafe.java:13)
Caused by: java.io.FileNotFoundException: /Users/jenkins/workspace/Lucene-Solr-master-MacOSX/solr/build/solr-core/classes/test/org/apache/solr/cloud/ReplicationFactorTest.class (Too many open files)
at java.io.FileInputStream.open0(Native Method)
at java.io.FileInputStream.open(FileInputStream.java:195)
at java.io.FileInputStream.<init>(FileInputStream.java:138)
at sun.misc.URLClassPath$FileLoader$1.getInputStream(URLClassPath.java:1288)
at sun.misc.Resource.cachedInputStream(Resource.java:77)
at sun.misc.Resource.getByteBuffer(Resource.java:160)
at java.net.URLClassLoader.defineClass(URLClassLoader.java:454)
at java.net.URLClassLoader.access$100(URLClassLoader.java:73)
at java.net.URLClassLoader$1.run(URLClassLoader.java:368)
... 12 more
FAILED: junit.framework.TestSuite.org.apache.solr.cloud.SaslZkACLProviderTest
Error Message:
org.apache.solr.cloud.SaslZkACLProviderTest
Stack Trace:
java.lang.ClassNotFoundException: org.apache.solr.cloud.SaslZkACLProviderTest
at java.net.URLClassLoader$1.run(URLClassLoader.java:370)
at java.net.URLClassLoader$1.run(URLClassLoader.java:362)
at java.security.AccessController.doPrivileged(Native Method)
at java.net.URLClassLoader.findClass(URLClassLoader.java:361)
at java.lang.ClassLoader.loadClass(ClassLoader.java:424)
at sun.misc.Launcher$AppClassLoader.loadClass(Launcher.java:335)
at java.lang.ClassLoader.loadClass(ClassLoader.java:357)
at java.lang.Class.forName0(Native Method)
at java.lang.Class.forName(Class.java:348)
at com.carrotsearch.ant.tasks.junit4.slave.SlaveMain.instantiate(SlaveMain.java:280)
at com.carrotsearch.ant.tasks.junit4.slave.SlaveMain.execute(SlaveMain.java:240)
at com.carrotsearch.ant.tasks.junit4.slave.SlaveMain.main(SlaveMain.java:368)
at com.carrotsearch.ant.tasks.junit4.slave.SlaveMainSafe.main(SlaveMainSafe.java:13)
Caused by: java.io.FileNotFoundException: /Users/jenkins/workspace/Lucene-Solr-master-MacOSX/solr/build/solr-core/classes/test/org/apache/solr/cloud/SaslZkACLProviderTest.class (Too many open files)
at java.io.FileInputStream.open0(Native Method)
at java.io.FileInputStream.open(FileInputStream.java:195)
at java.io.FileInputStream.<init>(FileInputStream.java:138)
at sun.misc.URLClassPath$FileLoader$1.getInputStream(URLClassPath.java:1288)
at sun.misc.Resource.cachedInputStream(Resource.java:77)
at sun.misc.Resource.getByteBuffer(Resource.java:160)
at java.net.URLClassLoader.defineClass(URLClassLoader.java:454)
at java.net.URLClassLoader.access$100(URLClassLoader.java:73)
at java.net.URLClassLoader$1.run(URLClassLoader.java:368)
... 12 more
FAILED: junit.framework.TestSuite.org.apache.solr.cloud.SharedFSAutoReplicaFailoverTest
Error Message:
org.apache.solr.cloud.SharedFSAutoReplicaFailoverTest
Stack Trace:
java.lang.ClassNotFoundException: org.apache.solr.cloud.SharedFSAutoReplicaFailoverTest
at java.net.URLClassLoader$1.run(URLClassLoader.java:370)
at java.net.URLClassLoader$1.run(URLClassLoader.java:362)
at java.security.AccessController.doPrivileged(Native Method)
at java.net.URLClassLoader.findClass(URLClassLoader.java:361)
at java.lang.ClassLoader.loadClass(ClassLoader.java:424)
at sun.misc.Launcher$AppClassLoader.loadClass(Launcher.java:335)
at java.lang.ClassLoader.loadClass(ClassLoader.java:357)
at java.lang.Class.forName0(Native Method)
at java.lang.Class.forName(Class.java:348)
at com.carrotsearch.ant.tasks.junit4.slave.SlaveMain.instantiate(SlaveMain.java:280)
at com.carrotsearch.ant.tasks.junit4.slave.SlaveMain.execute(SlaveMain.java:240)
at com.carrotsearch.ant.tasks.junit4.slave.SlaveMain.main(SlaveMain.java:368)
at com.carrotsearch.ant.tasks.junit4.slave.SlaveMainSafe.main(SlaveMainSafe.java:13)
Caused by: java.io.FileNotFoundException: /Users/jenkins/workspace/Lucene-Solr-master-MacOSX/solr/build/solr-core/classes/test/org/apache/solr/cloud/SharedFSAutoReplicaFailoverTest.class (Too many open files)
at java.io.FileInputStream.open0(Native Method)
at java.io.FileInputStream.open(FileInputStream.java:195)
at java.io.FileInputStream.<init>(FileInputStream.java:138)
at sun.misc.URLClassPath$FileLoader$1.getInputStream(URLClassPath.java:1288)
at sun.misc.Resource.cachedInputStream(Resource.java:77)
at sun.misc.Resource.getByteBuffer(Resource.java:160)
at java.net.URLClassLoader.defineClass(URLClassLoader.java:454)
at java.net.URLClassLoader.access$100(URLClassLoader.java:73)
at java.net.URLClassLoader$1.run(URLClassLoader.java:368)
... 12 more
FAILED: junit.framework.TestSuite.org.apache.solr.cloud.TestCloudPseudoReturnFields
Error Message:
org.apache.solr.cloud.TestCloudPseudoReturnFields
Stack Trace:
java.lang.ClassNotFoundException: org.apache.solr.cloud.TestCloudPseudoReturnFields
at java.net.URLClassLoader$1.run(URLClassLoader.java:370)
at java.net.URLClassLoader$1.run(URLClassLoader.java:362)
at java.security.AccessController.doPrivileged(Native Method)
at java.net.URLClassLoader.findClass(URLClassLoader.java:361)
at java.lang.ClassLoader.loadClass(ClassLoader.java:424)
at sun.misc.Launcher$AppClassLoader.loadClass(Launcher.java:335)
at java.lang.ClassLoader.loadClass(ClassLoader.java:357)
at java.lang.Class.forName0(Native Method)
at java.lang.Class.forName(Class.java:348)
at com.carrotsearch.ant.tasks.junit4.slave.SlaveMain.instantiate(SlaveMain.java:280)
at com.carrotsearch.ant.tasks.junit4.slave.SlaveMain.execute(SlaveMain.java:240)
at com.carrotsearch.ant.tasks.junit4.slave.SlaveMain.main(SlaveMain.java:368)
at com.carrotsearch.ant.tasks.junit4.slave.SlaveMainSafe.main(SlaveMainSafe.java:13)
Caused by: java.io.FileNotFoundException: /Users/jenkins/workspace/Lucene-Solr-master-MacOSX/solr/build/solr-core/classes/test/org/apache/solr/cloud/TestCloudPseudoReturnFields.class (Too many open files)
at java.io.FileInputStream.open0(Native Method)
at java.io.FileInputStream.open(FileInputStream.java:195)
at java.io.FileInputStream.<init>(FileInputStream.java:138)
at sun.misc.URLClassPath$FileLoader$1.getInputStream(URLClassPath.java:1288)
at sun.misc.Resource.cachedInputStream(Resource.java:77)
at sun.misc.Resource.getByteBuffer(Resource.java:160)
at java.net.URLClassLoader.defineClass(URLClassLoader.java:454)
at java.net.URLClassLoader.access$100(URLClassLoader.java:73)
at java.net.URLClassLoader$1.run(URLClassLoader.java:368)
... 12 more
FAILED: junit.framework.TestSuite.org.apache.solr.cloud.TestHdfsCloudBackupRestore
Error Message:
org.apache.solr.cloud.TestHdfsCloudBackupRestore
Stack Trace:
java.lang.ClassNotFoundException: org.apache.solr.cloud.TestHdfsCloudBackupRestore
at java.net.URLClassLoader$1.run(URLClassLoader.java:370)
at java.net.URLClassLoader$1.run(URLClassLoader.java:362)
at java.security.AccessController.doPrivileged(Native Method)
at java.net.URLClassLoader.findClass(URLClassLoader.java:361)
at java.lang.ClassLoader.loadClass(ClassLoader.java:424)
at sun.misc.Launcher$AppClassLoader.loadClass(Launcher.java:335)
at java.lang.ClassLoader.loadClass(ClassLoader.java:357)
at java.lang.Class.forName0(Native Method)
at java.lang.Class.forName(Class.java:348)
at com.carrotsearch.ant.tasks.junit4.slave.SlaveMain.instantiate(SlaveMain.java:280)
at com.carrotsearch.ant.tasks.junit4.slave.SlaveMain.execute(SlaveMain.java:240)
at com.carrotsearch.ant.tasks.junit4.slave.SlaveMain.main(SlaveMain.java:368)
at com.carrotsearch.ant.tasks.junit4.slave.SlaveMainSafe.main(SlaveMainSafe.java:13)
Caused by: java.io.FileNotFoundException: /Users/jenkins/workspace/Lucene-Solr-master-MacOSX/solr/build/solr-core/classes/test/org/apache/solr/cloud/TestHdfsCloudBackupRestore.class (Too many open files)
at java.io.FileInputStream.open0(Native Method)
at java.io.FileInputStream.open(FileInputStream.java:195)
at java.io.FileInputStream.<init>(FileInputStream.java:138)
at sun.misc.URLClassPath$FileLoader$1.getInputStream(URLClassPath.java:1288)
at sun.misc.Resource.cachedInputStream(Resource.java:77)
at sun.misc.Resource.getByteBuffer(Resource.java:160)
at java.net.URLClassLoader.defineClass(URLClassLoader.java:454)
at java.net.URLClassLoader.access$100(URLClassLoader.java:73)
at java.net.URLClassLoader$1.run(URLClassLoader.java:368)
... 12 more
FAILED: junit.framework.TestSuite.org.apache.solr.cloud.TestRandomRequestDistribution
Error Message:
org.apache.solr.cloud.TestRandomRequestDistribution
Stack Trace:
java.lang.ClassNotFoundException: org.apache.solr.cloud.TestRandomRequestDistribution
at java.net.URLClassLoader$1.run(URLClassLoader.java:370)
at java.net.URLClassLoader$1.run(URLClassLoader.java:362)
at java.security.AccessController.doPrivileged(Native Method)
at java.net.URLClassLoader.findClass(URLClassLoader.java:361)
at java.lang.ClassLoader.loadClass(ClassLoader.java:424)
at sun.misc.Launcher$AppClassLoader.loadClass(Launcher.java:335)
at java.lang.ClassLoader.loadClass(ClassLoader.java:357)
at java.lang.Class.forName0(Native Method)
at java.lang.Class.forName(Class.java:348)
at com.carrotsearch.ant.tasks.junit4.slave.SlaveMain.instantiate(SlaveMain.java:280)
at com.carrotsearch.ant.tasks.junit4.slave.SlaveMain.execute(SlaveMain.java:240)
at com.carrotsearch.ant.tasks.junit4.slave.SlaveMain.main(SlaveMain.java:368)
at com.carrotsearch.ant.tasks.junit4.slave.SlaveMainSafe.main(SlaveMainSafe.java:13)
Caused by: java.io.FileNotFoundException: /Users/jenkins/workspace/Lucene-Solr-master-MacOSX/solr/build/solr-core/classes/test/org/apache/solr/cloud/TestRandomRequestDistribution.class (Too many open files)
at java.io.FileInputStream.open0(Native Method)
at java.io.FileInputStream.open(FileInputStream.java:195)
at java.io.FileInputStream.<init>(FileInputStream.java:138)
at sun.misc.URLClassPath$FileLoader$1.getInputStream(URLClassPath.java:1288)
at sun.misc.Resource.cachedInputStream(Resource.java:77)
at sun.misc.Resource.getByteBuffer(Resource.java:160)
at java.net.URLClassLoader.defineClass(URLClassLoader.java:454)
at java.net.URLClassLoader.access$100(URLClassLoader.java:73)
at java.net.URLClassLoader$1.run(URLClassLoader.java:368)
... 12 more
FAILED: junit.framework.TestSuite.org.apache.solr.cloud.TestSegmentSorting
Error Message:
org.apache.solr.cloud.TestSegmentSorting
Stack Trace:
java.lang.ClassNotFoundException: org.apache.solr.cloud.TestSegmentSorting
at java.net.URLClassLoader$1.run(URLClassLoader.java:370)
at java.net.URLClassLoader$1.run(URLClassLoader.java:362)
at java.security.AccessController.doPrivileged(Native Method)
at java.net.URLClassLoader.findClass(URLClassLoader.java:361)
at java.lang.ClassLoader.loadClass(ClassLoader.java:424)
at sun.misc.Launcher$AppClassLoader.loadClass(Launcher.java:335)
at java.lang.ClassLoader.loadClass(ClassLoader.java:357)
at java.lang.Class.forName0(Native Method)
at java.lang.Class.forName(Class.java:348)
at com.carrotsearch.ant.tasks.junit4.slave.SlaveMain.instantiate(SlaveMain.java:280)
at com.carrotsearch.ant.tasks.junit4.slave.SlaveMain.execute(SlaveMain.java:240)
at com.carrotsearch.ant.tasks.junit4.slave.SlaveMain.main(SlaveMain.java:368)
at com.carrotsearch.ant.tasks.junit4.slave.SlaveMainSafe.main(SlaveMainSafe.java:13)
Caused by: java.io.FileNotFoundException: /Users/jenkins/workspace/Lucene-Solr-master-MacOSX/solr/build/solr-core/classes/test/org/apache/solr/cloud/TestSegmentSorting.class (Too many open files)
at java.io.FileInputStream.open0(Native Method)
at java.io.FileInputStream.open(FileInputStream.java:195)
at java.io.FileInputStream.<init>(FileInputStream.java:138)
at sun.misc.URLClassPath$FileLoader$1.getInputStream(URLClassPath.java:1288)
at sun.misc.Resource.cachedInputStream(Resource.java:77)
at sun.misc.Resource.getByteBuffer(Resource.java:160)
at java.net.URLClassLoader.defineClass(URLClassLoader.java:454)
at java.net.URLClassLoader.access$100(URLClassLoader.java:73)
at java.net.URLClassLoader$1.run(URLClassLoader.java:368)
... 12 more
FAILED: org.apache.solr.cloud.TestTolerantUpdateProcessorRandomCloud.testSanityRandomUnsetBit
Error Message:
No live SolrServers available to handle this request:[http://127.0.0.1:50189/solr/test_col, http://127.0.0.1:50186/solr/test_col, http://127.0.0.1:50180/solr/test_col, http://127.0.0.1:50184/solr/test_col, http://127.0.0.1:50193/solr/test_col, http://127.0.0.1:50183/solr/test_col, http://127.0.0.1:50192/solr/test_col, http://127.0.0.1:50182/solr/test_col, http://127.0.0.1:50181/solr/test_col]
Stack Trace:
org.apache.solr.client.solrj.SolrServerException: No live SolrServers available to handle this request:[http://127.0.0.1:50189/solr/test_col, http://127.0.0.1:50186/solr/test_col, http://127.0.0.1:50180/solr/test_col, http://127.0.0.1:50184/solr/test_col, http://127.0.0.1:50193/solr/test_col, http://127.0.0.1:50183/solr/test_col, http://127.0.0.1:50192/solr/test_col, http://127.0.0.1:50182/solr/test_col, http://127.0.0.1:50181/solr/test_col]
at __randomizedtesting.SeedInfo.seed([25D6C19B1C401D16:A67579D35D54F3EC]:0)
at org.apache.solr.client.solrj.impl.LBHttpSolrClient.request(LBHttpSolrClient.java:462)
at org.apache.solr.client.solrj.impl.CloudSolrClient.sendRequest(CloudSolrClient.java:1121)
at org.apache.solr.client.solrj.impl.CloudSolrClient.requestWithRetryOnStaleState(CloudSolrClient.java:862)
at org.apache.solr.client.solrj.impl.CloudSolrClient.requestWithRetryOnStaleState(CloudSolrClient.java:922)
at org.apache.solr.client.solrj.impl.CloudSolrClient.requestWithRetryOnStaleState(CloudSolrClient.java:922)
at org.apache.solr.client.solrj.impl.CloudSolrClient.requestWithRetryOnStaleState(CloudSolrClient.java:922)
at org.apache.solr.client.solrj.impl.CloudSolrClient.requestWithRetryOnStaleState(CloudSolrClient.java:922)
at org.apache.solr.client.solrj.impl.CloudSolrClient.request(CloudSolrClient.java:793)
at org.apache.solr.client.solrj.SolrRequest.process(SolrRequest.java:178)
at org.apache.solr.client.solrj.SolrClient.query(SolrClient.java:942)
at org.apache.solr.client.solrj.SolrClient.query(SolrClient.java:957)
at org.apache.solr.cloud.TestTolerantUpdateProcessorRandomCloud.countDocs(TestTolerantUpdateProcessorRandomCloud.java:367)
at org.apache.solr.cloud.TestTolerantUpdateProcessorRandomCloud.deleteAllDocs(TestTolerantUpdateProcessorRandomCloud.java:134)
at sun.reflect.NativeMethodAccessorImpl.invoke0(Native Method)
at sun.reflect.NativeMethodAccessorImpl.invoke(NativeMethodAccessorImpl.java:62)
at sun.reflect.DelegatingMethodAccessorImpl.invoke(DelegatingMethodAccessorImpl.java:43)
at java.lang.reflect.Method.invoke(Method.java:498)
at com.carrotsearch.randomizedtesting.RandomizedRunner.invoke(RandomizedRunner.java:1737)
at com.carrotsearch.randomizedtesting.RandomizedRunner$9.evaluate(RandomizedRunner.java:968)
at com.carrotsearch.randomizedtesting.RandomizedRunner$10.evaluate(RandomizedRunner.java:984)
at com.carrotsearch.randomizedtesting.rules.SystemPropertiesRestoreRule$1.evaluate(SystemPropertiesRestoreRule.java:57)
at org.apache.lucene.util.TestRuleSetupTeardownChained$1.evaluate(TestRuleSetupTeardownChained.java:49)
at org.apache.lucene.util.AbstractBeforeAfterRule$1.evaluate(AbstractBeforeAfterRule.java:45)
at org.apache.lucene.util.TestRuleThreadAndTestName$1.evaluate(TestRuleThreadAndTestName.java:48)
at org.apache.lucene.util.TestRuleIgnoreAfterMaxFailures$1.evaluate(TestRuleIgnoreAfterMaxFailures.java:64)
at org.apache.lucene.util.TestRuleMarkFailure$1.evaluate(TestRuleMarkFailure.java:47)
at com.carrotsearch.randomizedtesting.rules.StatementAdapter.evaluate(StatementAdapter.java:36)
at com.carrotsearch.randomizedtesting.ThreadLeakControl$StatementRunner.run(ThreadLeakControl.java:368)
at com.carrotsearch.randomizedtesting.ThreadLeakControl.forkTimeoutingTask(ThreadLeakControl.java:817)
at com.carrotsearch.randomizedtesting.ThreadLeakControl$3.evaluate(ThreadLeakControl.java:468)
at com.carrotsearch.randomizedtesting.RandomizedRunner.runSingleTest(RandomizedRunner.java:943)
at com.carrotsearch.randomizedtesting.RandomizedRunner$5.evaluate(RandomizedRunner.java:829)
at com.carrotsearch.randomizedtesting.RandomizedRunner$6.evaluate(RandomizedRunner.java:879)
at com.carrotsearch.randomizedtesting.RandomizedRunner$7.evaluate(RandomizedRunner.java:890)
at com.carrotsearch.randomizedtesting.rules.StatementAdapter.evaluate(StatementAdapter.java:36)
at com.carrotsearch.randomizedtesting.rules.SystemPropertiesRestoreRule$1.evaluate(SystemPropertiesRestoreRule.java:57)
at org.apache.lucene.util.AbstractBeforeAfterRule$1.evaluate(AbstractBeforeAfterRule.java:45)
at com.carrotsearch.randomizedtesting.rules.StatementAdapter.evaluate(StatementAdapter.java:36)
at org.apache.lucene.util.TestRuleStoreClassName$1.evaluate(TestRuleStoreClassName.java:41)
at com.carrotsearch.randomizedtesting.rules.NoShadowingOrOverridesOnMethodsRule$1.evaluate(NoShadowingOrOverridesOnMethodsRule.java:40)
at com.carrotsearch.randomizedtesting.rules.NoShadowingOrOverridesOnMethodsRule$1.evaluate(NoShadowingOrOverridesOnMethodsRule.java:40)
at com.carrotsearch.randomizedtesting.rules.StatementAdapter.evaluate(StatementAdapter.java:36)
at com.carrotsearch.randomizedtesting.rules.StatementAdapter.evaluate(StatementAdapter.java:36)
at com.carrotsearch.randomizedtesting.rules.StatementAdapter.evaluate(StatementAdapter.java:36)
at org.apache.lucene.util.TestRuleAssertionsRequired$1.evaluate(TestRuleAssertionsRequired.java:53)
at org.apache.lucene.util.TestRuleMarkFailure$1.evaluate(TestRuleMarkFailure.java:47)
at org.apache.lucene.util.TestRuleIgnoreAfterMaxFailures$1.evaluate(TestRuleIgnoreAfterMaxFailures.java:64)
at org.apache.lucene.util.TestRuleIgnoreTestSuites$1.evaluate(TestRuleIgnoreTestSuites.java:54)
at com.carrotsearch.randomizedtesting.rules.StatementAdapter.evaluate(StatementAdapter.java:36)
at com.carrotsearch.randomizedtesting.ThreadLeakControl$StatementRunner.run(ThreadLeakControl.java:368)
at java.lang.Thread.run(Thread.java:748)
Caused by: org.apache.solr.client.solrj.impl.HttpSolrClient$RemoteSolrException: Error from server at http://127.0.0.1:50189/solr/test_col: org.apache.solr.client.solrj.SolrServerException: No live SolrServers available to handle this request:[http://127.0.0.1:50189/solr/test_col_shard1_replica_n4, http://127.0.0.1:50182/solr/test_col_shard2_replica_n8, http://127.0.0.1:50192/solr/test_col_shard1_replica_n2, http://127.0.0.1:50184/solr/test_col_shard2_replica_n10, http://127.0.0.1:50186/solr/test_col_shard1_replica_n1, http://127.0.0.1:50193/solr/test_col_shard3_replica_n12, http://127.0.0.1:50183/solr/test_col_shard3_replica_n16, http://127.0.0.1:50181/solr/test_col_shard2_replica_n6, http://127.0.0.1:50180/solr/test_col_shard3_replica_n14]
at org.apache.solr.client.solrj.impl.HttpSolrClient.executeMethod(HttpSolrClient.java:626)
at org.apache.solr.client.solrj.impl.HttpSolrClient.request(HttpSolrClient.java:253)
at org.apache.solr.client.solrj.impl.HttpSolrClient.request(HttpSolrClient.java:242)
at org.apache.solr.client.solrj.impl.LBHttpSolrClient.doRequest(LBHttpSolrClient.java:483)
at org.apache.solr.client.solrj.impl.LBHttpSolrClient.request(LBHttpSolrClient.java:436)
... 50 more
FAILED: org.apache.solr.cloud.TestTolerantUpdateProcessorRandomCloud.testRandomUpdates
Error Message:
Error from server at http://127.0.0.1:50189/solr/test_col: 2 Async exceptions during distributed update: Error from server at http://127.0.0.1:50182/solr/test_col_shard2_replica_n8: Server Error request: http://127.0.0.1:50182/solr/test_col_shard2_replica_n8/update?update.distrib=TOLEADER&distrib.from=http%3A%2F%2F127.0.0.1%3A50189%2Fsolr%2Ftest_col_shard1_replica_n4%2F&wt=javabin&version=2 Remote error message: java.io.FileNotFoundException: /Users/jenkins/workspace/Lucene-Solr-master-MacOSX/solr/build/solr-core/test/J1/temp/solr.cloud.TestTolerantUpdateProcessorRandomCloud_25D6C19B1C401D16-001/tempDir-001/node10/test_col_shard2_replica_n8/data/tlog/tlog.0000000000000000001 (Too many open files) Error from server at http://127.0.0.1:50180/solr/test_col_shard3_replica_n14: Server Error request: http://127.0.0.1:50180/solr/test_col_shard3_replica_n14/update?update.distrib=TOLEADER&distrib.from=http%3A%2F%2F127.0.0.1%3A50189%2Fsolr%2Ftest_col_shard1_replica_n4%2F&wt=javabin&version=2 Remote error message: java.io.FileNotFoundException: /Users/jenkins/workspace/Lucene-Solr-master-MacOSX/solr/build/solr-core/test/J1/temp/solr.cloud.TestTolerantUpdateProcessorRandomCloud_25D6C19B1C401D16-001/tempDir-001/node1/test_col_shard3_replica_n14/data/tlog/tlog.0000000000000000001 (Too many open files)
Stack Trace:
org.apache.solr.client.solrj.impl.HttpSolrClient$RemoteSolrException: Error from server at http://127.0.0.1:50189/solr/test_col: 2 Async exceptions during distributed update:
Error from server at http://127.0.0.1:50182/solr/test_col_shard2_replica_n8: Server Error
request: http://127.0.0.1:50182/solr/test_col_shard2_replica_n8/update?update.distrib=TOLEADER&distrib.from=http%3A%2F%2F127.0.0.1%3A50189%2Fsolr%2Ftest_col_shard1_replica_n4%2F&wt=javabin&version=2
Remote error message: java.io.FileNotFoundException: /Users/jenkins/workspace/Lucene-Solr-master-MacOSX/solr/build/solr-core/test/J1/temp/solr.cloud.TestTolerantUpdateProcessorRandomCloud_25D6C19B1C401D16-001/tempDir-001/node10/test_col_shard2_replica_n8/data/tlog/tlog.0000000000000000001 (Too many open files)
Error from server at http://127.0.0.1:50180/solr/test_col_shard3_replica_n14: Server Error
request: http://127.0.0.1:50180/solr/test_col_shard3_replica_n14/update?update.distrib=TOLEADER&distrib.from=http%3A%2F%2F127.0.0.1%3A50189%2Fsolr%2Ftest_col_shard1_replica_n4%2F&wt=javabin&version=2
Remote error message: java.io.FileNotFoundException: /Users/jenkins/workspace/Lucene-Solr-master-MacOSX/solr/build/solr-core/test/J1/temp/solr.cloud.TestTolerantUpdateProcessorRandomCloud_25D6C19B1C401D16-001/tempDir-001/node1/test_col_shard3_replica_n14/data/tlog/tlog.0000000000000000001 (Too many open files)
at __randomizedtesting.SeedInfo.seed([25D6C19B1C401D16:1917142B6B3DE304]:0)
at org.apache.solr.client.solrj.impl.HttpSolrClient.executeMethod(HttpSolrClient.java:626)
at org.apache.solr.client.solrj.impl.HttpSolrClient.request(HttpSolrClient.java:253)
at org.apache.solr.client.solrj.impl.HttpSolrClient.request(HttpSolrClient.java:242)
at org.apache.solr.client.solrj.impl.LBHttpSolrClient.doRequest(LBHttpSolrClient.java:483)
at org.apache.solr.client.solrj.impl.LBHttpSolrClient.request(LBHttpSolrClient.java:436)
at org.apache.solr.client.solrj.impl.CloudSolrClient.sendRequest(CloudSolrClient.java:1121)
at org.apache.solr.client.solrj.impl.CloudSolrClient.requestWithRetryOnStaleState(CloudSolrClient.java:862)
at org.apache.solr.client.solrj.impl.CloudSolrClient.requestWithRetryOnStaleState(CloudSolrClient.java:922)
at org.apache.solr.client.solrj.impl.CloudSolrClient.request(CloudSolrClient.java:793)
at org.apache.solr.client.solrj.SolrRequest.process(SolrRequest.java:178)
at org.apache.solr.client.solrj.SolrRequest.process(SolrRequest.java:195)
at org.apache.solr.cloud.TestTolerantUpdateProcessorRandomCloud.deleteAllDocs(TestTolerantUpdateProcessorRandomCloud.java:133)
at sun.reflect.NativeMethodAccessorImpl.invoke0(Native Method)
at sun.reflect.NativeMethodAccessorImpl.invoke(NativeMethodAccessorImpl.java:62)
at sun.reflect.DelegatingMethodAccessorImpl.invoke(DelegatingMethodAccessorImpl.java:43)
at java.lang.reflect.Method.invoke(Method.java:498)
at com.carrotsearch.randomizedtesting.RandomizedRunner.invoke(RandomizedRunner.java:1737)
at com.carrotsearch.randomizedtesting.RandomizedRunner$9.evaluate(RandomizedRunner.java:968)
at com.carrotsearch.randomizedtesting.RandomizedRunner$10.evaluate(RandomizedRunner.java:984)
at com.carrotsearch.randomizedtesting.rules.SystemPropertiesRestoreRule$1.evaluate(SystemPropertiesRestoreRule.java:57)
at org.apache.lucene.util.TestRuleSetupTeardownChained$1.evaluate(TestRuleSetupTeardownChained.java:49)
at org.apache.lucene.util.AbstractBeforeAfterRule$1.evaluate(AbstractBeforeAfterRule.java:45)
at org.apache.lucene.util.TestRuleThreadAndTestName$1.evaluate(TestRuleThreadAndTestName.java:48)
at org.apache.lucene.util.TestRuleIgnoreAfterMaxFailures$1.evaluate(TestRuleIgnoreAfterMaxFailures.java:64)
at org.apache.lucene.util.TestRuleMarkFailure$1.evaluate(TestRuleMarkFailure.java:47)
at com.carrotsearch.randomizedtesting.rules.StatementAdapter.evaluate(StatementAdapter.java:36)
at com.carrotsearch.randomizedtesting.ThreadLeakControl$StatementRunner.run(ThreadLeakControl.java:368)
at com.carrotsearch.randomizedtesting.ThreadLeakControl.forkTimeoutingTask(ThreadLeakControl.java:817)
at com.carrotsearch.randomizedtesting.ThreadLeakControl$3.evaluate(ThreadLeakControl.java:468)
at com.carrotsearch.randomizedtesting.RandomizedRunner.runSingleTest(RandomizedRunner.java:943)
at com.carrotsearch.randomizedtesting.RandomizedRunner$5.evaluate(RandomizedRunner.java:829)
at com.carrotsearch.randomizedtesting.RandomizedRunner$6.evaluate(RandomizedRunner.java:879)
at com.carrotsearch.randomizedtesting.RandomizedRunner$7.evaluate(RandomizedRunner.java:890)
at com.carrotsearch.randomizedtesting.rules.StatementAdapter.evaluate(StatementAdapter.java:36)
at com.carrotsearch.randomizedtesting.rules.SystemPropertiesRestoreRule$1.evaluate(SystemPropertiesRestoreRule.java:57)
at org.apache.lucene.util.AbstractBeforeAfterRule$1.evaluate(AbstractBeforeAfterRule.java:45)
at com.carrotsearch.randomizedtesting.rules.StatementAdapter.evaluate(StatementAdapter.java:36)
at org.apache.lucene.util.TestRuleStoreClassName$1.evaluate(TestRuleStoreClassName.java:41)
at com.carrotsearch.randomizedtesting.rules.NoShadowingOrOverridesOnMethodsRule$1.evaluate(NoShadowingOrOverridesOnMethodsRule.java:40)
at com.carrotsearch.randomizedtesting.rules.NoShadowingOrOverridesOnMethodsRule$1.evaluate(NoShadowingOrOverridesOnMethodsRule.java:40)
at com.carrotsearch.randomizedtesting.rules.StatementAdapter.evaluate(StatementAdapter.java:36)
at com.carrotsearch.randomizedtesting.rules.StatementAdapter.evaluate(StatementAdapter.java:36)
at com.carrotsearch.randomizedtesting.rules.StatementAdapter.evaluate(StatementAdapter.java:36)
at org.apache.lucene.util.TestRuleAssertionsRequired$1.evaluate(TestRuleAssertionsRequired.java:53)
at org.apache.lucene.util.TestRuleMarkFailure$1.evaluate(TestRuleMarkFailure.java:47)
at org.apache.lucene.util.TestRuleIgnoreAfterMaxFailures$1.evaluate(TestRuleIgnoreAfterMaxFailures.java:64)
at org.apache.lucene.util.TestRuleIgnoreTestSuites$1.evaluate(TestRuleIgnoreTestSuites.java:54)
at com.carrotsearch.randomizedtesting.rules.StatementAdapter.evaluate(StatementAdapter.java:36)
at com.carrotsearch.randomizedtesting.ThreadLeakControl$StatementRunner.run(ThreadLeakControl.java:368)
at java.lang.Thread.run(Thread.java:748)
FAILED: org.apache.solr.cloud.ZkSolrClientTest.testConnect
Error Message:
java.util.concurrent.TimeoutException: Could not connect to ZooKeeper 127.0.0.1:50648 within 30000 ms
Stack Trace:
org.apache.solr.common.SolrException: java.util.concurrent.TimeoutException: Could not connect to ZooKeeper 127.0.0.1:50648 within 30000 ms
at __randomizedtesting.SeedInfo.seed([25D6C19B1C401D16:25B1AB3FCCC8CA1F]:0)
at org.apache.solr.common.cloud.SolrZkClient.<init>(SolrZkClient.java:183)
at org.apache.solr.common.cloud.SolrZkClient.<init>(SolrZkClient.java:117)
at org.apache.solr.common.cloud.SolrZkClient.<init>(SolrZkClient.java:112)
at org.apache.solr.common.cloud.SolrZkClient.<init>(SolrZkClient.java:99)
at org.apache.solr.cloud.AbstractZkTestCase.tryCleanPath(AbstractZkTestCase.java:180)
at org.apache.solr.cloud.AbstractZkTestCase.tryCleanSolrZkNode(AbstractZkTestCase.java:176)
at org.apache.solr.cloud.ZkSolrClientTest$ZkConnection.<init>(ZkSolrClientTest.java:57)
at org.apache.solr.cloud.ZkSolrClientTest.testConnect(ZkSolrClientTest.java:79)
at sun.reflect.NativeMethodAccessorImpl.invoke0(Native Method)
at sun.reflect.NativeMethodAccessorImpl.invoke(NativeMethodAccessorImpl.java:62)
at sun.reflect.DelegatingMethodAccessorImpl.invoke(DelegatingMethodAccessorImpl.java:43)
at java.lang.reflect.Method.invoke(Method.java:498)
at com.carrotsearch.randomizedtesting.RandomizedRunner.invoke(RandomizedRunner.java:1737)
at com.carrotsearch.randomizedtesting.RandomizedRunner$8.evaluate(RandomizedRunner.java:934)
at com.carrotsearch.randomizedtesting.RandomizedRunner$9.evaluate(RandomizedRunner.java:970)
at com.carrotsearch.randomizedtesting.RandomizedRunner$10.evaluate(RandomizedRunner.java:984)
at com.carrotsearch.randomizedtesting.rules.SystemPropertiesRestoreRule$1.evaluate(SystemPropertiesRestoreRule.java:57)
at org.apache.lucene.util.TestRuleSetupTeardownChained$1.evaluate(TestRuleSetupTeardownChained.java:49)
at org.apache.lucene.util.AbstractBeforeAfterRule$1.evaluate(AbstractBeforeAfterRule.java:45)
at org.apache.lucene.util.TestRuleThreadAndTestName$1.evaluate(TestRuleThreadAndTestName.java:48)
at org.apache.lucene.util.TestRuleIgnoreAfterMaxFailures$1.evaluate(TestRuleIgnoreAfterMaxFailures.java:64)
at org.apache.lucene.util.TestRuleMarkFailure$1.evaluate(TestRuleMarkFailure.java:47)
at com.carrotsearch.randomizedtesting.rules.StatementAdapter.evaluate(StatementAdapter.java:36)
at com.carrotsearch.randomizedtesting.ThreadLeakControl$StatementRunner.run(ThreadLeakControl.java:368)
at com.carrotsearch.randomizedtesting.ThreadLeakControl.forkTimeoutingTask(ThreadLeakControl.java:817)
at com.carrotsearch.randomizedtesting.ThreadLeakControl$3.evaluate(ThreadLeakControl.java:468)
at com.carrotsearch.randomizedtesting.RandomizedRunner.runSingleTest(RandomizedRunner.java:943)
at com.carrotsearch.randomizedtesting.RandomizedRunner$5.evaluate(RandomizedRunner.java:829)
at com.carrotsearch.randomizedtesting.RandomizedRunner$6.evaluate(RandomizedRunner.java:879)
at com.carrotsearch.randomizedtesting.RandomizedRunner$7.evaluate(RandomizedRunner.java:890)
at com.carrotsearch.randomizedtesting.rules.StatementAdapter.evaluate(StatementAdapter.java:36)
at com.carrotsearch.randomizedtesting.rules.SystemPropertiesRestoreRule$1.evaluate(SystemPropertiesRestoreRule.java:57)
at org.apache.lucene.util.AbstractBeforeAfterRule$1.evaluate(AbstractBeforeAfterRule.java:45)
at com.carrotsearch.randomizedtesting.rules.StatementAdapter.evaluate(StatementAdapter.java:36)
at org.apache.lucene.util.TestRuleStoreClassName$1.evaluate(TestRuleStoreClassName.java:41)
at com.carrotsearch.randomizedtesting.rules.NoShadowingOrOverridesOnMethodsRule$1.evaluate(NoShadowingOrOverridesOnMethodsRule.java:40)
at com.carrotsearch.randomizedtesting.rules.NoShadowingOrOverridesOnMethodsRule$1.evaluate(NoShadowingOrOverridesOnMethodsRule.java:40)
at com.carrotsearch.randomizedtesting.rules.StatementAdapter.evaluate(StatementAdapter.java:36)
at com.carrotsearch.randomizedtesting.rules.StatementAdapter.evaluate(StatementAdapter.java:36)
at com.carrotsearch.randomizedtesting.rules.StatementAdapter.evaluate(StatementAdapter.java:36)
at org.apache.lucene.util.TestRuleAssertionsRequired$1.evaluate(TestRuleAssertionsRequired.java:53)
at org.apache.lucene.util.TestRuleMarkFailure$1.evaluate(TestRuleMarkFailure.java:47)
at org.apache.lucene.util.TestRuleIgnoreAfterMaxFailures$1.evaluate(TestRuleIgnoreAfterMaxFailures.java:64)
at org.apache.lucene.util.TestRuleIgnoreTestSuites$1.evaluate(TestRuleIgnoreTestSuites.java:54)
at com.carrotsearch.randomizedtesting.rules.StatementAdapter.evaluate(StatementAdapter.java:36)
at com.carrotsearch.randomizedtesting.ThreadLeakControl$StatementRunner.run(ThreadLeakControl.java:368)
at java.lang.Thread.run(Thread.java:748)
Caused by: java.util.concurrent.TimeoutException: Could not connect to ZooKeeper 127.0.0.1:50648 within 30000 ms
at org.apache.solr.common.cloud.ConnectionManager.waitForConnected(ConnectionManager.java:233)
at org.apache.solr.common.cloud.SolrZkClient.<init>(SolrZkClient.java:175)
... 46 more
FAILED: org.apache.solr.cloud.ZkSolrClientTest.testWatchChildren
Error Message:
java.io.IOException: Couldn't instantiate org.apache.zookeeper.ClientCnxnSocketNIO
Stack Trace:
org.apache.solr.common.SolrException: java.io.IOException: Couldn't instantiate org.apache.zookeeper.ClientCnxnSocketNIO
at __randomizedtesting.SeedInfo.seed([25D6C19B1C401D16:6DA8A3875B84A7AD]:0)
at org.apache.solr.common.cloud.SolrZkClient.<init>(SolrZkClient.java:171)
at org.apache.solr.common.cloud.SolrZkClient.<init>(SolrZkClient.java:117)
at org.apache.solr.common.cloud.SolrZkClient.<init>(SolrZkClient.java:112)
at org.apache.solr.common.cloud.SolrZkClient.<init>(SolrZkClient.java:99)
at org.apache.solr.cloud.AbstractZkTestCase.tryCleanPath(AbstractZkTestCase.java:180)
at org.apache.solr.cloud.AbstractZkTestCase.tryCleanSolrZkNode(AbstractZkTestCase.java:176)
at org.apache.solr.cloud.ZkSolrClientTest$ZkConnection.<init>(ZkSolrClientTest.java:57)
at org.apache.solr.cloud.ZkSolrClientTest$ZkConnection.<init>(ZkSolrClientTest.java:49)
at org.apache.solr.cloud.ZkSolrClientTest.testWatchChildren(ZkSolrClientTest.java:262)
at sun.reflect.NativeMethodAccessorImpl.invoke0(Native Method)
at sun.reflect.NativeMethodAccessorImpl.invoke(NativeMethodAccessorImpl.java:62)
at sun.reflect.DelegatingMethodAccessorImpl.invoke(DelegatingMethodAccessorImpl.java:43)
at java.lang.reflect.Method.invoke(Method.java:498)
at com.carrotsearch.randomizedtesting.RandomizedRunner.invoke(RandomizedRunner.java:1737)
at com.carrotsearch.randomizedtesting.RandomizedRunner$8.evaluate(RandomizedRunner.java:934)
at com.carrotsearch.randomizedtesting.RandomizedRunner$9.evaluate(RandomizedRunner.java:970)
at com.carrotsearch.randomizedtesting.RandomizedRunner$10.evaluate(RandomizedRunner.java:984)
at com.carrotsearch.randomizedtesting.rules.SystemPropertiesRestoreRule$1.evaluate(SystemPropertiesRestoreRule.java:57)
at org.apache.lucene.util.TestRuleSetupTeardownChained$1.evaluate(TestRuleSetupTeardownChained.java:49)
at org.apache.lucene.util.AbstractBeforeAfterRule$1.evaluate(AbstractBeforeAfterRule.java:45)
at org.apache.lucene.util.TestRuleThreadAndTestName$1.evaluate(TestRuleThreadAndTestName.java:48)
at org.apache.lucene.util.TestRuleIgnoreAfterMaxFailures$1.evaluate(TestRuleIgnoreAfterMaxFailures.java:64)
at org.apache.lucene.util.TestRuleMarkFailure$1.evaluate(TestRuleMarkFailure.java:47)
at com.carrotsearch.randomizedtesting.rules.StatementAdapter.evaluate(StatementAdapter.java:36)
at com.carrotsearch.randomizedtesting.ThreadLeakControl$StatementRunner.run(ThreadLeakControl.java:368)
at com.carrotsearch.randomizedtesting.ThreadLeakControl.forkTimeoutingTask(ThreadLeakControl.java:817)
at com.carrotsearch.randomizedtesting.ThreadLeakControl$3.evaluate(ThreadLeakControl.java:468)
at com.carrotsearch.randomizedtesting.RandomizedRunner.runSingleTest(RandomizedRunner.java:943)
at com.carrotsearch.randomizedtesting.RandomizedRunner$5.evaluate(RandomizedRunner.java:829)
at com.carrotsearch.randomizedtesting.RandomizedRunner$6.evaluate(RandomizedRunner.java:879)
at com.carrotsearch.randomizedtesting.RandomizedRunner$7.evaluate(RandomizedRunner.java:890)
at com.carrotsearch.randomizedtesting.rules.StatementAdapter.evaluate(StatementAdapter.java:36)
at com.carrotsearch.randomizedtesting.rules.SystemPropertiesRestoreRule$1.evaluate(SystemPropertiesRestoreRule.java:57)
at org.apache.lucene.util.AbstractBeforeAfterRule$1.evaluate(AbstractBeforeAfterRule.java:45)
at com.carrotsearch.randomizedtesting.rules.StatementAdapter.evaluate(StatementAdapter.java:36)
at org.apache.lucene.util.TestRuleStoreClassName$1.evaluate(TestRuleStoreClassName.java:41)
at com.carrotsearch.randomizedtesting.rules.NoShadowingOrOverridesOnMethodsRule$1.evaluate(NoShadowingOrOverridesOnMethodsRule.java:40)
at com.carrotsearch.randomizedtesting.rules.NoShadowingOrOverridesOnMethodsRule$1.evaluate(NoShadowingOrOverridesOnMethodsRule.java:40)
at com.carrotsearch.randomizedtesting.rules.StatementAdapter.evaluate(StatementAdapter.java:36)
at com.carrotsearch.randomizedtesting.rules.StatementAdapter.evaluate(StatementAdapter.java:36)
at com.carrotsearch.randomizedtesting.rules.StatementAdapter.evaluate(StatementAdapter.java:36)
at org.apache.lucene.util.TestRuleAssertionsRequired$1.evaluate(TestRuleAssertionsRequired.java:53)
at org.apache.lucene.util.TestRuleMarkFailure$1.evaluate(TestRuleMarkFailure.java:47)
at org.apache.lucene.util.TestRuleIgnoreAfterMaxFailures$1.evaluate(TestRuleIgnoreAfterMaxFailures.java:64)
at org.apache.lucene.util.TestRuleIgnoreTestSuites$1.evaluate(TestRuleIgnoreTestSuites.java:54)
at com.carrotsearch.randomizedtesting.rules.StatementAdapter.evaluate(StatementAdapter.java:36)
at com.carrotsearch.randomizedtesting.ThreadLeakControl$StatementRunner.run(ThreadLeakControl.java:368)
at java.lang.Thread.run(Thread.java:748)
Caused by: java.io.IOException: Couldn't instantiate org.apache.zookeeper.ClientCnxnSocketNIO
at org.apache.zookeeper.ZooKeeper.getClientCnxnSocket(ZooKeeper.java:1842)
at org.apache.zookeeper.ZooKeeper.<init>(ZooKeeper.java:447)
at org.apache.zookeeper.ZooKeeper.<init>(ZooKeeper.java:380)
at org.apache.solr.common.cloud.SolrZooKeeper.<init>(SolrZooKeeper.java:43)
at org.apache.solr.common.cloud.ZkClientConnectionStrategy.createSolrZooKeeper(ZkClientConnectionStrategy.java:105)
at org.apache.solr.common.cloud.DefaultConnectionStrategy.connect(DefaultConnectionStrategy.java:37)
at org.apache.solr.common.cloud.SolrZkClient.<init>(SolrZkClient.java:146)
... 47 more
Caused by: java.io.IOException: Too many open files
at sun.nio.ch.IOUtil.makePipe(Native Method)
at sun.nio.ch.KQueueSelectorImpl.<init>(KQueueSelectorImpl.java:84)
at sun.nio.ch.KQueueSelectorProvider.openSelector(KQueueSelectorProvider.java:42)
at java.nio.channels.Selector.open(Selector.java:227)
at org.apache.zookeeper.ClientCnxnSocketNIO.<init>(ClientCnxnSocketNIO.java:43)
at sun.reflect.GeneratedConstructorAccessor67.newInstance(Unknown Source)
at sun.reflect.DelegatingConstructorAccessorImpl.newInstance(DelegatingConstructorAccessorImpl.java:45)
at java.lang.reflect.Constructor.newInstance(Constructor.java:423)
at java.lang.Class.newInstance(Class.java:442)
at org.apache.zookeeper.ZooKeeper.getClientCnxnSocket(ZooKeeper.java:1839)
... 53 more
FAILED: org.apache.solr.cloud.ZkSolrClientTest.testMakeRootNode
Error Message:
Could not get the port for ZooKeeper server
Stack Trace:
java.lang.RuntimeException: Could not get the port for ZooKeeper server
at org.apache.solr.cloud.ZkTestServer.run(ZkTestServer.java:515)
at org.apache.solr.cloud.ZkSolrClientTest$ZkConnection.<init>(ZkSolrClientTest.java:55)
at org.apache.solr.cloud.ZkSolrClientTest$ZkConnection.<init>(ZkSolrClientTest.java:49)
at org.apache.solr.cloud.ZkSolrClientTest.testMakeRootNode(ZkSolrClientTest.java:85)
at sun.reflect.NativeMethodAccessorImpl.invoke0(Native Method)
at sun.reflect.NativeMethodAccessorImpl.invoke(NativeMethodAccessorImpl.java:62)
at sun.reflect.DelegatingMethodAccessorImpl.invoke(DelegatingMethodAccessorImpl.java:43)
at java.lang.reflect.Method.invoke(Method.java:498)
at com.carrotsearch.randomizedtesting.RandomizedRunner.invoke(RandomizedRunner.java:1737)
at com.carrotsearch.randomizedtesting.RandomizedRunner$8.evaluate(RandomizedRunner.java:934)
at com.carrotsearch.randomizedtesting.RandomizedRunner$9.evaluate(RandomizedRunner.java:970)
at com.carrotsearch.randomizedtesting.RandomizedRunner$10.evaluate(RandomizedRunner.java:984)
at com.carrotsearch.randomizedtesting.rules.SystemPropertiesRestoreRule$1.evaluate(SystemPropertiesRestoreRule.java:57)
at org.apache.lucene.util.TestRuleSetupTeardownChained$1.evaluate(TestRuleSetupTeardownChained.java:49)
at org.apache.lucene.util.AbstractBeforeAfterRule$1.evaluate(AbstractBeforeAfterRule.java:45)
at org.apache.lucene.util.TestRuleThreadAndTestName$1.evaluate(TestRuleThreadAndTestName.java:48)
at org.apache.lucene.util.TestRuleIgnoreAfterMaxFailures$1.evaluate(TestRuleIgnoreAfterMaxFailures.java:64)
at org.apache.lucene.util.TestRuleMarkFailure$1.evaluate(TestRuleMarkFailure.java:47)
at com.carrotsearch.randomizedtesting.rules.StatementAdapter.evaluate(StatementAdapter.java:36)
at com.carrotsearch.randomizedtesting.ThreadLeakControl$StatementRunner.run(ThreadLeakControl.java:368)
at com.carrotsearch.randomizedtesting.ThreadLeakControl.forkTimeoutingTask(ThreadLeakControl.java:817)
at com.carrotsearch.randomizedtesting.ThreadLeakControl$3.evaluate(ThreadLeakControl.java:468)
at com.carrotsearch.randomizedtesting.RandomizedRunner.runSingleTest(RandomizedRunner.java:943)
at com.carrotsearch.randomizedtesting.RandomizedRunner$5.evaluate(RandomizedRunner.java:829)
at com.carrotsearch.randomizedtesting.RandomizedRunner$6.evaluate(RandomizedRunner.java:879)
at com.carrotsearch.randomizedtesting.RandomizedRunner$7.evaluate(RandomizedRunner.java:890)
at com.carrotsearch.randomizedtesting.rules.StatementAdapter.evaluate(StatementAdapter.java:36)
at com.carrotsearch.randomizedtesting.rules.SystemPropertiesRestoreRule$1.evaluate(SystemPropertiesRestoreRule.java:57)
at org.apache.lucene.util.AbstractBeforeAfterRule$1.evaluate(AbstractBeforeAfterRule.java:45)
at com.carrotsearch.randomizedtesting.rules.StatementAdapter.evaluate(StatementAdapter.java:36)
at org.apache.lucene.util.TestRuleStoreClassName$1.evaluate(TestRuleStoreClassName.java:41)
at com.carrotsearch.randomizedtesting.rules.NoShadowingOrOverridesOnMethodsRule$1.evaluate(NoShadowingOrOverridesOnMethodsRule.java:40)
at com.carrotsearch.randomizedtesting.rules.NoShadowingOrOverridesOnMethodsRule$1.evaluate(NoShadowingOrOverridesOnMethodsRule.java:40)
at com.carrotsearch.randomizedtesting.rules.StatementAdapter.evaluate(StatementAdapter.java:36)
at com.carrotsearch.randomizedtesting.rules.StatementAdapter.evaluate(StatementAdapter.java:36)
at com.carrotsearch.randomizedtesting.rules.StatementAdapter.evaluate(StatementAdapter.java:36)
at org.apache.lucene.util.TestRuleAssertionsRequired$1.evaluate(TestRuleAssertionsRequired.java:53)
at org.apache.lucene.util.TestRuleMarkFailure$1.evaluate(TestRuleMarkFailure.java:47)
at org.apache.lucene.util.TestRuleIgnoreAfterMaxFailures$1.evaluate(TestRuleIgnoreAfterMaxFailures.java:64)
at org.apache.lucene.util.TestRuleIgnoreTestSuites$1.evaluate(TestRuleIgnoreTestSuites.java:54)
at com.carrotsearch.randomizedtesting.rules.StatementAdapter.evaluate(StatementAdapter.java:36)
at com.carrotsearch.randomizedtesting.ThreadLeakControl$StatementRunner.run(ThreadLeakControl.java:368)
at java.lang.Thread.run(Thread.java:748)
FAILED: org.apache.solr.cloud.ZkSolrClientTest.testClean
Error Message:
Could not get the port for ZooKeeper server
Stack Trace:
java.lang.RuntimeException: Could not get the port for ZooKeeper server
at org.apache.solr.cloud.ZkTestServer.run(ZkTestServer.java:515)
at org.apache.solr.cloud.ZkSolrClientTest$ZkConnection.<init>(ZkSolrClientTest.java:55)
at org.apache.solr.cloud.ZkSolrClientTest$ZkConnection.<init>(ZkSolrClientTest.java:49)
at org.apache.solr.cloud.ZkSolrClientTest.testClean(ZkSolrClientTest.java:96)
at sun.reflect.NativeMethodAccessorImpl.invoke0(Native Method)
at sun.reflect.NativeMethodAccessorImpl.invoke(NativeMethodAccessorImpl.java:62)
at sun.reflect.DelegatingMethodAccessorImpl.invoke(DelegatingMethodAccessorImpl.java:43)
at java.lang.reflect.Method.invoke(Method.java:498)
at com.carrotsearch.randomizedtesting.RandomizedRunner.invoke(RandomizedRunner.java:1737)
at com.carrotsearch.randomizedtesting.RandomizedRunner$8.evaluate(RandomizedRunner.java:934)
at com.carrotsearch.randomizedtesting.RandomizedRunner$9.evaluate(RandomizedRunner.java:970)
at com.carrotsearch.randomizedtesting.RandomizedRunner$10.evaluate(RandomizedRunner.java:984)
at com.carrotsearch.randomizedtesting.rules.SystemPropertiesRestoreRule$1.evaluate(SystemPropertiesRestoreRule.java:57)
at org.apache.lucene.util.TestRuleSetupTeardownChained$1.evaluate(TestRuleSetupTeardownChained.java:49)
at org.apache.lucene.util.AbstractBeforeAfterRule$1.evaluate(AbstractBeforeAfterRule.java:45)
at org.apache.lucene.util.TestRuleThreadAndTestName$1.evaluate(TestRuleThreadAndTestName.java:48)
at org.apache.lucene.util.TestRuleIgnoreAfterMaxFailures$1.evaluate(TestRuleIgnoreAfterMaxFailures.java:64)
at org.apache.lucene.util.TestRuleMarkFailure$1.evaluate(TestRuleMarkFailure.java:47)
at com.carrotsearch.randomizedtesting.rules.StatementAdapter.evaluate(StatementAdapter.java:36)
at com.carrotsearch.randomizedtesting.ThreadLeakControl$StatementRunner.run(ThreadLeakControl.java:368)
at com.carrotsearch.randomizedtesting.ThreadLeakControl.forkTimeoutingTask(ThreadLeakControl.java:817)
at com.carrotsearch.randomizedtesting.ThreadLeakControl$3.evaluate(ThreadLeakControl.java:468)
at com.carrotsearch.randomizedtesting.RandomizedRunner.runSingleTest(RandomizedRunner.java:943)
at com.carrotsearch.randomizedtesting.RandomizedRunner$5.evaluate(RandomizedRunner.java:829)
at com.carrotsearch.randomizedtesting.RandomizedRunner$6.evaluate(RandomizedRunner.java:879)
at com.carrotsearch.randomizedtesting.RandomizedRunner$7.evaluate(RandomizedRunner.java:890)
at com.carrotsearch.randomizedtesting.rules.StatementAdapter.evaluate(StatementAdapter.java:36)
at com.carrotsearch.randomizedtesting.rules.SystemPropertiesRestoreRule$1.evaluate(SystemPropertiesRestoreRule.java:57)
at org.apache.lucene.util.AbstractBeforeAfterRule$1.evaluate(AbstractBeforeAfterRule.java:45)
at com.carrotsearch.randomizedtesting.rules.StatementAdapter.evaluate(StatementAdapter.java:36)
at org.apache.lucene.util.TestRuleStoreClassName$1.evaluate(TestRuleStoreClassName.java:41)
at com.carrotsearch.randomizedtesting.rules.NoShadowingOrOverridesOnMethodsRule$1.evaluate(NoShadowingOrOverridesOnMethodsRule.java:40)
at com.carrotsearch.randomizedtesting.rules.NoShadowingOrOverridesOnMethodsRule$1.evaluate(NoShadowingOrOverridesOnMethodsRule.java:40)
at com.carrotsearch.randomizedtesting.rules.StatementAdapter.evaluate(StatementAdapter.java:36)
at com.carrotsearch.randomizedtesting.rules.StatementAdapter.evaluate(StatementAdapter.java:36)
at com.carrotsearch.randomizedtesting.rules.StatementAdapter.evaluate(StatementAdapter.java:36)
at org.apache.lucene.util.TestRuleAssertionsRequired$1.evaluate(TestRuleAssertionsRequired.java:53)
at org.apache.lucene.util.TestRuleMarkFailure$1.evaluate(TestRuleMarkFailure.java:47)
at org.apache.lucene.util.TestRuleIgnoreAfterMaxFailures$1.evaluate(TestRuleIgnoreAfterMaxFailures.java:64)
at org.apache.lucene.util.TestRuleIgnoreTestSuites$1.evaluate(TestRuleIgnoreTestSuites.java:54)
at com.carrotsearch.randomizedtesting.rules.StatementAdapter.evaluate(StatementAdapter.java:36)
at com.carrotsearch.randomizedtesting.ThreadLeakControl$StatementRunner.run(ThreadLeakControl.java:368)
at java.lang.Thread.run(Thread.java:748)
FAILED: org.apache.solr.cloud.ZkSolrClientTest.testSkipPathPartsOnMakePath
Error Message:
Could not get the port for ZooKeeper server
Stack Trace:
java.lang.RuntimeException: Could not get the port for ZooKeeper server
at org.apache.solr.cloud.ZkTestServer.run(ZkTestServer.java:515)
at org.apache.solr.cloud.ZkSolrClientTest$ZkConnection.<init>(ZkSolrClientTest.java:55)
at org.apache.solr.cloud.ZkSolrClientTest$ZkConnection.<init>(ZkSolrClientTest.java:49)
at org.apache.solr.cloud.ZkSolrClientTest.testSkipPathPartsOnMakePath(ZkSolrClientTest.java:310)
at sun.reflect.NativeMethodAccessorImpl.invoke0(Native Method)
at sun.reflect.NativeMethodAccessorImpl.invoke(NativeMethodAccessorImpl.java:62)
at sun.reflect.DelegatingMethodAccessorImpl.invoke(DelegatingMethodAccessorImpl.java:43)
at java.lang.reflect.Method.invoke(Method.java:498)
at com.carrotsearch.randomizedtesting.RandomizedRunner.invoke(RandomizedRunner.java:1737)
at com.carrotsearch.randomizedtesting.RandomizedRunner$8.evaluate(RandomizedRunner.java:934)
at com.carrotsearch.randomizedtesting.RandomizedRunner$9.evaluate(RandomizedRunner.java:970)
at com.carrotsearch.randomizedtesting.RandomizedRunner$10.evaluate(RandomizedRunner.java:984)
at com.carrotsearch.randomizedtesting.rules.SystemPropertiesRestoreRule$1.evaluate(SystemPropertiesRestoreRule.java:57)
at org.apache.lucene.util.TestRuleSetupTeardownChained$1.evaluate(TestRuleSetupTeardownChained.java:49)
at org.apache.lucene.util.AbstractBeforeAfterRule$1.evaluate(AbstractBeforeAfterRule.java:45)
at org.apache.lucene.util.TestRuleThreadAndTestName$1.evaluate(TestRuleThreadAndTestName.java:48)
at org.apache.lucene.util.TestRuleIgnoreAfterMaxFailures$1.evaluate(TestRuleIgnoreAfterMaxFailures.java:64)
at org.apache.lucene.util.TestRuleMarkFailure$1.evaluate(TestRuleMarkFailure.java:47)
at com.carrotsearch.randomizedtesting.rules.StatementAdapter.evaluate(StatementAdapter.java:36)
at com.carrotsearch.randomizedtesting.ThreadLeakControl$StatementRunner.run(ThreadLeakControl.java:368)
at com.carrotsearch.randomizedtesting.ThreadLeakControl.forkTimeoutingTask(ThreadLeakControl.java:817)
at com.carrotsearch.randomizedtesting.ThreadLeakControl$3.evaluate(ThreadLeakControl.java:468)
at com.carrotsearch.randomizedtesting.RandomizedRunner.runSingleTest(RandomizedRunner.java:943)
at com.carrotsearch.randomizedtesting.RandomizedRunner$5.evaluate(RandomizedRunner.java:829)
at com.carrotsearch.randomizedtesting.RandomizedRunner$6.evaluate(RandomizedRunner.java:879)
at com.carrotsearch.randomizedtesting.RandomizedRunner$7.evaluate(RandomizedRunner.java:890)
at com.carrotsearch.randomizedtesting.rules.StatementAdapter.evaluate(StatementAdapter.java:36)
at com.carrotsearch.randomizedtesting.rules.SystemPropertiesRestoreRule$1.evaluate(SystemPropertiesRestoreRule.java:57)
at org.apache.lucene.util.AbstractBeforeAfterRule$1.evaluate(AbstractBeforeAfterRule.java:45)
at com.carrotsearch.randomizedtesting.rules.StatementAdapter.evaluate(StatementAdapter.java:36)
at org.apache.lucene.util.TestRuleStoreClassName$1.evaluate(TestRuleStoreClassName.java:41)
at com.carrotsearch.randomizedtesting.rules.NoShadowingOrOverridesOnMethodsRule$1.evaluate(NoShadowingOrOverridesOnMethodsRule.java:40)
at com.carrotsearch.randomizedtesting.rules.NoShadowingOrOverridesOnMethodsRule$1.evaluate(NoShadowingOrOverridesOnMethodsRule.java:40)
at com.carrotsearch.randomizedtesting.rules.StatementAdapter.evaluate(StatementAdapter.java:36)
at com.carrotsearch.randomizedtesting.rules.StatementAdapter.evaluate(StatementAdapter.java:36)
at com.carrotsearch.randomizedtesting.rules.StatementAdapter.evaluate(StatementAdapter.java:36)
at org.apache.lucene.util.TestRuleAssertionsRequired$1.evaluate(TestRuleAssertionsRequired.java:53)
at org.apache.lucene.util.TestRuleMarkFailure$1.evaluate(TestRuleMarkFailure.java:47)
at org.apache.lucene.util.TestRuleIgnoreAfterMaxFailures$1.evaluate(TestRuleIgnoreAfterMaxFailures.java:64)
at org.apache.lucene.util.TestRuleIgnoreTestSuites$1.evaluate(TestRuleIgnoreTestSuites.java:54)
at com.carrotsearch.randomizedtesting.rules.StatementAdapter.evaluate(StatementAdapter.java:36)
at com.carrotsearch.randomizedtesting.ThreadLeakControl$StatementRunner.run(ThreadLeakControl.java:368)
at java.lang.Thread.run(Thread.java:748)
FAILED: org.apache.solr.cloud.ZkSolrClientTest.testReconnect
Error Message:
Could not get the port for ZooKeeper server
Stack Trace:
java.lang.RuntimeException: Could not get the port for ZooKeeper server
at org.apache.solr.cloud.ZkTestServer.run(ZkTestServer.java:515)
at org.apache.solr.cloud.ZkSolrClientTest.testReconnect(ZkSolrClientTest.java:116)
at sun.reflect.NativeMethodAccessorImpl.invoke0(Native Method)
at sun.reflect.NativeMethodAccessorImpl.invoke(NativeMethodAccessorImpl.java:62)
at sun.reflect.DelegatingMethodAccessorImpl.invoke(DelegatingMethodAccessorImpl.java:43)
at java.lang.reflect.Method.invoke(Method.java:498)
at com.carrotsearch.randomizedtesting.RandomizedRunner.invoke(RandomizedRunner.java:1737)
at com.carrotsearch.randomizedtesting.RandomizedRunner$8.evaluate(RandomizedRunner.java:934)
at com.carrotsearch.randomizedtesting.RandomizedRunner$9.evaluate(RandomizedRunner.java:970)
at com.carrotsearch.randomizedtesting.RandomizedRunner$10.evaluate(RandomizedRunner.java:984)
at com.carrotsearch.randomizedtesting.rules.SystemPropertiesRestoreRule$1.evaluate(SystemPropertiesRestoreRule.java:57)
at org.apache.lucene.util.TestRuleSetupTeardownChained$1.evaluate(TestRuleSetupTeardownChained.java:49)
at org.apache.lucene.util.AbstractBeforeAfterRule$1.evaluate(AbstractBeforeAfterRule.java:45)
at org.apache.lucene.util.TestRuleThreadAndTestName$1.evaluate(TestRuleThreadAndTestName.java:48)
at org.apache.lucene.util.TestRuleIgnoreAfterMaxFailures$1.evaluate(TestRuleIgnoreAfterMaxFailures.java:64)
at org.apache.lucene.util.TestRuleMarkFailure$1.evaluate(TestRuleMarkFailure.java:47)
at com.carrotsearch.randomizedtesting.rules.StatementAdapter.evaluate(StatementAdapter.java:36)
at com.carrotsearch.randomizedtesting.ThreadLeakControl$StatementRunner.run(ThreadLeakControl.java:368)
at com.carrotsearch.randomizedtesting.ThreadLeakControl.forkTimeoutingTask(ThreadLeakControl.java:817)
at com.carrotsearch.randomizedtesting.ThreadLeakControl$3.evaluate(ThreadLeakControl.java:468)
at com.carrotsearch.randomizedtesting.RandomizedRunner.runSingleTest(RandomizedRunner.java:943)
at com.carrotsearch.randomizedtesting.RandomizedRunner$5.evaluate(RandomizedRunner.java:829)
at com.carrotsearch.randomizedtesting.RandomizedRunner$6.evaluate(RandomizedRunner.java:879)
at com.carrotsearch.randomizedtesting.RandomizedRunner$7.evaluate(RandomizedRunner.java:890)
at com.carrotsearch.randomizedtesting.rules.StatementAdapter.evaluate(StatementAdapter.java:36)
at com.carrotsearch.randomizedtesting.rules.SystemPropertiesRestoreRule$1.evaluate(SystemPropertiesRestoreRule.java:57)
at org.apache.lucene.util.AbstractBeforeAfterRule$1.evaluate(AbstractBeforeAfterRule.java:45)
at com.carrotsearch.randomizedtesting.rules.StatementAdapter.evaluate(StatementAdapter.java:36)
at org.apache.lucene.util.TestRuleStoreClassName$1.evaluate(TestRuleStoreClassName.java:41)
at com.carrotsearch.randomizedtesting.rules.NoShadowingOrOverridesOnMethodsRule$1.evaluate(NoShadowingOrOverridesOnMethodsRule.java:40)
at com.carrotsearch.randomizedtesting.rules.NoShadowingOrOverridesOnMethodsRule$1.evaluate(NoShadowingOrOverridesOnMethodsRule.java:40)
at com.carrotsearch.randomizedtesting.rules.StatementAdapter.evaluate(StatementAdapter.java:36)
at com.carrotsearch.randomizedtesting.rules.StatementAdapter.evaluate(StatementAdapter.java:36)
at com.carrotsearch.randomizedtesting.rules.StatementAdapter.evaluate(StatementAdapter.java:36)
at org.apache.lucene.util.TestRuleAssertionsRequired$1.evaluate(TestRuleAssertionsRequired.java:53)
at org.apache.lucene.util.TestRuleMarkFailure$1.evaluate(TestRuleMarkFailure.java:47)
at org.apache.lucene.util.TestRuleIgnoreAfterMaxFailures$1.evaluate(TestRuleIgnoreAfterMaxFailures.java:64)
at org.apache.lucene.util.TestRuleIgnoreTestSuites$1.evaluate(TestRuleIgnoreTestSuites.java:54)
at com.carrotsearch.randomizedtesting.rules.StatementAdapter.evaluate(StatementAdapter.java:36)
at com.carrotsearch.randomizedtesting.ThreadLeakControl$StatementRunner.run(ThreadLeakControl.java:368)
at java.lang.Thread.run(Thread.java:748)
FAILED: org.apache.solr.cloud.ZkSolrClientTest.testZkCmdExectutor
Error Message:
Could not get the port for ZooKeeper server
Stack Trace:
java.lang.RuntimeException: Could not get the port for ZooKeeper server
at org.apache.solr.cloud.ZkTestServer.run(ZkTestServer.java:515)
at org.apache.solr.cloud.ZkSolrClientTest.testZkCmdExectutor(ZkSolrClientTest.java:199)
at sun.reflect.NativeMethodAccessorImpl.invoke0(Native Method)
at sun.reflect.NativeMethodAccessorImpl.invoke(NativeMethodAccessorImpl.java:62)
at sun.reflect.DelegatingMethodAccessorImpl.invoke(DelegatingMethodAccessorImpl.java:43)
at java.lang.reflect.Method.invoke(Method.java:498)
at com.carrotsearch.randomizedtesting.RandomizedRunner.invoke(RandomizedRunner.java:1737)
at com.carrotsearch.randomizedtesting.RandomizedRunner$8.evaluate(RandomizedRunner.java:934)
at com.carrotsearch.randomizedtesting.RandomizedRunner$9.evaluate(RandomizedRunner.java:970)
at com.carrotsearch.randomizedtesting.RandomizedRunner$10.evaluate(RandomizedRunner.java:984)
at com.carrotsearch.randomizedtesting.rules.SystemPropertiesRestoreRule$1.evaluate(SystemPropertiesRestoreRule.java:57)
at org.apache.lucene.util.TestRuleSetupTeardownChained$1.evaluate(TestRuleSetupTeardownChained.java:49)
at org.apache.lucene.util.AbstractBeforeAfterRule$1.evaluate(AbstractBeforeAfterRule.java:45)
at org.apache.lucene.util.TestRuleThreadAndTestName$1.evaluate(TestRuleThreadAndTestName.java:48)
at org.apache.lucene.util.TestRuleIgnoreAfterMaxFailures$1.evaluate(TestRuleIgnoreAfterMaxFailures.java:64)
at org.apache.lucene.util.TestRuleMarkFailure$1.evaluate(TestRuleMarkFailure.java:47)
at com.carrotsearch.randomizedtesting.rules.StatementAdapter.evaluate(StatementAdapter.java:36)
at com.carrotsearch.randomizedtesting.ThreadLeakControl$StatementRunner.run(ThreadLeakControl.java:368)
at com.carrotsearch.randomizedtesting.ThreadLeakControl.forkTimeoutingTask(ThreadLeakControl.java:817)
at com.carrotsearch.randomizedtesting.ThreadLeakControl$3.evaluate(ThreadLeakControl.java:468)
at com.carrotsearch.randomizedtesting.RandomizedRunner.runSingleTest(RandomizedRunner.java:943)
at com.carrotsearch.randomizedtesting.RandomizedRunner$5.evaluate(RandomizedRunner.java:829)
at com.carrotsearch.randomizedtesting.RandomizedRunner$6.evaluate(RandomizedRunner.java:879)
at com.carrotsearch.randomizedtesting.RandomizedRunner$7.evaluate(RandomizedRunner.java:890)
at com.carrotsearch.randomizedtesting.rules.StatementAdapter.evaluate(StatementAdapter.java:36)
at com.carrotsearch.randomizedtesting.rules.SystemPropertiesRestoreRule$1.evaluate(SystemPropertiesRestoreRule.java:57)
at org.apache.lucene.util.AbstractBeforeAfterRule$1.evaluate(AbstractBeforeAfterRule.java:45)
at com.carrotsearch.randomizedtesting.rules.StatementAdapter.evaluate(StatementAdapter.java:36)
at org.apache.lucene.util.TestRuleStoreClassName$1.evaluate(TestRuleStoreClassName.java:41)
at com.carrotsearch.randomizedtesting.rules.NoShadowingOrOverridesOnMethodsRule$1.evaluate(NoShadowingOrOverridesOnMethodsRule.java:40)
at com.carrotsearch.randomizedtesting.rules.NoShadowingOrOverridesOnMethodsRule$1.evaluate(NoShadowingOrOverridesOnMethodsRule.java:40)
at com.carrotsearch.randomizedtesting.rules.StatementAdapter.evaluate(StatementAdapter.java:36)
at com.carrotsearch.randomizedtesting.rules.StatementAdapter.evaluate(StatementAdapter.java:36)
at com.carrotsearch.randomizedtesting.rules.StatementAdapter.evaluate(StatementAdapter.java:36)
at org.apache.lucene.util.TestRuleAssertionsRequired$1.evaluate(TestRuleAssertionsRequired.java:53)
at org.apache.lucene.util.TestRuleMarkFailure$1.evaluate(TestRuleMarkFailure.java:47)
at org.apache.lucene.util.TestRuleIgnoreAfterMaxFailures$1.evaluate(TestRuleIgnoreAfterMaxFailures.java:64)
at org.apache.lucene.util.TestRuleIgnoreTestSuites$1.evaluate(TestRuleIgnoreTestSuites.java:54)
at com.carrotsearch.randomizedtesting.rules.StatementAdapter.evaluate(StatementAdapter.java:36)
at com.carrotsearch.randomizedtesting.ThreadLeakControl$StatementRunner.run(ThreadLeakControl.java:368)
at java.lang.Thread.run(Thread.java:748)
FAILED: org.apache.solr.cloud.ZkSolrClientTest.testMultipleWatchesAsync
Error Message:
Could not get the port for ZooKeeper server
Stack Trace:
java.lang.RuntimeException: Could not get the port for ZooKeeper server
at org.apache.solr.cloud.ZkTestServer.run(ZkTestServer.java:515)
at org.apache.solr.cloud.ZkSolrClientTest$ZkConnection.<init>(ZkSolrClientTest.java:55)
at org.apache.solr.cloud.ZkSolrClientTest$ZkConnection.<init>(ZkSolrClientTest.java:49)
at org.apache.solr.cloud.ZkSolrClientTest.testMultipleWatchesAsync(ZkSolrClientTest.java:230)
at sun.reflect.NativeMethodAccessorImpl.invoke0(Native Method)
at sun.reflect.NativeMethodAccessorImpl.invoke(NativeMethodAccessorImpl.java:62)
at sun.reflect.DelegatingMethodAccessorImpl.invoke(DelegatingMethodAccessorImpl.java:43)
at java.lang.reflect.Method.invoke(Method.java:498)
at com.carrotsearch.randomizedtesting.RandomizedRunner.invoke(RandomizedRunner.java:1737)
at com.carrotsearch.randomizedtesting.RandomizedRunner$8.evaluate(RandomizedRunner.java:934)
at com.carrotsearch.randomizedtesting.RandomizedRunner$9.evaluate(RandomizedRunner.java:970)
at com.carrotsearch.randomizedtesting.RandomizedRunner$10.evaluate(RandomizedRunner.java:984)
at com.carrotsearch.randomizedtesting.rules.SystemPropertiesRestoreRule$1.evaluate(SystemPropertiesRestoreRule.java:57)
at org.apache.lucene.util.TestRuleSetupTeardownChained$1.evaluate(TestRuleSetupTeardownChained.java:49)
at org.apache.lucene.util.AbstractBeforeAfterRule$1.evaluate(AbstractBeforeAfterRule.java:45)
at org.apache.lucene.util.TestRuleThreadAndTestName$1.evaluate(TestRuleThreadAndTestName.java:48)
at org.apache.lucene.util.TestRuleIgnoreAfterMaxFailures$1.evaluate(TestRuleIgnoreAfterMaxFailures.java:64)
at org.apache.lucene.util.TestRuleMarkFailure$1.evaluate(TestRuleMarkFailure.java:47)
at com.carrotsearch.randomizedtesting.rules.StatementAdapter.evaluate(StatementAdapter.java:36)
at com.carrotsearch.randomizedtesting.ThreadLeakControl$StatementRunner.run(ThreadLeakControl.java:368)
at com.carrotsearch.randomizedtesting.ThreadLeakControl.forkTimeoutingTask(ThreadLeakControl.java:817)
at com.carrotsearch.randomizedtesting.ThreadLeakControl$3.evaluate(ThreadLeakControl.java:468)
at com.carrotsearch.randomizedtesting.RandomizedRunner.runSingleTest(RandomizedRunner.java:943)
at com.carrotsearch.randomizedtesting.RandomizedRunner$5.evaluate(RandomizedRunner.java:829)
at com.carrotsearch.randomizedtesting.RandomizedRunner$6.evaluate(RandomizedRunner.java:879)
at com.carrotsearch.randomizedtesting.RandomizedRunner$7.evaluate(RandomizedRunner.java:890)
at com.carrotsearch.randomizedtesting.rules.StatementAdapter.evaluate(StatementAdapter.java:36)
at com.carrotsearch.randomizedtesting.rules.SystemPropertiesRestoreRule$1.evaluate(SystemPropertiesRestoreRule.java:57)
at org.apache.lucene.util.AbstractBeforeAfterRule$1.evaluate(AbstractBeforeAfterRule.java:45)
at com.carrotsearch.randomizedtesting.rules.StatementAdapter.evaluate(StatementAdapter.java:36)
at org.apache.lucene.util.TestRuleStoreClassName$1.evaluate(TestRuleStoreClassName.java:41)
at com.carrotsearch.randomizedtesting.rules.NoShadowingOrOverridesOnMethodsRule$1.evaluate(NoShadowingOrOverridesOnMethodsRule.java:40)
at com.carrotsearch.randomizedtesting.rules.NoShadowingOrOverridesOnMethodsRule$1.evaluate(NoShadowingOrOverridesOnMethodsRule.java:40)
at com.carrotsearch.randomizedtesting.rules.StatementAdapter.evaluate(StatementAdapter.java:36)
at com.carrotsearch.randomizedtesting.rules.StatementAdapter.evaluate(StatementAdapter.java:36)
at com.carrotsearch.randomizedtesting.rules.StatementAdapter.evaluate(StatementAdapter.java:36)
at org.apache.lucene.util.TestRuleAssertionsRequired$1.evaluate(TestRuleAssertionsRequired.java:53)
at org.apache.lucene.util.TestRuleMarkFailure$1.evaluate(TestRuleMarkFailure.java:47)
at org.apache.lucene.util.TestRuleIgnoreAfterMaxFailures$1.evaluate(TestRuleIgnoreAfterMaxFailures.java:64)
at org.apache.lucene.util.TestRuleIgnoreTestSuites$1.evaluate(TestRuleIgnoreTestSuites.java:54)
at com.carrotsearch.randomizedtesting.rules.StatementAdapter.evaluate(StatementAdapter.java:36)
at com.carrotsearch.randomizedtesting.ThreadLeakControl$StatementRunner.run(ThreadLeakControl.java:368)
at java.lang.Thread.run(Thread.java:748)
FAILED: junit.framework.TestSuite.org.apache.solr.cloud.ZkSolrClientTest
Error Message:
8 threads leaked from SUITE scope at org.apache.solr.cloud.ZkSolrClientTest: 1) Thread[id=11694, name=ProcessThread(sid:0 cport:50648):, state=WAITING, group=TGRP-ZkSolrClientTest] at sun.misc.Unsafe.park(Native Method) at java.util.concurrent.locks.LockSupport.park(LockSupport.java:175) at java.util.concurrent.locks.AbstractQueuedSynchronizer$ConditionObject.await(AbstractQueuedSynchronizer.java:2039) at java.util.concurrent.LinkedBlockingQueue.take(LinkedBlockingQueue.java:442) at org.apache.zookeeper.server.PrepRequestProcessor.run(PrepRequestProcessor.java:122) 2) Thread[id=11698, name=NIOServerCxn.Factory:0.0.0.0/0.0.0.0:0, state=RUNNABLE, group=TGRP-ZkSolrClientTest] at sun.nio.ch.KQueueArrayWrapper.kevent0(Native Method) at sun.nio.ch.KQueueArrayWrapper.poll(KQueueArrayWrapper.java:198) at sun.nio.ch.KQueueSelectorImpl.doSelect(KQueueSelectorImpl.java:117) at sun.nio.ch.SelectorImpl.lockAndDoSelect(SelectorImpl.java:86) at sun.nio.ch.SelectorImpl.select(SelectorImpl.java:97) at org.apache.zookeeper.server.NIOServerCnxnFactory.run(NIOServerCnxnFactory.java:173) at java.lang.Thread.run(Thread.java:748) 3) Thread[id=11690, name=Thread-1990, state=WAITING, group=TGRP-ZkSolrClientTest] at java.lang.Object.wait(Native Method) at java.lang.Thread.join(Thread.java:1252) at java.lang.Thread.join(Thread.java:1326) at org.apache.zookeeper.server.NIOServerCnxnFactory.join(NIOServerCnxnFactory.java:297) at org.apache.solr.cloud.ZkTestServer$ZKServerMain.runFromConfig(ZkTestServer.java:309) at org.apache.solr.cloud.ZkTestServer$2.run(ZkTestServer.java:490) 4) Thread[id=11691, name=NIOServerCxn.Factory:0.0.0.0/0.0.0.0:0, state=RUNNABLE, group=TGRP-ZkSolrClientTest] at sun.nio.ch.KQueueArrayWrapper.kevent0(Native Method) at sun.nio.ch.KQueueArrayWrapper.poll(KQueueArrayWrapper.java:198) at sun.nio.ch.KQueueSelectorImpl.doSelect(KQueueSelectorImpl.java:117) at sun.nio.ch.SelectorImpl.lockAndDoSelect(SelectorImpl.java:86) at sun.nio.ch.SelectorImpl.select(SelectorImpl.java:97) at org.apache.zookeeper.server.NIOServerCnxnFactory.run(NIOServerCnxnFactory.java:173) at java.lang.Thread.run(Thread.java:748) 5) Thread[id=11692, name=SessionTracker, state=TIMED_WAITING, group=TGRP-ZkSolrClientTest] at java.lang.Object.wait(Native Method) at org.apache.zookeeper.server.SessionTrackerImpl.run(SessionTrackerImpl.java:146) 6) Thread[id=11701, name=ProcessThread(sid:0 cport:50799):, state=WAITING, group=TGRP-ZkSolrClientTest] at sun.misc.Unsafe.park(Native Method) at java.util.concurrent.locks.LockSupport.park(LockSupport.java:175) at java.util.concurrent.locks.AbstractQueuedSynchronizer$ConditionObject.await(AbstractQueuedSynchronizer.java:2039) at java.util.concurrent.LinkedBlockingQueue.take(LinkedBlockingQueue.java:442) at org.apache.zookeeper.server.PrepRequestProcessor.run(PrepRequestProcessor.java:122) 7) Thread[id=11699, name=SessionTracker, state=TIMED_WAITING, group=TGRP-ZkSolrClientTest] at java.lang.Object.wait(Native Method) at org.apache.zookeeper.server.SessionTrackerImpl.run(SessionTrackerImpl.java:146) 8) Thread[id=11697, name=Thread-1991, state=WAITING, group=TGRP-ZkSolrClientTest] at java.lang.Object.wait(Native Method) at java.lang.Thread.join(Thread.java:1252) at java.lang.Thread.join(Thread.java:1326) at org.apache.zookeeper.server.NIOServerCnxnFactory.join(NIOServerCnxnFactory.java:297) at org.apache.solr.cloud.ZkTestServer$ZKServerMain.runFromConfig(ZkTestServer.java:309) at org.apache.solr.cloud.ZkTestServer$2.run(ZkTestServer.java:490)
Stack Trace:
com.carrotsearch.randomizedtesting.ThreadLeakError: 8 threads leaked from SUITE scope at org.apache.solr.cloud.ZkSolrClientTest:
1) Thread[id=11694, name=ProcessThread(sid:0 cport:50648):, state=WAITING, group=TGRP-ZkSolrClientTest]
at sun.misc.Unsafe.park(Native Method)
at java.util.concurrent.locks.LockSupport.park(LockSupport.java:175)
at java.util.concurrent.locks.AbstractQueuedSynchronizer$ConditionObject.await(AbstractQueuedSynchronizer.java:2039)
at java.util.concurrent.LinkedBlockingQueue.take(LinkedBlockingQueue.java:442)
at org.apache.zookeeper.server.PrepRequestProcessor.run(PrepRequestProcessor.java:122)
2) Thread[id=11698, name=NIOServerCxn.Factory:0.0.0.0/0.0.0.0:0, state=RUNNABLE, group=TGRP-ZkSolrClientTest]
at sun.nio.ch.KQueueArrayWrapper.kevent0(Native Method)
at sun.nio.ch.KQueueArrayWrapper.poll(KQueueArrayWrapper.java:198)
at sun.nio.ch.KQueueSelectorImpl.doSelect(KQueueSelectorImpl.java:117)
at sun.nio.ch.SelectorImpl.lockAndDoSelect(SelectorImpl.java:86)
at sun.nio.ch.SelectorImpl.select(SelectorImpl.java:97)
at org.apache.zookeeper.server.NIOServerCnxnFactory.run(NIOServerCnxnFactory.java:173)
at java.lang.Thread.run(Thread.java:748)
3) Thread[id=11690, name=Thread-1990, state=WAITING, group=TGRP-ZkSolrClientTest]
at java.lang.Object.wait(Native Method)
at java.lang.Thread.join(Thread.java:1252)
at java.lang.Thread.join(Thread.java:1326)
at org.apache.zookeeper.server.NIOServerCnxnFactory.join(NIOServerCnxnFactory.java:297)
at org.apache.solr.cloud.ZkTestServer$ZKServerMain.runFromConfig(ZkTestServer.java:309)
at org.apache.solr.cloud.ZkTestServer$2.run(ZkTestServer.java:490)
4) Thread[id=11691, name=NIOServerCxn.Factory:0.0.0.0/0.0.0.0:0, state=RUNNABLE, group=TGRP-ZkSolrClientTest]
at sun.nio.ch.KQueueArrayWrapper.kevent0(Native Method)
at sun.nio.ch.KQueueArrayWrapper.poll(KQueueArrayWrapper.java:198)
at sun.nio.ch.KQueueSelectorImpl.doSelect(KQueueSelectorImpl.java:117)
at sun.nio.ch.SelectorImpl.lockAndDoSelect(SelectorImpl.java:86)
at sun.nio.ch.SelectorImpl.select(SelectorImpl.java:97)
at org.apache.zookeeper.server.NIOServerCnxnFactory.run(NIOServerCnxnFactory.java:173)
at java.lang.Thread.run(Thread.java:748)
5) Thread[id=11692, name=SessionTracker, state=TIMED_WAITING, group=TGRP-ZkSolrClientTest]
at java.lang.Object.wait(Native Method
[...truncated too long message...]
n(URLClassLoader.java:368)
[junit4] > ... 12 more
[junit4] Completed [261/745 (63!)] on J1 in 0.00s, 0 tests, 1 error <<< FAILURES!
[...truncated 1 lines...]
[junit4] Suite: org.apache.solr.search.TestRandomCollapseQParserPlugin
[junit4] ERROR 0.00s J1 | TestRandomCollapseQParserPlugin (suite) <<<
[junit4] > Throwable #1: java.lang.ClassNotFoundException: org.apache.solr.search.TestRandomCollapseQParserPlugin
[junit4] > at java.net.URLClassLoader$1.run(URLClassLoader.java:370)
[junit4] > at java.net.URLClassLoader$1.run(URLClassLoader.java:362)
[junit4] > at java.security.AccessController.doPrivileged(Native Method)
[junit4] > at java.net.URLClassLoader.findClass(URLClassLoader.java:361)
[junit4] > at java.lang.ClassLoader.loadClass(ClassLoader.java:424)
[junit4] > at sun.misc.Launcher$AppClassLoader.loadClass(Launcher.java:335)
[junit4] > at java.lang.ClassLoader.loadClass(ClassLoader.java:357)
[junit4] > at java.lang.Class.forName0(Native Method)
[junit4] > at java.lang.Class.forName(Class.java:348)
[junit4] > Caused by: java.io.FileNotFoundException: /Users/jenkins/workspace/Lucene-Solr-master-MacOSX/solr/build/solr-core/classes/test/org/apache/solr/search/TestRandomCollapseQParserPlugin.class (Too many open files)
[junit4] > at java.io.FileInputStream.open0(Native Method)
[junit4] > at java.io.FileInputStream.open(FileInputStream.java:195)
[junit4] > at java.io.FileInputStream.<init>(FileInputStream.java:138)
[junit4] > at sun.misc.URLClassPath$FileLoader$1.getInputStream(URLClassPath.java:1288)
[junit4] > at sun.misc.Resource.cachedInputStream(Resource.java:77)
[junit4] > at sun.misc.Resource.getByteBuffer(Resource.java:160)
[junit4] > at java.net.URLClassLoader.defineClass(URLClassLoader.java:454)
[junit4] > at java.net.URLClassLoader.access$100(URLClassLoader.java:73)
[junit4] > at java.net.URLClassLoader$1.run(URLClassLoader.java:368)
[junit4] > ... 12 more
[junit4] Completed [262/745 (64!)] on J1 in 0.00s, 0 tests, 1 error <<< FAILURES!
[...truncated 1 lines...]
[junit4] Suite: org.apache.solr.search.TestFiltering
[junit4] ERROR 0.00s J1 | TestFiltering (suite) <<<
[junit4] > Throwable #1: java.lang.ClassNotFoundException: org.apache.solr.search.TestFiltering
[junit4] > at java.net.URLClassLoader$1.run(URLClassLoader.java:370)
[junit4] > at java.net.URLClassLoader$1.run(URLClassLoader.java:362)
[junit4] > at java.security.AccessController.doPrivileged(Native Method)
[junit4] > at java.net.URLClassLoader.findClass(URLClassLoader.java:361)
[junit4] > at java.lang.ClassLoader.loadClass(ClassLoader.java:424)
[junit4] > at sun.misc.Launcher$AppClassLoader.loadClass(Launcher.java:335)
[junit4] > at java.lang.ClassLoader.loadClass(ClassLoader.java:357)
[junit4] > at java.lang.Class.forName0(Native Method)
[junit4] > at java.lang.Class.forName(Class.java:348)
[junit4] > Caused by: java.io.FileNotFoundException: /Users/jenkins/workspace/Lucene-Solr-master-MacOSX/solr/build/solr-core/classes/test/org/apache/solr/search/TestFiltering.class (Too many open files)
[junit4] > at java.io.FileInputStream.open0(Native Method)
[junit4] > at java.io.FileInputStream.open(FileInputStream.java:195)
[junit4] > at java.io.FileInputStream.<init>(FileInputStream.java:138)
[junit4] > at sun.misc.URLClassPath$FileLoader$1.getInputStream(URLClassPath.java:1288)
[junit4] > at sun.misc.Resource.cachedInputStream(Resource.java:77)
[junit4] > at sun.misc.Resource.getByteBuffer(Resource.java:160)
[junit4] > at java.net.URLClassLoader.defineClass(URLClassLoader.java:454)
[junit4] > at java.net.URLClassLoader.access$100(URLClassLoader.java:73)
[junit4] > at java.net.URLClassLoader$1.run(URLClassLoader.java:368)
[junit4] > ... 12 more
[junit4] Completed [263/745 (65!)] on J1 in 0.00s, 0 tests, 1 error <<< FAILURES!
[...truncated 1 lines...]
[junit4] Suite: org.apache.solr.cloud.DeleteShardTest
[junit4] ERROR 0.00s J1 | DeleteShardTest (suite) <<<
[junit4] > Throwable #1: java.lang.ClassNotFoundException: org.apache.solr.cloud.DeleteShardTest
[junit4] > at java.net.URLClassLoader$1.run(URLClassLoader.java:370)
[junit4] > at java.net.URLClassLoader$1.run(URLClassLoader.java:362)
[junit4] > at java.security.AccessController.doPrivileged(Native Method)
[junit4] > at java.net.URLClassLoader.findClass(URLClassLoader.java:361)
[junit4] > at java.lang.ClassLoader.loadClass(ClassLoader.java:424)
[junit4] > at sun.misc.Launcher$AppClassLoader.loadClass(Launcher.java:335)
[junit4] > at java.lang.ClassLoader.loadClass(ClassLoader.java:357)
[junit4] > at java.lang.Class.forName0(Native Method)
[junit4] > at java.lang.Class.forName(Class.java:348)
[junit4] > Caused by: java.io.FileNotFoundException: /Users/jenkins/workspace/Lucene-Solr-master-MacOSX/solr/build/solr-core/classes/test/org/apache/solr/cloud/DeleteShardTest.class (Too many open files)
[junit4] > at java.io.FileInputStream.open0(Native Method)
[junit4] > at java.io.FileInputStream.open(FileInputStream.java:195)
[junit4] > at java.io.FileInputStream.<init>(FileInputStream.java:138)
[junit4] > at sun.misc.URLClassPath$FileLoader$1.getInputStream(URLClassPath.java:1288)
[junit4] > at sun.misc.Resource.cachedInputStream(Resource.java:77)
[junit4] > at sun.misc.Resource.getByteBuffer(Resource.java:160)
[junit4] > at java.net.URLClassLoader.defineClass(URLClassLoader.java:454)
[junit4] > at java.net.URLClassLoader.access$100(URLClassLoader.java:73)
[junit4] > at java.net.URLClassLoader$1.run(URLClassLoader.java:368)
[junit4] > ... 12 more
[junit4] Completed [264/745 (66!)] on J1 in 0.00s, 0 tests, 1 error <<< FAILURES!
[...truncated 1 lines...]
[junit4] Suite: org.apache.solr.cloud.CollectionReloadTest
[junit4] ERROR 0.00s J1 | CollectionReloadTest (suite) <<<
[junit4] > Throwable #1: java.lang.ClassNotFoundException: org.apache.solr.cloud.CollectionReloadTest
[junit4] > at java.net.URLClassLoader$1.run(URLClassLoader.java:370)
[junit4] > at java.net.URLClassLoader$1.run(URLClassLoader.java:362)
[junit4] > at java.security.AccessController.doPrivileged(Native Method)
[junit4] > at java.net.URLClassLoader.findClass(URLClassLoader.java:361)
[junit4] > at java.lang.ClassLoader.loadClass(ClassLoader.java:424)
[junit4] > at sun.misc.Launcher$AppClassLoader.loadClass(Launcher.java:335)
[junit4] > at java.lang.ClassLoader.loadClass(ClassLoader.java:357)
[junit4] > at java.lang.Class.forName0(Native Method)
[junit4] > at java.lang.Class.forName(Class.java:348)
[junit4] > Caused by: java.io.FileNotFoundException: /Users/jenkins/workspace/Lucene-Solr-master-MacOSX/solr/build/solr-core/classes/test/org/apache/solr/cloud/CollectionReloadTest.class (Too many open files)
[junit4] > at java.io.FileInputStream.open0(Native Method)
[junit4] > at java.io.FileInputStream.open(FileInputStream.java:195)
[junit4] > at java.io.FileInputStream.<init>(FileInputStream.java:138)
[junit4] > at sun.misc.URLClassPath$FileLoader$1.getInputStream(URLClassPath.java:1288)
[junit4] > at sun.misc.Resource.cachedInputStream(Resource.java:77)
[junit4] > at sun.misc.Resource.getByteBuffer(Resource.java:160)
[junit4] > at java.net.URLClassLoader.defineClass(URLClassLoader.java:454)
[junit4] > at java.net.URLClassLoader.access$100(URLClassLoader.java:73)
[junit4] > at java.net.URLClassLoader$1.run(URLClassLoader.java:368)
[junit4] > ... 12 more
[junit4] Completed [265/745 (67!)] on J1 in 0.00s, 0 tests, 1 error <<< FAILURES!
[...truncated 4 lines...]
[junit4] Suite: org.apache.solr.handler.component.SuggestComponentTest
[junit4] ERROR 0.00s J1 | SuggestComponentTest (suite) <<<
[junit4] > Throwable #1: java.lang.ClassNotFoundException: org.apache.solr.handler.component.SuggestComponentTest
[junit4] > at java.net.URLClassLoader$1.run(URLClassLoader.java:370)
[junit4] > at java.net.URLClassLoader$1.run(URLClassLoader.java:362)
[junit4] > at java.security.AccessController.doPrivileged(Native Method)
[junit4] > at java.net.URLClassLoader.findClass(URLClassLoader.java:361)
[junit4] > at java.lang.ClassLoader.loadClass(ClassLoader.java:424)
[junit4] > at sun.misc.Launcher$AppClassLoader.loadClass(Launcher.java:335)
[junit4] > at java.lang.ClassLoader.loadClass(ClassLoader.java:357)
[junit4] > at java.lang.Class.forName0(Native Method)
[junit4] > at java.lang.Class.forName(Class.java:348)
[junit4] > Caused by: java.io.FileNotFoundException: /Users/jenkins/workspace/Lucene-Solr-master-MacOSX/solr/build/solr-core/classes/test/org/apache/solr/handler/component/SuggestComponentTest.class (Too many open files)
[junit4] > at java.io.FileInputStream.open0(Native Method)
[junit4] > at java.io.FileInputStream.open(FileInputStream.java:195)
[junit4] > at java.io.FileInputStream.<init>(FileInputStream.java:138)
[junit4] > at sun.misc.URLClassPath$FileLoader$1.getInputStream(URLClassPath.java:1288)
[junit4] > at sun.misc.Resource.cachedInputStream(Resource.java:77)
[junit4] > at sun.misc.Resource.getByteBuffer(Resource.java:160)
[junit4] > at java.net.URLClassLoader.defineClass(URLClassLoader.java:454)
[junit4] > at java.net.URLClassLoader.access$100(URLClassLoader.java:73)
[junit4] > at java.net.URLClassLoader$1.run(URLClassLoader.java:368)
[junit4] > ... 12 more
[junit4] Completed [267/745 (68!)] on J1 in 0.00s, 0 tests, 1 error <<< FAILURES!
[...truncated 48513 lines...]