You are viewing a plain text version of this content. The canonical link for it is here.
Posted to commits@phoenix.apache.org by Apache Jenkins Server <je...@builds.apache.org> on 2018/07/13 03:33:46 UTC

Build failed in Jenkins: Phoenix-5.x-HBase-2.0 #10

See <https://builds.apache.org/job/Phoenix-5.x-HBase-2.0/10/display/redirect?page=changes>

Changes:

[jamestaylor] Revert "PHOENIX-4790 Addendum to check that query is a point lookup for

[jamestaylor] Revert "PHOENIX-4790 Simplify check for client side delete"

------------------------------------------
[...truncated 1.20 MB...]
[INFO] Running org.apache.phoenix.jdbc.PhoenixPreparedStatementTest
[INFO] Tests run: 4, Failures: 0, Errors: 0, Skipped: 0, Time elapsed: 0.74 s - in org.apache.phoenix.jdbc.PhoenixEmbeddedDriverTest
[INFO] Running org.apache.phoenix.jdbc.SecureUserConnectionsTest
[INFO] Tests run: 3, Failures: 0, Errors: 0, Skipped: 0, Time elapsed: 4.143 s - in org.apache.phoenix.hbase.index.covered.NonTxIndexBuilderTest
[INFO] Running org.apache.phoenix.jdbc.ReadOnlyPropertiesTest
[INFO] Tests run: 8, Failures: 0, Errors: 0, Skipped: 0, Time elapsed: 0.502 s - in org.apache.phoenix.jdbc.PhoenixPreparedStatementTest
[INFO] Running org.apache.phoenix.jdbc.PhoenixDriverTest
[INFO] Tests run: 4, Failures: 0, Errors: 0, Skipped: 0, Time elapsed: 0.028 s - in org.apache.phoenix.jdbc.ReadOnlyPropertiesTest
[INFO] Running org.apache.phoenix.mapreduce.CsvToKeyValueMapperTest
[INFO] Tests run: 2, Failures: 0, Errors: 0, Skipped: 0, Time elapsed: 0.028 s - in org.apache.phoenix.mapreduce.CsvToKeyValueMapperTest
[INFO] Running org.apache.phoenix.mapreduce.CsvBulkImportUtilTest
[INFO] Tests run: 4, Failures: 0, Errors: 0, Skipped: 0, Time elapsed: 2.127 s - in org.apache.phoenix.util.csv.StringToArrayConverterTest
[INFO] Running org.apache.phoenix.mapreduce.util.PhoenixConfigurationUtilTest
[INFO] Tests run: 1, Failures: 0, Errors: 0, Skipped: 0, Time elapsed: 1.023 s - in org.apache.phoenix.jdbc.PhoenixResultSetMetadataTest
[INFO] Running org.apache.phoenix.mapreduce.util.ColumnInfoToStringEncoderDecoderTest
[INFO] Tests run: 2, Failures: 0, Errors: 0, Skipped: 0, Time elapsed: 0.047 s - in org.apache.phoenix.mapreduce.util.ColumnInfoToStringEncoderDecoderTest
[INFO] Running org.apache.phoenix.mapreduce.util.IndexColumnNamesTest
[INFO] Tests run: 12, Failures: 0, Errors: 0, Skipped: 0, Time elapsed: 2.144 s - in org.apache.phoenix.util.PhoenixRuntimeTest
[INFO] Running org.apache.phoenix.mapreduce.BulkLoadToolTest
[INFO] Tests run: 12, Failures: 0, Errors: 0, Skipped: 0, Time elapsed: 0.06 s - in org.apache.phoenix.mapreduce.BulkLoadToolTest
[INFO] Running org.apache.phoenix.mapreduce.bulkload.TestTableRowkeyPair
[INFO] Tests run: 1, Failures: 0, Errors: 0, Skipped: 0, Time elapsed: 0.008 s - in org.apache.phoenix.mapreduce.bulkload.TestTableRowkeyPair
[INFO] Running org.apache.phoenix.mapreduce.FormatToBytesWritableMapperTest
[INFO] Tests run: 5, Failures: 0, Errors: 0, Skipped: 0, Time elapsed: 0.145 s - in org.apache.phoenix.mapreduce.FormatToBytesWritableMapperTest
[INFO] Running org.apache.phoenix.mapreduce.index.IndexScrutinyTableOutputTest
[INFO] Tests run: 5, Failures: 0, Errors: 0, Skipped: 0, Time elapsed: 0.758 s - in org.apache.phoenix.mapreduce.CsvBulkImportUtilTest
[INFO] Running org.apache.phoenix.schema.RowKeySchemaTest
[WARNING] Tests run: 7, Failures: 0, Errors: 0, Skipped: 1, Time elapsed: 0.964 s - in org.apache.phoenix.jdbc.PhoenixDriverTest
[INFO] Running org.apache.phoenix.schema.SaltingUtilTest
[INFO] Tests run: 2, Failures: 0, Errors: 0, Skipped: 0, Time elapsed: 0.001 s - in org.apache.phoenix.schema.SaltingUtilTest
[INFO] Running org.apache.phoenix.schema.SequenceAllocationTest
[INFO] Tests run: 2, Failures: 0, Errors: 0, Skipped: 0, Time elapsed: 0.747 s - in org.apache.phoenix.mapreduce.util.IndexColumnNamesTest
[INFO] Running org.apache.phoenix.schema.types.PDataTypeForArraysTest
[INFO] Tests run: 2, Failures: 0, Errors: 0, Skipped: 0, Time elapsed: 0.014 s - in org.apache.phoenix.schema.SequenceAllocationTest
[INFO] Running org.apache.phoenix.schema.types.PrimitiveBytePhoenixArrayToStringTest
[INFO] Tests run: 6, Failures: 0, Errors: 0, Skipped: 0, Time elapsed: 0.009 s - in org.apache.phoenix.schema.types.PrimitiveBytePhoenixArrayToStringTest
[INFO] Running org.apache.phoenix.schema.types.PrimitiveShortPhoenixArrayToStringTest
[INFO] Tests run: 5, Failures: 0, Errors: 0, Skipped: 0, Time elapsed: 0.459 s - in org.apache.phoenix.mapreduce.index.IndexScrutinyTableOutputTest
[INFO] Tests run: 6, Failures: 0, Errors: 0, Skipped: 0, Time elapsed: 0.016 s - in org.apache.phoenix.schema.types.PrimitiveShortPhoenixArrayToStringTest
[INFO] Running org.apache.phoenix.schema.types.PDataTypeTest
[INFO] Running org.apache.phoenix.schema.types.PrimitiveBooleanPhoenixArrayToStringTest
[INFO] Tests run: 6, Failures: 0, Errors: 0, Skipped: 0, Time elapsed: 0.004 s - in org.apache.phoenix.schema.types.PrimitiveBooleanPhoenixArrayToStringTest
[INFO] Running org.apache.phoenix.schema.types.PrimitiveDoublePhoenixArrayToStringTest
[INFO] Tests run: 6, Failures: 0, Errors: 0, Skipped: 0, Time elapsed: 0 s - in org.apache.phoenix.schema.types.PrimitiveDoublePhoenixArrayToStringTest
[INFO] Tests run: 8, Failures: 0, Errors: 0, Skipped: 0, Time elapsed: 3.062 s - in org.apache.phoenix.util.csv.CsvUpsertExecutorTest
[INFO] Running org.apache.phoenix.schema.types.PVarcharArrayToStringTest
[INFO] Running org.apache.phoenix.schema.types.PrimitiveLongPhoenixArrayToStringTest
[INFO] Tests run: 6, Failures: 0, Errors: 0, Skipped: 0, Time elapsed: 0 s - in org.apache.phoenix.schema.types.PrimitiveLongPhoenixArrayToStringTest
[INFO] Running org.apache.phoenix.schema.types.PrimitiveFloatPhoenixArrayToStringTest
[INFO] Tests run: 6, Failures: 0, Errors: 0, Skipped: 0, Time elapsed: 0.004 s - in org.apache.phoenix.schema.types.PrimitiveFloatPhoenixArrayToStringTest
[INFO] Running org.apache.phoenix.schema.types.PrimitiveIntPhoenixArrayToStringTest
[INFO] Tests run: 6, Failures: 0, Errors: 0, Skipped: 0, Time elapsed: 0.004 s - in org.apache.phoenix.schema.types.PrimitiveIntPhoenixArrayToStringTest
[INFO] Running org.apache.phoenix.schema.types.PDateArrayToStringTest
[ERROR] Tests run: 1, Failures: 0, Errors: 1, Skipped: 0, Time elapsed: 1.518 s <<< FAILURE! - in org.apache.phoenix.jdbc.SecureUserConnectionsTest
[ERROR] org.apache.phoenix.jdbc.SecureUserConnectionsTest  Time elapsed: 1.515 s  <<< ERROR!
java.lang.IllegalArgumentException: Can't get Kerberos realm
	at org.apache.phoenix.jdbc.SecureUserConnectionsTest.setupKdc(SecureUserConnectionsTest.java:101)
Caused by: java.lang.reflect.InvocationTargetException
	at org.apache.phoenix.jdbc.SecureUserConnectionsTest.setupKdc(SecureUserConnectionsTest.java:101)
Caused by: sun.security.krb5.KrbException: Cannot locate default realm
	at org.apache.phoenix.jdbc.SecureUserConnectionsTest.setupKdc(SecureUserConnectionsTest.java:101)

[INFO] Tests run: 6, Failures: 0, Errors: 0, Skipped: 0, Time elapsed: 0.013 s - in org.apache.phoenix.schema.types.PDateArrayToStringTest
[INFO] Running org.apache.phoenix.schema.ImmutableStorageSchemeTest
[INFO] Running org.apache.phoenix.schema.RowKeyValueAccessorTest
[INFO] Tests run: 8, Failures: 0, Errors: 0, Skipped: 0, Time elapsed: 0.035 s - in org.apache.phoenix.schema.types.PVarcharArrayToStringTest
[INFO] Running org.apache.phoenix.schema.SortOrderTest
[INFO] Tests run: 8, Failures: 0, Errors: 0, Skipped: 0, Time elapsed: 0.01 s - in org.apache.phoenix.schema.SortOrderTest
[INFO] Running org.apache.phoenix.schema.PMetaDataImplTest
[INFO] Tests run: 6, Failures: 0, Errors: 0, Skipped: 0, Time elapsed: 0.062 s - in org.apache.phoenix.schema.PMetaDataImplTest
[INFO] Running org.apache.phoenix.schema.PCharPadTest
[INFO] Tests run: 69, Failures: 0, Errors: 0, Skipped: 0, Time elapsed: 0.194 s - in org.apache.phoenix.schema.types.PDataTypeForArraysTest
[INFO] Running org.apache.phoenix.schema.MutationTest
[INFO] Tests run: 9, Failures: 0, Errors: 0, Skipped: 0, Time elapsed: 0.009 s - in org.apache.phoenix.schema.PCharPadTest
[INFO] Tests run: 9, Failures: 0, Errors: 0, Skipped: 0, Time elapsed: 1.118 s - in org.apache.phoenix.mapreduce.util.PhoenixConfigurationUtilTest
[INFO] Running org.apache.phoenix.schema.SystemSplitPolicyTest
[INFO] Running org.apache.phoenix.schema.ValueBitSetTest
[INFO] Tests run: 4, Failures: 0, Errors: 0, Skipped: 0, Time elapsed: 0.014 s - in org.apache.phoenix.schema.ValueBitSetTest
[INFO] Running org.apache.phoenix.schema.stats.StatisticsScannerTest
[INFO] Tests run: 2, Failures: 0, Errors: 0, Skipped: 0, Time elapsed: 0.03 s - in org.apache.phoenix.schema.SystemSplitPolicyTest
[INFO] Running org.apache.phoenix.schema.SchemaUtilTest
[INFO] Tests run: 6, Failures: 0, Errors: 0, Skipped: 0, Time elapsed: 0.001 s - in org.apache.phoenix.schema.SchemaUtilTest
[INFO] Running org.apache.phoenix.iterate.AggregateResultScannerTest
[INFO] Tests run: 36, Failures: 0, Errors: 0, Skipped: 0, Time elapsed: 0.222 s - in org.apache.phoenix.schema.types.PDataTypeTest
[INFO] Running org.apache.phoenix.iterate.SpoolingResultIteratorTest
[INFO] Tests run: 3, Failures: 0, Errors: 0, Skipped: 0, Time elapsed: 0.04 s - in org.apache.phoenix.iterate.SpoolingResultIteratorTest
[INFO] Running org.apache.phoenix.iterate.ConcatResultIteratorTest
[INFO] Tests run: 2, Failures: 0, Errors: 0, Skipped: 0, Time elapsed: 0.005 s - in org.apache.phoenix.iterate.ConcatResultIteratorTest
[INFO] Running org.apache.phoenix.iterate.RowKeyOrderedAggregateResultIteratorTest
[INFO] Tests run: 7, Failures: 0, Errors: 0, Skipped: 0, Time elapsed: 0.557 s - in org.apache.phoenix.schema.RowKeySchemaTest
[INFO] Running org.apache.phoenix.iterate.OrderedResultIteratorTest
[INFO] Tests run: 1, Failures: 0, Errors: 0, Skipped: 0, Time elapsed: 0.003 s - in org.apache.phoenix.iterate.OrderedResultIteratorTest
[INFO] Running org.apache.phoenix.iterate.MergeSortResultIteratorTest
[INFO] Tests run: 2, Failures: 0, Errors: 0, Skipped: 0, Time elapsed: 0.016 s - in org.apache.phoenix.iterate.MergeSortResultIteratorTest
[INFO] Running org.apache.phoenix.query.EncodedColumnQualifierCellsListTest
[INFO] Tests run: 22, Failures: 0, Errors: 0, Skipped: 0, Time elapsed: 0.072 s - in org.apache.phoenix.query.EncodedColumnQualifierCellsListTest
[INFO] Running org.apache.phoenix.query.HBaseFactoryProviderTest
[INFO] Tests run: 3, Failures: 0, Errors: 0, Skipped: 0, Time elapsed: 0.006 s - in org.apache.phoenix.query.HBaseFactoryProviderTest
[INFO] Running org.apache.phoenix.query.KeyRangeIntersectTest
[INFO] Tests run: 4, Failures: 0, Errors: 0, Skipped: 0, Time elapsed: 0.305 s - in org.apache.phoenix.schema.stats.StatisticsScannerTest
[INFO] Running org.apache.phoenix.query.ConnectionQueryServicesImplTest
[INFO] Tests run: 9, Failures: 0, Errors: 0, Skipped: 0, Time elapsed: 0.102 s - in org.apache.phoenix.query.KeyRangeIntersectTest
[INFO] Running org.apache.phoenix.query.QueryPlanTest
[INFO] Tests run: 4, Failures: 0, Errors: 0, Skipped: 0, Time elapsed: 0.413 s - in org.apache.phoenix.iterate.RowKeyOrderedAggregateResultIteratorTest
[INFO] Running org.apache.phoenix.query.ScannerLeaseRenewalTest
[INFO] Tests run: 1, Failures: 0, Errors: 0, Skipped: 0, Time elapsed: 0.207 s - in org.apache.phoenix.query.ConnectionQueryServicesImplTest
[INFO] Running org.apache.phoenix.query.KeyRangeCoalesceTest
[INFO] Tests run: 13, Failures: 0, Errors: 0, Skipped: 0, Time elapsed: 0.106 s - in org.apache.phoenix.query.KeyRangeCoalesceTest
[INFO] Running org.apache.phoenix.query.ParallelIteratorsSplitTest
[INFO] Tests run: 22, Failures: 0, Errors: 0, Skipped: 0, Time elapsed: 0.863 s - in org.apache.phoenix.schema.ImmutableStorageSchemeTest
[INFO] Running org.apache.phoenix.query.KeyRangeMoreTest
[INFO] Tests run: 2, Failures: 0, Errors: 0, Skipped: 0, Time elapsed: 0.814 s - in org.apache.phoenix.schema.MutationTest
[INFO] Running org.apache.phoenix.query.PhoenixStatsCacheRemovalListenerTest
[INFO] Tests run: 1, Failures: 0, Errors: 0, Skipped: 0, Time elapsed: 0.006 s - in org.apache.phoenix.query.PhoenixStatsCacheRemovalListenerTest
[INFO] Running org.apache.phoenix.query.PropertyPolicyProviderTest
[INFO] Tests run: 1, Failures: 0, Errors: 0, Skipped: 0, Time elapsed: 0.994 s - in org.apache.phoenix.iterate.AggregateResultScannerTest
[INFO] Running org.apache.phoenix.query.KeyRangeClipTest
[INFO] Tests run: 3, Failures: 0, Errors: 0, Skipped: 0, Time elapsed: 0.5 s - in org.apache.phoenix.query.PropertyPolicyProviderTest
[INFO] Running org.apache.phoenix.query.OrderByTest
[INFO] Tests run: 8, Failures: 0, Errors: 0, Skipped: 0, Time elapsed: 0.779 s - in org.apache.phoenix.query.ParallelIteratorsSplitTest
[INFO] Running org.apache.phoenix.query.ConnectionlessTest
[INFO] Tests run: 8, Failures: 0, Errors: 0, Skipped: 0, Time elapsed: 0.585 s - in org.apache.phoenix.query.KeyRangeClipTest
[INFO] Running org.apache.phoenix.query.KeyRangeUnionTest
[INFO] Tests run: 8, Failures: 0, Errors: 0, Skipped: 0, Time elapsed: 0.04 s - in org.apache.phoenix.query.KeyRangeUnionTest
[INFO] Running org.apache.phoenix.index.automated.MRJobSubmitterTest
[INFO] Tests run: 4, Failures: 0, Errors: 0, Skipped: 0, Time elapsed: 0.368 s - in org.apache.phoenix.query.OrderByTest
[INFO] Running org.apache.phoenix.index.IndexMaintainerTest
[INFO] Tests run: 6, Failures: 0, Errors: 0, Skipped: 0, Time elapsed: 0.113 s - in org.apache.phoenix.index.automated.MRJobSubmitterTest
[INFO] Running org.apache.phoenix.execute.DescVarLengthFastByteComparisonsTest
[INFO] Tests run: 2, Failures: 0, Errors: 0, Skipped: 0, Time elapsed: 0.015 s - in org.apache.phoenix.execute.DescVarLengthFastByteComparisonsTest
[INFO] Running org.apache.phoenix.execute.UnnestArrayPlanTest
[INFO] Tests run: 3, Failures: 0, Errors: 0, Skipped: 0, Time elapsed: 0.486 s - in org.apache.phoenix.query.ConnectionlessTest
[INFO] Running org.apache.phoenix.execute.MutationStateTest
[INFO] Tests run: 2, Failures: 0, Errors: 0, Skipped: 0, Time elapsed: 0.077 s - in org.apache.phoenix.execute.MutationStateTest
[INFO] Running org.apache.phoenix.execute.LiteralResultIteratorPlanTest
[INFO] Tests run: 3, Failures: 0, Errors: 0, Skipped: 0, Time elapsed: 0.024 s - in org.apache.phoenix.execute.LiteralResultIteratorPlanTest
[INFO] Running org.apache.phoenix.execute.CorrelatePlanTest
[INFO] Tests run: 6, Failures: 0, Errors: 0, Skipped: 0, Time elapsed: 0.295 s - in org.apache.phoenix.execute.UnnestArrayPlanTest
[INFO] Running org.apache.phoenix.filter.SkipScanFilterIntersectTest
[INFO] Tests run: 1, Failures: 0, Errors: 0, Skipped: 0, Time elapsed: 2.252 s - in org.apache.phoenix.schema.RowKeyValueAccessorTest
[INFO] Running org.apache.phoenix.filter.DistinctPrefixFilterTest
[INFO] Tests run: 6, Failures: 0, Errors: 0, Skipped: 0, Time elapsed: 0.095 s - in org.apache.phoenix.execute.CorrelatePlanTest
[INFO] Running org.apache.phoenix.filter.SkipScanFilterTest
[INFO] Tests run: 19, Failures: 0, Errors: 0, Skipped: 0, Time elapsed: 0.061 s - in org.apache.phoenix.filter.SkipScanFilterIntersectTest
[INFO] Tests run: 8, Failures: 0, Errors: 0, Skipped: 0, Time elapsed: 0.025 s - in org.apache.phoenix.filter.DistinctPrefixFilterTest
[INFO] Running org.apache.phoenix.compile.StatementHintsCompilationTest
[INFO] Running org.apache.phoenix.filter.SkipScanBigFilterTest
[INFO] Tests run: 20, Failures: 0, Errors: 0, Skipped: 0, Time elapsed: 0.083 s - in org.apache.phoenix.filter.SkipScanFilterTest
[INFO] Running org.apache.phoenix.compile.CursorCompilerTest
[INFO] Tests run: 5, Failures: 0, Errors: 0, Skipped: 0, Time elapsed: 2.595 s - in org.apache.phoenix.query.QueryPlanTest
[INFO] Running org.apache.phoenix.compile.ScanRangesTest
[INFO] Tests run: 34, Failures: 0, Errors: 0, Skipped: 0, Time elapsed: 0.069 s - in org.apache.phoenix.compile.ScanRangesTest
[INFO] Running org.apache.phoenix.compile.SelectStatementRewriterTest
[INFO] Tests run: 1, Failures: 0, Errors: 0, Skipped: 0, Time elapsed: 0.866 s - in org.apache.phoenix.compile.CursorCompilerTest
[INFO] Running org.apache.phoenix.compile.WhereCompilerTest
[INFO] Tests run: 2, Failures: 0, Errors: 0, Skipped: 0, Time elapsed: 0.948 s - in org.apache.phoenix.filter.SkipScanBigFilterTest
[INFO] Running org.apache.phoenix.compile.WhereOptimizerTest
[INFO] Tests run: 24, Failures: 0, Errors: 0, Skipped: 0, Time elapsed: 1.419 s - in org.apache.phoenix.index.IndexMaintainerTest
[INFO] Running org.apache.phoenix.compile.ScanRangesIntersectTest
[INFO] Tests run: 1, Failures: 0, Errors: 0, Skipped: 0, Time elapsed: 0.007 s - in org.apache.phoenix.compile.ScanRangesIntersectTest
[INFO] Running org.apache.phoenix.compile.SaltedScanRangesTest
[INFO] Tests run: 9, Failures: 0, Errors: 0, Skipped: 0, Time elapsed: 0.016 s - in org.apache.phoenix.compile.SaltedScanRangesTest
[INFO] Running org.apache.phoenix.compile.HavingCompilerTest
[INFO] Tests run: 4, Failures: 0, Errors: 0, Skipped: 0, Time elapsed: 1.188 s - in org.apache.phoenix.compile.StatementHintsCompilationTest
[INFO] Running org.apache.phoenix.compile.ViewCompilerTest
[INFO] Tests run: 11, Failures: 0, Errors: 0, Skipped: 0, Time elapsed: 0.246 s - in org.apache.phoenix.compile.HavingCompilerTest
[INFO] Running org.apache.phoenix.compile.CreateTableCompilerTest
[INFO] Tests run: 5, Failures: 0, Errors: 0, Skipped: 0, Time elapsed: 0.401 s - in org.apache.phoenix.compile.SelectStatementRewriterTest
[INFO] Running org.apache.phoenix.compile.QueryOptimizerTest
[INFO] Tests run: 1, Failures: 0, Errors: 0, Skipped: 0, Time elapsed: 0.267 s - in org.apache.phoenix.compile.CreateTableCompilerTest
[INFO] Running org.apache.phoenix.compile.QueryCompilerTest
[INFO] Tests run: 4, Failures: 0, Errors: 0, Skipped: 0, Time elapsed: 2.983 s - in org.apache.phoenix.query.KeyRangeMoreTest
[INFO] Running org.apache.phoenix.compile.TenantSpecificViewIndexCompileTest
[WARNING] Tests run: 45, Failures: 0, Errors: 0, Skipped: 1, Time elapsed: 0.989 s - in org.apache.phoenix.compile.WhereCompilerTest
[INFO] Running org.apache.phoenix.compile.LimitCompilerTest
[INFO] Tests run: 6, Failures: 0, Errors: 0, Skipped: 0, Time elapsed: 0.322 s - in org.apache.phoenix.compile.LimitCompilerTest
[INFO] Running org.apache.phoenix.compile.JoinQueryCompilerTest
[INFO] Tests run: 3, Failures: 0, Errors: 0, Skipped: 0, Time elapsed: 1.109 s - in org.apache.phoenix.compile.ViewCompilerTest
[INFO] Running org.apache.phoenix.compile.QueryMetaDataTest
[INFO] Tests run: 2, Failures: 0, Errors: 0, Skipped: 0, Time elapsed: 4.005 s - in org.apache.phoenix.query.ScannerLeaseRenewalTest
[INFO] Running org.apache.phoenix.cache.JodaTimezoneCacheTest
[INFO] Tests run: 4, Failures: 0, Errors: 0, Skipped: 0, Time elapsed: 0.051 s - in org.apache.phoenix.cache.JodaTimezoneCacheTest
[INFO] Running org.apache.phoenix.cache.TenantCacheTest
[INFO] Tests run: 4, Failures: 0, Errors: 0, Skipped: 0, Time elapsed: 0.035 s - in org.apache.phoenix.cache.TenantCacheTest
[INFO] Running org.apache.hadoop.hbase.regionserver.PhoenixRpcSchedulerFactoryTest
[INFO] Tests run: 2, Failures: 0, Errors: 0, Skipped: 0, Time elapsed: 0.043 s - in org.apache.hadoop.hbase.regionserver.PhoenixRpcSchedulerFactoryTest
[INFO] Running org.apache.hadoop.hbase.regionserver.wal.ReadWriteKeyValuesWithCodecTest
[INFO] Tests run: 2, Failures: 0, Errors: 0, Skipped: 0, Time elapsed: 0.686 s - in org.apache.phoenix.compile.JoinQueryCompilerTest
[INFO] Running org.apache.hadoop.hbase.regionserver.wal.IndexedWALEditCodecTest
[INFO] Tests run: 32, Failures: 0, Errors: 0, Skipped: 0, Time elapsed: 0.653 s - in org.apache.phoenix.compile.QueryMetaDataTest
[INFO] Tests run: 1, Failures: 0, Errors: 0, Skipped: 0, Time elapsed: 0.029 s - in org.apache.hadoop.hbase.regionserver.wal.IndexedWALEditCodecTest
[INFO] Running org.apache.hadoop.hbase.ipc.PhoenixIndexRpcSchedulerTest
[INFO] Tests run: 6, Failures: 0, Errors: 0, Skipped: 0, Time elapsed: 1.634 s - in org.apache.phoenix.compile.TenantSpecificViewIndexCompileTest
[INFO] Tests run: 117, Failures: 0, Errors: 0, Skipped: 0, Time elapsed: 2.251 s - in org.apache.phoenix.compile.WhereOptimizerTest
[INFO] Tests run: 2, Failures: 0, Errors: 0, Skipped: 0, Time elapsed: 0.998 s - in org.apache.hadoop.hbase.regionserver.wal.ReadWriteKeyValuesWithCodecTest
[INFO] Tests run: 49, Failures: 0, Errors: 0, Skipped: 0, Time elapsed: 2.384 s - in org.apache.phoenix.compile.QueryOptimizerTest
[INFO] Tests run: 2, Failures: 0, Errors: 0, Skipped: 0, Time elapsed: 1.725 s - in org.apache.hadoop.hbase.ipc.PhoenixIndexRpcSchedulerTest
[WARNING] Tests run: 186, Failures: 0, Errors: 0, Skipped: 2, Time elapsed: 4.141 s - in org.apache.phoenix.compile.QueryCompilerTest
[INFO] Tests run: 3, Failures: 0, Errors: 0, Skipped: 0, Time elapsed: 14.981 s - in org.apache.phoenix.hbase.index.write.recovery.TestPerRegionIndexWriteCache
[INFO] 
[INFO] Results:
[INFO] 
[ERROR] Errors: 
[ERROR]   SecureUserConnectionsTest.setupKdc:101 ยป IllegalArgument Can't get Kerberos re...
[INFO] 
[ERROR] Tests run: 1648, Failures: 0, Errors: 1, Skipped: 5
[INFO] 
[INFO] ------------------------------------------------------------------------
[INFO] Reactor Summary:
[INFO] 
[INFO] Apache Phoenix ..................................... SUCCESS [  3.026 s]
[INFO] Phoenix Core ....................................... FAILURE [02:34 min]
[INFO] Phoenix - Flume .................................... SKIPPED
[INFO] Phoenix - Kafka .................................... SKIPPED
[INFO] Phoenix - Pig ...................................... SKIPPED
[INFO] Phoenix Query Server Client ........................ SKIPPED
[INFO] Phoenix Query Server ............................... SKIPPED
[INFO] Phoenix - Pherf .................................... SKIPPED
[INFO] Phoenix - Spark .................................... SKIPPED
[INFO] Phoenix - Hive ..................................... SKIPPED
[INFO] Phoenix Client ..................................... SKIPPED
[INFO] Phoenix Server ..................................... SKIPPED
[INFO] Phoenix Assembly ................................... SKIPPED
[INFO] Phoenix - Tracing Web Application .................. SKIPPED
[INFO] Phoenix Load Balancer .............................. SKIPPED
[INFO] ------------------------------------------------------------------------
[INFO] BUILD FAILURE
[INFO] ------------------------------------------------------------------------
[INFO] Total time: 02:39 min
[INFO] Finished at: 2018-07-13T03:15:31Z
[INFO] Final Memory: 98M/1883M
[INFO] ------------------------------------------------------------------------
[ERROR] Failed to execute goal org.apache.maven.plugins:maven-surefire-plugin:2.20:test (default-test) on project phoenix-core: There are test failures.
[ERROR] 
[ERROR] Please refer to <https://builds.apache.org/job/Phoenix-5.x-HBase-2.0/ws/phoenix-core/target/surefire-reports> for the individual test results.
[ERROR] Please refer to dump files (if any exist) [date]-jvmRun[N].dump, [date].dumpstream and [date]-jvmRun[N].dumpstream.
[ERROR] -> [Help 1]
[ERROR] 
[ERROR] To see the full stack trace of the errors, re-run Maven with the -e switch.
[ERROR] Re-run Maven using the -X switch to enable full debug logging.
[ERROR] 
[ERROR] For more information about the errors and possible solutions, please read the following articles:
[ERROR] [Help 1] http://cwiki.apache.org/confluence/display/MAVEN/MojoFailureException
[ERROR] 
[ERROR] After correcting the problems, you can resume the build with the command
[ERROR]   mvn <goals> -rf :phoenix-core
Build step 'Invoke top-level Maven targets' marked build as failure
Archiving artifacts
Recording test results

Jenkins build is back to normal : Phoenix-5.x-HBase-2.0 #12

Posted by Apache Jenkins Server <je...@builds.apache.org>.
See <https://builds.apache.org/job/Phoenix-5.x-HBase-2.0/12/display/redirect?page=changes>


Build failed in Jenkins: Phoenix-5.x-HBase-2.0 #11

Posted by Apache Jenkins Server <je...@builds.apache.org>.
See <https://builds.apache.org/job/Phoenix-5.x-HBase-2.0/11/display/redirect?page=changes>

Changes:

[tdsilva] PHOENIX-3534 Support multi region SYSTEM.CATALOG table (Thomas D'Silva

------------------------------------------
[...truncated 2.12 MB...]
[INFO] Excluding org.apache.hbase:hbase-http:jar:2.0.0 from the shaded jar.
[INFO] Excluding org.apache.hbase:hbase-procedure:jar:2.0.0 from the shaded jar.
[INFO] Excluding org.glassfish.web:javax.servlet.jsp:jar:2.3.2 from the shaded jar.
[INFO] Excluding org.glassfish:javax.el:jar:3.0.1-b11-SNAPSHOT from the shaded jar.
[INFO] Excluding javax.servlet.jsp:javax.servlet.jsp-api:jar:2.3.1 from the shaded jar.
[INFO] Excluding org.codehaus.jettison:jettison:jar:1.3.8 from the shaded jar.
[INFO] Excluding org.jamon:jamon-runtime:jar:2.4.1 from the shaded jar.
[INFO] Excluding org.apache.hadoop:hadoop-distcp:jar:2.7.4 from the shaded jar.
[INFO] Including org.eclipse.jetty:jetty-servlet:jar:9.3.19.v20170502 in the shaded jar.
[INFO] Including org.eclipse.jetty:jetty-webapp:jar:9.3.19.v20170502 in the shaded jar.
[INFO] Including org.eclipse.jetty:jetty-xml:jar:9.3.19.v20170502 in the shaded jar.
[INFO] Excluding org.apache.hbase:hbase-hadoop-compat:jar:2.0.0 from the shaded jar.
[INFO] Excluding org.apache.hbase:hbase-hadoop2-compat:jar:2.0.0 from the shaded jar.
[INFO] Excluding org.apache.hadoop:hadoop-annotations:jar:3.0.0 from the shaded jar.
[INFO] Excluding org.apache.hadoop:hadoop-mapreduce-client-core:jar:3.0.0 from the shaded jar.
[INFO] Excluding org.apache.hadoop:hadoop-yarn-client:jar:3.0.0 from the shaded jar.
[INFO] Excluding org.apache.hadoop:hadoop-yarn-common:jar:3.0.0 from the shaded jar.
[INFO] Excluding javax.xml.bind:jaxb-api:jar:2.2.11 from the shaded jar.
[INFO] Excluding com.sun.jersey:jersey-client:jar:1.19 from the shaded jar.
[INFO] Excluding com.sun.jersey.contribs:jersey-guice:jar:1.19 from the shaded jar.
[INFO] Excluding com.fasterxml.jackson.module:jackson-module-jaxb-annotations:jar:2.7.8 from the shaded jar.
[INFO] Excluding com.fasterxml.jackson.jaxrs:jackson-jaxrs-json-provider:jar:2.7.8 from the shaded jar.
[INFO] Excluding com.fasterxml.jackson.jaxrs:jackson-jaxrs-base:jar:2.7.8 from the shaded jar.
[INFO] Excluding org.apache.hadoop:hadoop-hdfs-client:jar:3.0.0 from the shaded jar.
[INFO] Excluding com.squareup.okhttp:okhttp:jar:2.4.0 from the shaded jar.
[INFO] Excluding com.squareup.okio:okio:jar:1.4.0 from the shaded jar.
[INFO] Excluding com.google.inject.extensions:guice-servlet:jar:4.0 from the shaded jar.
[INFO] Excluding io.netty:netty:jar:3.10.5.Final from the shaded jar.
[INFO] Excluding org.jruby.joni:joni:jar:2.1.2 from the shaded jar.
[INFO] Excluding com.clearspring.analytics:stream:jar:2.9.5 from the shaded jar.
[INFO] Excluding com.salesforce.i18n:i18n-util:jar:1.0.4 from the shaded jar.
[INFO] Excluding com.ibm.icu:icu4j:jar:60.2 from the shaded jar.
[INFO] Excluding com.ibm.icu:icu4j-localespi:jar:60.2 from the shaded jar.
[INFO] Excluding com.ibm.icu:icu4j-charset:jar:60.2 from the shaded jar.
[INFO] Excluding com.lmax:disruptor:jar:3.3.6 from the shaded jar.
[INFO] Excluding commons-logging:commons-logging:jar:1.2 from the shaded jar.
[INFO] Including javax.servlet:javax.servlet-api:jar:3.1.0 in the shaded jar.
[INFO] Excluding org.apache.hbase:hbase-protocol-shaded:jar:2.0.0 from the shaded jar.
[INFO] Excluding org.apache.hbase.thirdparty:hbase-shaded-miscellaneous:jar:2.1.0 from the shaded jar.
[INFO] Excluding io.dropwizard.metrics:metrics-core:jar:3.2.1 from the shaded jar.
[INFO] Excluding org.apache.commons:commons-math3:jar:3.6.1 from the shaded jar.
[INFO] Excluding org.apache.commons:commons-lang3:jar:3.6 from the shaded jar.
[INFO] Excluding org.apache.htrace:htrace-core4:jar:4.2.0-incubating from the shaded jar.
[INFO] Excluding org.glassfish.jersey.core:jersey-client:jar:2.25.1 from the shaded jar.
[INFO] Excluding org.glassfish.jersey.core:jersey-common:jar:2.25.1 from the shaded jar.
[INFO] Excluding org.glassfish.jersey.bundles.repackaged:jersey-guava:jar:2.25.1 from the shaded jar.
[INFO] Excluding org.glassfish.hk2:osgi-resource-locator:jar:1.0.1 from the shaded jar.
[INFO] Excluding org.glassfish.hk2:hk2-api:jar:2.5.0-b32 from the shaded jar.
[INFO] Excluding org.glassfish.hk2:hk2-utils:jar:2.5.0-b32 from the shaded jar.
[INFO] Excluding org.glassfish.hk2.external:aopalliance-repackaged:jar:2.5.0-b32 from the shaded jar.
[INFO] Excluding org.glassfish.hk2.external:javax.inject:jar:2.5.0-b32 from the shaded jar.
[INFO] Excluding org.glassfish.hk2:hk2-locator:jar:2.5.0-b32 from the shaded jar.
[INFO] Excluding org.javassist:javassist:jar:3.20.0-GA from the shaded jar.
[INFO] Excluding org.apache.yetus:audience-annotations:jar:0.5.0 from the shaded jar.
[INFO] Excluding org.apache.hbase:hbase-zookeeper:jar:2.0.0 from the shaded jar.
[INFO] Excluding org.slf4j:slf4j-log4j12:jar:1.7.25 from the shaded jar.
[INFO] Excluding org.apache.hadoop:hadoop-auth:jar:3.0.0 from the shaded jar.
[INFO] Excluding com.nimbusds:nimbus-jose-jwt:jar:4.41.1 from the shaded jar.
[INFO] Excluding net.minidev:json-smart:jar:2.3 from the shaded jar.
[INFO] Excluding net.minidev:accessors-smart:jar:1.2 from the shaded jar.
[INFO] Excluding org.ow2.asm:asm:jar:5.0.4 from the shaded jar.
[INFO] Excluding org.apache.curator:curator-framework:jar:2.12.0 from the shaded jar.
[INFO] Excluding org.apache.hadoop:hadoop-client:jar:3.0.0 from the shaded jar.
[INFO] Excluding org.apache.hadoop:hadoop-yarn-api:jar:3.0.0 from the shaded jar.
[INFO] Excluding org.apache.hadoop:hadoop-mapreduce-client-jobclient:jar:3.0.0 from the shaded jar.
[INFO] Excluding org.apache.hadoop:hadoop-mapreduce-client-common:jar:3.0.0 from the shaded jar.
[INFO] Excluding com.google.code.gson:gson:jar:2.2.4 from the shaded jar.
[INFO] Excluding com.google.inject:guice:jar:3.0 from the shaded jar.
[INFO] Excluding javax.inject:javax.inject:jar:1 from the shaded jar.
[INFO] Excluding aopalliance:aopalliance:jar:1.0 from the shaded jar.
[INFO] Excluding com.google.inject.extensions:guice-assistedinject:jar:3.0 from the shaded jar.
[INFO] Excluding org.apache.thrift:libthrift:jar:0.9.0 from the shaded jar.
[INFO] Excluding it.unimi.dsi:fastutil:jar:6.5.6 from the shaded jar.
[INFO] Excluding org.apache.twill:twill-common:jar:0.8.0 from the shaded jar.
[INFO] Excluding org.apache.twill:twill-core:jar:0.8.0 from the shaded jar.
[INFO] Excluding org.apache.twill:twill-api:jar:0.8.0 from the shaded jar.
[INFO] Excluding org.ow2.asm:asm-all:jar:5.0.2 from the shaded jar.
[INFO] Excluding org.apache.twill:twill-discovery-api:jar:0.8.0 from the shaded jar.
[INFO] Excluding org.apache.twill:twill-discovery-core:jar:0.8.0 from the shaded jar.
[INFO] Excluding org.apache.twill:twill-zookeeper:jar:0.8.0 from the shaded jar.
[INFO] Including org.eclipse.jetty:jetty-util-ajax:jar:9.3.19.v20170502 in the shaded jar.
[INFO] Excluding org.glassfish.jersey.core:jersey-server:jar:2.25.1 from the shaded jar.
[INFO] Excluding org.glassfish.jersey.media:jersey-media-jaxb:jar:2.25.1 from the shaded jar.
[INFO] Excluding javax.annotation:javax.annotation-api:jar:1.2 from the shaded jar.
[INFO] Excluding javax.validation:validation-api:jar:1.1.0.Final from the shaded jar.
[INFO] Excluding org.glassfish.jersey.containers:jersey-container-servlet-core:jar:2.25.1 from the shaded jar.
[INFO] Excluding javax.ws.rs:javax.ws.rs-api:jar:2.0.1 from the shaded jar.
[INFO] Excluding commons-io:commons-io:jar:2.4 from the shaded jar.
[INFO] Excluding org.apache.kerby:kerb-simplekdc:jar:1.0.1 from the shaded jar.
[INFO] Excluding org.apache.kerby:kerb-client:jar:1.0.1 from the shaded jar.
[INFO] Excluding org.apache.kerby:kerby-config:jar:1.0.1 from the shaded jar.
[INFO] Excluding org.apache.kerby:kerb-core:jar:1.0.1 from the shaded jar.
[INFO] Excluding org.apache.kerby:kerby-pkix:jar:1.0.1 from the shaded jar.
[INFO] Excluding org.apache.kerby:kerby-asn1:jar:1.0.1 from the shaded jar.
[INFO] Excluding org.apache.kerby:kerby-util:jar:1.0.1 from the shaded jar.
[INFO] Excluding org.apache.kerby:kerb-common:jar:1.0.1 from the shaded jar.
[INFO] Excluding org.apache.kerby:kerb-crypto:jar:1.0.1 from the shaded jar.
[INFO] Excluding org.apache.kerby:kerb-util:jar:1.0.1 from the shaded jar.
[INFO] Excluding org.apache.kerby:token-provider:jar:1.0.1 from the shaded jar.
[INFO] Excluding org.apache.kerby:kerb-admin:jar:1.0.1 from the shaded jar.
[INFO] Excluding org.apache.kerby:kerb-server:jar:1.0.1 from the shaded jar.
[INFO] Excluding org.apache.kerby:kerb-identity:jar:1.0.1 from the shaded jar.
[INFO] Excluding org.apache.kerby:kerby-xdr:jar:1.0.1 from the shaded jar.
[INFO] Excluding com.fasterxml.jackson.core:jackson-annotations:jar:2.9.0 from the shaded jar.
[WARNING] avatica-1.11.0.jar, avatica-core-1.11.0.jar define 603 overlapping classes: 
[WARNING]   - org.apache.calcite.avatica.AvaticaParameter
[WARNING]   - org.apache.calcite.avatica.Meta$ExecuteResult
[WARNING]   - org.apache.calcite.avatica.ConnectStringParser
[WARNING]   - org.apache.calcite.avatica.ConnectionConfigImpl$3
[WARNING]   - org.apache.calcite.avatica.AvaticaDatabaseMetaData$2
[WARNING]   - org.apache.calcite.avatica.remote.RemoteMeta$11
[WARNING]   - org.apache.calcite.avatica.proto.Common$1
[WARNING]   - org.apache.calcite.avatica.remote.JsonService
[WARNING]   - org.apache.calcite.avatica.util.Spaces$SpaceString
[WARNING]   - org.apache.calcite.avatica.proto.Responses$DatabasePropertyResponseOrBuilder
[WARNING]   - 593 more...
[WARNING] avatica-metrics-1.11.0.jar, avatica-1.11.0.jar define 22 overlapping classes: 
[WARNING]   - org.apache.calcite.avatica.metrics.noop.NoopMetricsSystemConfiguration
[WARNING]   - org.apache.calcite.avatica.metrics.Counter
[WARNING]   - org.apache.calcite.avatica.metrics.noop.NoopMeter
[WARNING]   - org.apache.calcite.avatica.metrics.Histogram
[WARNING]   - org.apache.calcite.avatica.metrics.Metric
[WARNING]   - org.apache.calcite.avatica.metrics.noop.NoopMetricsSystemFactory
[WARNING]   - org.apache.calcite.avatica.metrics.MetricsSystemFactory
[WARNING]   - org.apache.calcite.avatica.metrics.Timer$Context
[WARNING]   - org.apache.calcite.avatica.metrics.MetricsSystemConfiguration
[WARNING]   - org.apache.calcite.avatica.metrics.noop.NoopTimer$NoopContext
[WARNING]   - 12 more...
[WARNING] maven-shade-plugin has detected that some class files are
[WARNING] present in two or more JARs. When this happens, only one
[WARNING] single version of the class is copied to the uber jar.
[WARNING] Usually this is not harmful and you can skip these warnings,
[WARNING] otherwise try to manually exclude artifacts based on
[WARNING] mvn dependency:tree -Ddetail=true and the above output.
[WARNING] See http://maven.apache.org/plugins/maven-shade-plugin/
[INFO] Replacing <https://builds.apache.org/job/Phoenix-5.x-HBase-2.0/11/artifact/phoenix-queryserver/target/phoenix-5.1.0-HBase-2.0-SNAPSHOT-queryserver.jar> with <https://builds.apache.org/job/Phoenix-5.x-HBase-2.0/11/artifact/phoenix-queryserver/target/phoenix-queryserver-5.1.0-HBase-2.0-SNAPSHOT-shaded.jar>
[INFO] 
[INFO] --- maven-failsafe-plugin:2.20:integration-test (ParallelStatsEnabledTest) @ phoenix-queryserver ---
[INFO] 
[INFO] -------------------------------------------------------
[INFO]  T E S T S
[INFO] -------------------------------------------------------
[INFO] 
[INFO] Results:
[INFO] 
[INFO] Tests run: 0, Failures: 0, Errors: 0, Skipped: 0
[INFO] 
[INFO] 
[INFO] --- maven-failsafe-plugin:2.20:integration-test (ParallelStatsDisabledTest) @ phoenix-queryserver ---
[INFO] 
[INFO] -------------------------------------------------------
[INFO]  T E S T S
[INFO] -------------------------------------------------------
[INFO] 
[INFO] Results:
[INFO] 
[INFO] Tests run: 0, Failures: 0, Errors: 0, Skipped: 0
[INFO] 
[INFO] 
[INFO] --- maven-failsafe-plugin:2.20:integration-test (HBaseManagedTimeTests) @ phoenix-queryserver ---
[INFO] 
[INFO] -------------------------------------------------------
[INFO]  T E S T S
[INFO] -------------------------------------------------------
[INFO] Running org.apache.phoenix.end2end.QueryServerBasicsIT
[INFO] Tests run: 7, Failures: 0, Errors: 0, Skipped: 0, Time elapsed: 77.306 s - in org.apache.phoenix.end2end.QueryServerBasicsIT
[INFO] 
[INFO] Results:
[INFO] 
[INFO] Tests run: 7, Failures: 0, Errors: 0, Skipped: 0
[INFO] 
[INFO] 
[INFO] --- maven-failsafe-plugin:2.20:integration-test (NeedTheirOwnClusterTests) @ phoenix-queryserver ---
[INFO] 
[INFO] -------------------------------------------------------
[INFO]  T E S T S
[INFO] -------------------------------------------------------
[INFO] Running org.apache.phoenix.end2end.SecureQueryServerIT
[INFO] Running org.apache.phoenix.end2end.HttpParamImpersonationQueryServerIT
[INFO] Tests run: 1, Failures: 0, Errors: 0, Skipped: 0, Time elapsed: 29.461 s - in org.apache.phoenix.end2end.SecureQueryServerIT
[ERROR] Tests run: 2, Failures: 1, Errors: 0, Skipped: 0, Time elapsed: 36.052 s <<< FAILURE! - in org.apache.phoenix.end2end.HttpParamImpersonationQueryServerIT
[ERROR] testSuccessfulImpersonation(org.apache.phoenix.end2end.HttpParamImpersonationQueryServerIT)  Time elapsed: 3.145 s  <<< FAILURE!
java.lang.AssertionError: Expected the error message to contain an HBase AccessDeniedException
	at org.apache.phoenix.end2end.HttpParamImpersonationQueryServerIT.readAndExpectPermissionError(HttpParamImpersonationQueryServerIT.java:416)
	at org.apache.phoenix.end2end.HttpParamImpersonationQueryServerIT.testSuccessfulImpersonation(HttpParamImpersonationQueryServerIT.java:329)

[INFO] 
[INFO] Results:
[INFO] 
[ERROR] Failures: 
[ERROR]   HttpParamImpersonationQueryServerIT.testSuccessfulImpersonation:329->readAndExpectPermissionError:416 Expected the error message to contain an HBase AccessDeniedException
[INFO] 
[ERROR] Tests run: 3, Failures: 1, Errors: 0, Skipped: 0
[INFO] 
[INFO] 
[INFO] --- maven-failsafe-plugin:2.20:integration-test (SplitSystemCatalogTests) @ phoenix-queryserver ---
[INFO] 
[INFO] -------------------------------------------------------
[INFO]  T E S T S
[INFO] -------------------------------------------------------
[INFO] 
[INFO] Results:
[INFO] 
[INFO] Tests run: 0, Failures: 0, Errors: 0, Skipped: 0
[INFO] 
[INFO] 
[INFO] --- maven-failsafe-plugin:2.20:verify (ParallelStatsEnabledTest) @ phoenix-queryserver ---
[INFO] ------------------------------------------------------------------------
[INFO] Reactor Summary:
[INFO] 
[INFO] Apache Phoenix ..................................... SUCCESS [  5.886 s]
[INFO] Phoenix Core ....................................... SUCCESS [  02:04 h]
[INFO] Phoenix - Flume .................................... SUCCESS [01:57 min]
[INFO] Phoenix - Kafka .................................... SUCCESS [02:34 min]
[INFO] Phoenix - Pig ...................................... SUCCESS [03:26 min]
[INFO] Phoenix Query Server Client ........................ SUCCESS [ 25.562 s]
[INFO] Phoenix Query Server ............................... FAILURE [03:31 min]
[INFO] Phoenix - Pherf .................................... SKIPPED
[INFO] Phoenix - Spark .................................... SKIPPED
[INFO] Phoenix - Hive ..................................... SKIPPED
[INFO] Phoenix Client ..................................... SKIPPED
[INFO] Phoenix Server ..................................... SKIPPED
[INFO] Phoenix Assembly ................................... SKIPPED
[INFO] Phoenix - Tracing Web Application .................. SKIPPED
[INFO] Phoenix Load Balancer .............................. SKIPPED
[INFO] ------------------------------------------------------------------------
[INFO] BUILD FAILURE
[INFO] ------------------------------------------------------------------------
[INFO] Total time: 02:16 h
[INFO] Finished at: 2018-07-19T22:34:48Z
[INFO] Final Memory: 115M/1504M
[INFO] ------------------------------------------------------------------------
[ERROR] Failed to execute goal org.apache.maven.plugins:maven-failsafe-plugin:2.20:verify (ParallelStatsEnabledTest) on project phoenix-queryserver: There are test failures.
[ERROR] 
[ERROR] Please refer to <https://builds.apache.org/job/Phoenix-5.x-HBase-2.0/ws/phoenix-queryserver/target/failsafe-reports> for the individual test results.
[ERROR] Please refer to dump files (if any exist) [date]-jvmRun[N].dump, [date].dumpstream and [date]-jvmRun[N].dumpstream.
[ERROR] -> [Help 1]
[ERROR] 
[ERROR] To see the full stack trace of the errors, re-run Maven with the -e switch.
[ERROR] Re-run Maven using the -X switch to enable full debug logging.
[ERROR] 
[ERROR] For more information about the errors and possible solutions, please read the following articles:
[ERROR] [Help 1] http://cwiki.apache.org/confluence/display/MAVEN/MojoFailureException
[ERROR] 
[ERROR] After correcting the problems, you can resume the build with the command
[ERROR]   mvn <goals> -rf :phoenix-queryserver
Build step 'Invoke top-level Maven targets' marked build as failure
Archiving artifacts
Recording test results