You are viewing a plain text version of this content. The canonical link for it is here.
Posted to yarn-dev@hadoop.apache.org by Apache Jenkins Server <je...@builds.apache.org> on 2015/05/23 13:10:25 UTC

Failed: YARN-2238 PreCommit Build #8067

Jira: https://issues.apache.org/jira/browse/YARN-2238
Build: https://builds.apache.org/job/PreCommit-YARN-Build/8067/

###################################################################################
########################## LAST 60 LINES OF THE CONSOLE ###########################
Started by remote host 127.0.0.1
Building remotely on H5 (Mapreduce Falcon Hadoop Pig Zookeeper Tez Hdfs) in workspace /home/jenkins/jenkins-slave/workspace/PreCommit-YARN-Build
 > git rev-parse --is-inside-work-tree # timeout=10
Fetching changes from the remote Git repository
 > git config remote.origin.url https://git-wip-us.apache.org/repos/asf/hadoop.git # timeout=10
Fetching upstream changes from https://git-wip-us.apache.org/repos/asf/hadoop.git
 > git --version # timeout=10
 > git fetch --tags --progress https://git-wip-us.apache.org/repos/asf/hadoop.git +refs/heads/*:refs/remotes/origin/*
 > git rev-parse refs/remotes/origin/trunk^{commit} # timeout=10
 > git rev-parse refs/remotes/origin/origin/trunk^{commit} # timeout=10
Checking out Revision 446d51591e6e99cc60a85c4b9fbac379a8caa49d (refs/remotes/origin/trunk)
 > git config core.sparsecheckout # timeout=10
 > git checkout -f 446d51591e6e99cc60a85c4b9fbac379a8caa49d
 > git rev-list 446d51591e6e99cc60a85c4b9fbac379a8caa49d # timeout=10
Cleaning workspace
 > git rev-parse --verify HEAD # timeout=10
Resetting working tree
 > git reset --hard # timeout=10
 > git clean -fdx # timeout=10
No emails were triggered.
[PreCommit-YARN-Build] $ /bin/bash /tmp/hudson5474403561848013674.sh


============================================================================
============================================================================
                        Bootstrapping test harness
============================================================================
============================================================================


Running in Jenkins mode
YARN-2238 patch is being downloaded at Sat May 23 11:10:23 UTC 2015 from
http://issues.apache.org/jira/secure/attachment/12735007/YARN-2238.png
ERROR: http://issues.apache.org/jira/secure/attachment/12735007/YARN-2238.png is not a patch file.


============================================================================
============================================================================
                              Finished build.
============================================================================
============================================================================


Build step 'Execute shell' marked build as failure
Archiving artifacts
Sending artifact delta relative to PreCommit-YARN-Build #8054
Archived 2 artifacts
Archive block size is 32768
Received 0 blocks and 183780 bytes
Compression is 0.0%
Took 1.4 sec
[description-setter] Could not determine description.
Recording test results
Email was triggered for: Failure
Sending email for trigger: Failure



###################################################################################
############################## FAILED TESTS (if any) ##############################
No tests ran.

Success: YARN-1126 PreCommit Build #8069

Posted by Apache Jenkins Server <je...@builds.apache.org>.
Jira: https://issues.apache.org/jira/browse/YARN-1126
Build: https://builds.apache.org/job/PreCommit-YARN-Build/8069/

###################################################################################
########################## LAST 60 LINES OF THE CONSOLE ###########################
[...truncated 257 lines...]
|  +1  |            javadoc  |  9m 35s    | There were no new javadoc warning 
|      |                     |            | messages.
|  +1  |      release audit  |  0m 22s    | The applied patch does not increase 
|      |                     |            | the total number of release audit
|      |                     |            | warnings.
|  +1  |         checkstyle  |  0m 30s    | There were no new checkstyle 
|      |                     |            | issues.
|  +1  |         whitespace  |  0m 0s     | The patch has no lines that end in 
|      |                     |            | whitespace.
|  +1  |            install  |  1m 32s    | mvn install still works. 
|  +1  |    eclipse:eclipse  |  0m 33s    | The patch built with 
|      |                     |            | eclipse:eclipse.
|  +1  |           findbugs  |  0m 44s    | The patch does not introduce any 
|      |                     |            | new Findbugs (version 3.0.0)
|      |                     |            | warnings.
|  +1  |         yarn tests  |  6m 57s    | Tests passed in hadoop-yarn-client. 
|      |                     |  42m 32s   | 


|| Subsystem || Report/Notes ||
============================================================================
| Patch URL | http://issues.apache.org/jira/secure/attachment/12735012/YARN-1126-003.patch |
| Optional Tests | javadoc javac unit findbugs checkstyle |
| git revision | trunk / 446d515 |
| hadoop-yarn-client test log | /home/jenkins/jenkins-slave/workspace/PreCommit-YARN-Build/patchprocess/testrun_hadoop-yarn-client.txt |
| Test Results | https://builds.apache.org/job/PreCommit-YARN-Build/8069/testReport/ |
| Java | 1.7.0_55 |
| uname | Linux asf905.gq1.ygridcore.net 3.13.0-36-lowlatency #63-Ubuntu SMP PREEMPT Wed Sep 3 21:56:12 UTC 2014 x86_64 x86_64 x86_64 GNU/Linux |


============================================================================
============================================================================
                          Adding comment to JIRA
============================================================================
============================================================================


Comment added.
f15cc8b5957e6374179d679cfe6de795e72e6c32 logged out


============================================================================
============================================================================
                              Finished build.
============================================================================
============================================================================


Archiving artifacts
Sending artifact delta relative to PreCommit-YARN-Build #8054
Archived 24 artifacts
Archive block size is 32768
Received 16 blocks and 9174194 bytes
Compression is 5.4%
Took 2.9 sec
Description set: YARN-1126
Recording test results
Email was triggered for: Success
Sending email for trigger: Success



###################################################################################
############################## FAILED TESTS (if any) ##############################
All tests passed

Failed: YARN-1126 PreCommit Build #8068

Posted by Apache Jenkins Server <je...@builds.apache.org>.
Jira: https://issues.apache.org/jira/browse/YARN-1126
Build: https://builds.apache.org/job/PreCommit-YARN-Build/8068/

###################################################################################
########################## LAST 60 LINES OF THE CONSOLE ###########################
[...truncated 262 lines...]
|  -1  |         checkstyle  |  0m 29s    | The applied patch generated 2 new 
|      |                     |            | checkstyle issues (total was 6, now
|      |                     |            | 7).
|  -1  |         whitespace  |  0m 0s     | The patch has 1 line(s) that end in 
|      |                     |            | whitespace. Use git apply
|      |                     |            | --whitespace=fix.
|  +1  |            install  |  1m 32s    | mvn install still works. 
|  +1  |    eclipse:eclipse  |  0m 33s    | The patch built with 
|      |                     |            | eclipse:eclipse.
|  +1  |           findbugs  |  0m 44s    | The patch does not introduce any 
|      |                     |            | new Findbugs (version 3.0.0)
|      |                     |            | warnings.
|  +1  |         yarn tests  |  6m 52s    | Tests passed in hadoop-yarn-client. 
|      |                     |  42m 24s   | 


|| Subsystem || Report/Notes ||
============================================================================
| Patch URL | http://issues.apache.org/jira/secure/attachment/12735008/YARN-1126-002.patch |
| Optional Tests | javadoc javac unit findbugs checkstyle |
| git revision | trunk / 446d515 |
| checkstyle |  /home/jenkins/jenkins-slave/workspace/PreCommit-YARN-Build/patchprocess/diffcheckstylehadoop-yarn-client.txt |
| whitespace | /home/jenkins/jenkins-slave/workspace/PreCommit-YARN-Build/patchprocess/whitespace.txt |
| hadoop-yarn-client test log | /home/jenkins/jenkins-slave/workspace/PreCommit-YARN-Build/patchprocess/testrun_hadoop-yarn-client.txt |
| Test Results | https://builds.apache.org/job/PreCommit-YARN-Build/8068/testReport/ |
| Java | 1.7.0_55 |
| uname | Linux asf905.gq1.ygridcore.net 3.13.0-36-lowlatency #63-Ubuntu SMP PREEMPT Wed Sep 3 21:56:12 UTC 2014 x86_64 x86_64 x86_64 GNU/Linux |


============================================================================
============================================================================
                          Adding comment to JIRA
============================================================================
============================================================================


Comment added.
5b70caec7ac9240c978391815fc8135762b4830d logged out


============================================================================
============================================================================
                              Finished build.
============================================================================
============================================================================


Build step 'Execute shell' marked build as failure
Archiving artifacts
Sending artifact delta relative to PreCommit-YARN-Build #8054
Archived 25 artifacts
Archive block size is 32768
Received 17 blocks and 9130448 bytes
Compression is 5.8%
Took 2.8 sec
[description-setter] Could not determine description.
Recording test results
Email was triggered for: Failure
Sending email for trigger: Failure



###################################################################################
############################## FAILED TESTS (if any) ##############################
All tests passed