You are viewing a plain text version of this content. The canonical link for it is here.
Posted to dev@lucene.apache.org by Apache Jenkins Server <je...@builds.apache.org> on 2017/04/24 09:41:44 UTC

[JENKINS] Lucene-Solr-NightlyTests-6.x - Build # 333 - Still unstable

Build: https://builds.apache.org/job/Lucene-Solr-NightlyTests-6.x/333/

3 tests failed.
FAILED:  org.apache.solr.cloud.TestStressCloudBlindAtomicUpdates.test_dv

Error Message:
java.lang.RuntimeException: Error from server at http://127.0.0.1:36785/solr/test_col: Async exception during distributed update: Error from server at http://127.0.0.1:36476/solr/test_col_shard2_replica2: Server Error    request: http://127.0.0.1:36476/solr/test_col_shard2_replica2/update?update.distrib=TOLEADER&distrib.from=http%3A%2F%2F127.0.0.1%3A36785%2Fsolr%2Ftest_col_shard4_replica1%2F&wt=javabin&version=2 Remote error message: Failed synchronous update on shard StdNode: http://127.0.0.1:40779/solr/test_col_shard2_replica1/ update: org.apache.solr.client.solrj.request.UpdateRequest@7116577

Stack Trace:
java.util.concurrent.ExecutionException: java.lang.RuntimeException: Error from server at http://127.0.0.1:36785/solr/test_col: Async exception during distributed update: Error from server at http://127.0.0.1:36476/solr/test_col_shard2_replica2: Server Error



request: http://127.0.0.1:36476/solr/test_col_shard2_replica2/update?update.distrib=TOLEADER&distrib.from=http%3A%2F%2F127.0.0.1%3A36785%2Fsolr%2Ftest_col_shard4_replica1%2F&wt=javabin&version=2
Remote error message: Failed synchronous update on shard StdNode: http://127.0.0.1:40779/solr/test_col_shard2_replica1/ update: org.apache.solr.client.solrj.request.UpdateRequest@7116577
	at __randomizedtesting.SeedInfo.seed([9AE15D1126E42FB5:ACF53F57ACB915A4]:0)
	at java.util.concurrent.FutureTask.report(FutureTask.java:122)
	at java.util.concurrent.FutureTask.get(FutureTask.java:192)
	at org.apache.solr.cloud.TestStressCloudBlindAtomicUpdates.checkField(TestStressCloudBlindAtomicUpdates.java:281)
	at org.apache.solr.cloud.TestStressCloudBlindAtomicUpdates.test_dv(TestStressCloudBlindAtomicUpdates.java:193)
	at sun.reflect.NativeMethodAccessorImpl.invoke0(Native Method)
	at sun.reflect.NativeMethodAccessorImpl.invoke(NativeMethodAccessorImpl.java:62)
	at sun.reflect.DelegatingMethodAccessorImpl.invoke(DelegatingMethodAccessorImpl.java:43)
	at java.lang.reflect.Method.invoke(Method.java:498)
	at com.carrotsearch.randomizedtesting.RandomizedRunner.invoke(RandomizedRunner.java:1713)
	at com.carrotsearch.randomizedtesting.RandomizedRunner$8.evaluate(RandomizedRunner.java:907)
	at com.carrotsearch.randomizedtesting.RandomizedRunner$9.evaluate(RandomizedRunner.java:943)
	at com.carrotsearch.randomizedtesting.RandomizedRunner$10.evaluate(RandomizedRunner.java:957)
	at com.carrotsearch.randomizedtesting.rules.SystemPropertiesRestoreRule$1.evaluate(SystemPropertiesRestoreRule.java:57)
	at org.apache.lucene.util.TestRuleSetupTeardownChained$1.evaluate(TestRuleSetupTeardownChained.java:49)
	at org.apache.lucene.util.AbstractBeforeAfterRule$1.evaluate(AbstractBeforeAfterRule.java:45)
	at org.apache.lucene.util.TestRuleThreadAndTestName$1.evaluate(TestRuleThreadAndTestName.java:48)
	at org.apache.lucene.util.TestRuleIgnoreAfterMaxFailures$1.evaluate(TestRuleIgnoreAfterMaxFailures.java:64)
	at org.apache.lucene.util.TestRuleMarkFailure$1.evaluate(TestRuleMarkFailure.java:47)
	at com.carrotsearch.randomizedtesting.rules.StatementAdapter.evaluate(StatementAdapter.java:36)
	at com.carrotsearch.randomizedtesting.ThreadLeakControl$StatementRunner.run(ThreadLeakControl.java:368)
	at com.carrotsearch.randomizedtesting.ThreadLeakControl.forkTimeoutingTask(ThreadLeakControl.java:817)
	at com.carrotsearch.randomizedtesting.ThreadLeakControl$3.evaluate(ThreadLeakControl.java:468)
	at com.carrotsearch.randomizedtesting.RandomizedRunner.runSingleTest(RandomizedRunner.java:916)
	at com.carrotsearch.randomizedtesting.RandomizedRunner$5.evaluate(RandomizedRunner.java:802)
	at com.carrotsearch.randomizedtesting.RandomizedRunner$6.evaluate(RandomizedRunner.java:852)
	at com.carrotsearch.randomizedtesting.RandomizedRunner$7.evaluate(RandomizedRunner.java:863)
	at com.carrotsearch.randomizedtesting.rules.StatementAdapter.evaluate(StatementAdapter.java:36)
	at com.carrotsearch.randomizedtesting.rules.SystemPropertiesRestoreRule$1.evaluate(SystemPropertiesRestoreRule.java:57)
	at org.apache.lucene.util.AbstractBeforeAfterRule$1.evaluate(AbstractBeforeAfterRule.java:45)
	at com.carrotsearch.randomizedtesting.rules.StatementAdapter.evaluate(StatementAdapter.java:36)
	at org.apache.lucene.util.TestRuleStoreClassName$1.evaluate(TestRuleStoreClassName.java:41)
	at com.carrotsearch.randomizedtesting.rules.NoShadowingOrOverridesOnMethodsRule$1.evaluate(NoShadowingOrOverridesOnMethodsRule.java:40)
	at com.carrotsearch.randomizedtesting.rules.NoShadowingOrOverridesOnMethodsRule$1.evaluate(NoShadowingOrOverridesOnMethodsRule.java:40)
	at com.carrotsearch.randomizedtesting.rules.StatementAdapter.evaluate(StatementAdapter.java:36)
	at com.carrotsearch.randomizedtesting.rules.StatementAdapter.evaluate(StatementAdapter.java:36)
	at com.carrotsearch.randomizedtesting.rules.StatementAdapter.evaluate(StatementAdapter.java:36)
	at org.apache.lucene.util.TestRuleAssertionsRequired$1.evaluate(TestRuleAssertionsRequired.java:53)
	at org.apache.lucene.util.TestRuleMarkFailure$1.evaluate(TestRuleMarkFailure.java:47)
	at org.apache.lucene.util.TestRuleIgnoreAfterMaxFailures$1.evaluate(TestRuleIgnoreAfterMaxFailures.java:64)
	at org.apache.lucene.util.TestRuleIgnoreTestSuites$1.evaluate(TestRuleIgnoreTestSuites.java:54)
	at com.carrotsearch.randomizedtesting.rules.StatementAdapter.evaluate(StatementAdapter.java:36)
	at com.carrotsearch.randomizedtesting.ThreadLeakControl$StatementRunner.run(ThreadLeakControl.java:368)
	at java.lang.Thread.run(Thread.java:745)
Caused by: java.lang.RuntimeException: Error from server at http://127.0.0.1:36785/solr/test_col: Async exception during distributed update: Error from server at http://127.0.0.1:36476/solr/test_col_shard2_replica2: Server Error



request: http://127.0.0.1:36476/solr/test_col_shard2_replica2/update?update.distrib=TOLEADER&distrib.from=http%3A%2F%2F127.0.0.1%3A36785%2Fsolr%2Ftest_col_shard4_replica1%2F&wt=javabin&version=2
Remote error message: Failed synchronous update on shard StdNode: http://127.0.0.1:40779/solr/test_col_shard2_replica1/ update: org.apache.solr.client.solrj.request.UpdateRequest@7116577
	at org.apache.solr.cloud.TestStressCloudBlindAtomicUpdates$Worker.run(TestStressCloudBlindAtomicUpdates.java:409)
	at java.util.concurrent.Executors$RunnableAdapter.call(Executors.java:511)
	at java.util.concurrent.FutureTask.run(FutureTask.java:266)
	at org.apache.solr.common.util.ExecutorUtil$MDCAwareThreadPoolExecutor.lambda$execute$0(ExecutorUtil.java:229)
	at java.util.concurrent.ThreadPoolExecutor.runWorker(ThreadPoolExecutor.java:1142)
	at java.util.concurrent.ThreadPoolExecutor$Worker.run(ThreadPoolExecutor.java:617)
	... 1 more
Caused by: org.apache.solr.client.solrj.impl.HttpSolrClient$RemoteSolrException: Error from server at http://127.0.0.1:36785/solr/test_col: Async exception during distributed update: Error from server at http://127.0.0.1:36476/solr/test_col_shard2_replica2: Server Error



request: http://127.0.0.1:36476/solr/test_col_shard2_replica2/update?update.distrib=TOLEADER&distrib.from=http%3A%2F%2F127.0.0.1%3A36785%2Fsolr%2Ftest_col_shard4_replica1%2F&wt=javabin&version=2
Remote error message: Failed synchronous update on shard StdNode: http://127.0.0.1:40779/solr/test_col_shard2_replica1/ update: org.apache.solr.client.solrj.request.UpdateRequest@7116577
	at org.apache.solr.client.solrj.impl.HttpSolrClient.executeMethod(HttpSolrClient.java:610)
	at org.apache.solr.client.solrj.impl.HttpSolrClient.request(HttpSolrClient.java:279)
	at org.apache.solr.client.solrj.impl.HttpSolrClient.request(HttpSolrClient.java:268)
	at org.apache.solr.client.solrj.SolrRequest.process(SolrRequest.java:160)
	at org.apache.solr.client.solrj.SolrRequest.process(SolrRequest.java:177)
	at org.apache.solr.cloud.TestStressCloudBlindAtomicUpdates$Worker.doRandomAtomicUpdate(TestStressCloudBlindAtomicUpdates.java:368)
	at org.apache.solr.cloud.TestStressCloudBlindAtomicUpdates$Worker.run(TestStressCloudBlindAtomicUpdates.java:397)
	... 6 more


FAILED:  org.apache.solr.handler.TestReplicationHandler.doTestReplicateAfterCoreReload

Error Message:
expected:<[{indexVersion=1493022755566,generation=2,filelist=[_3.cfe, _3.cfs, _3.si, _4.fdt, _4.fdx, _4.fnm, _4.nvd, _4.nvm, _4.si, _4_LuceneVarGapFixedInterval_0.doc, _4_LuceneVarGapFixedInterval_0.tib, _4_LuceneVarGapFixedInterval_0.tiv, _5.fdt, _5.fdx, _5.fnm, _5.nvd, _5.nvm, _5.si, _5_LuceneVarGapFixedInterval_0.doc, _5_LuceneVarGapFixedInterval_0.tib, _5_LuceneVarGapFixedInterval_0.tiv, _6.fdt, _6.fdx, _6.fnm, _6.nvd, _6.nvm, _6.si, _6_LuceneVarGapFixedInterval_0.doc, _6_LuceneVarGapFixedInterval_0.tib, _6_LuceneVarGapFixedInterval_0.tiv, segments_2]}]> but was:<[{indexVersion=1493022755566,generation=2,filelist=[_3.cfe, _3.cfs, _3.si, _4.fdt, _4.fdx, _4.fnm, _4.nvd, _4.nvm, _4.si, _4_LuceneVarGapFixedInterval_0.doc, _4_LuceneVarGapFixedInterval_0.tib, _4_LuceneVarGapFixedInterval_0.tiv, _5.fdt, _5.fdx, _5.fnm, _5.nvd, _5.nvm, _5.si, _5_LuceneVarGapFixedInterval_0.doc, _5_LuceneVarGapFixedInterval_0.tib, _5_LuceneVarGapFixedInterval_0.tiv, _6.fdt, _6.fdx, _6.fnm, _6.nvd, _6.nvm, _6.si, _6_LuceneVarGapFixedInterval_0.doc, _6_LuceneVarGapFixedInterval_0.tib, _6_LuceneVarGapFixedInterval_0.tiv, segments_2]}, {indexVersion=1493022755566,generation=3,filelist=[_3.cfe, _3.cfs, _3.si, _7.cfe, _7.cfs, _7.si, segments_3]}]>

Stack Trace:
java.lang.AssertionError: expected:<[{indexVersion=1493022755566,generation=2,filelist=[_3.cfe, _3.cfs, _3.si, _4.fdt, _4.fdx, _4.fnm, _4.nvd, _4.nvm, _4.si, _4_LuceneVarGapFixedInterval_0.doc, _4_LuceneVarGapFixedInterval_0.tib, _4_LuceneVarGapFixedInterval_0.tiv, _5.fdt, _5.fdx, _5.fnm, _5.nvd, _5.nvm, _5.si, _5_LuceneVarGapFixedInterval_0.doc, _5_LuceneVarGapFixedInterval_0.tib, _5_LuceneVarGapFixedInterval_0.tiv, _6.fdt, _6.fdx, _6.fnm, _6.nvd, _6.nvm, _6.si, _6_LuceneVarGapFixedInterval_0.doc, _6_LuceneVarGapFixedInterval_0.tib, _6_LuceneVarGapFixedInterval_0.tiv, segments_2]}]> but was:<[{indexVersion=1493022755566,generation=2,filelist=[_3.cfe, _3.cfs, _3.si, _4.fdt, _4.fdx, _4.fnm, _4.nvd, _4.nvm, _4.si, _4_LuceneVarGapFixedInterval_0.doc, _4_LuceneVarGapFixedInterval_0.tib, _4_LuceneVarGapFixedInterval_0.tiv, _5.fdt, _5.fdx, _5.fnm, _5.nvd, _5.nvm, _5.si, _5_LuceneVarGapFixedInterval_0.doc, _5_LuceneVarGapFixedInterval_0.tib, _5_LuceneVarGapFixedInterval_0.tiv, _6.fdt, _6.fdx, _6.fnm, _6.nvd, _6.nvm, _6.si, _6_LuceneVarGapFixedInterval_0.doc, _6_LuceneVarGapFixedInterval_0.tib, _6_LuceneVarGapFixedInterval_0.tiv, segments_2]}, {indexVersion=1493022755566,generation=3,filelist=[_3.cfe, _3.cfs, _3.si, _7.cfe, _7.cfs, _7.si, segments_3]}]>
	at __randomizedtesting.SeedInfo.seed([9AE15D1126E42FB5:BF36462156AC21B6]:0)
	at org.junit.Assert.fail(Assert.java:93)
	at org.junit.Assert.failNotEquals(Assert.java:647)
	at org.junit.Assert.assertEquals(Assert.java:128)
	at org.junit.Assert.assertEquals(Assert.java:147)
	at org.apache.solr.handler.TestReplicationHandler.doTestReplicateAfterCoreReload(TestReplicationHandler.java:1281)
	at sun.reflect.NativeMethodAccessorImpl.invoke0(Native Method)
	at sun.reflect.NativeMethodAccessorImpl.invoke(NativeMethodAccessorImpl.java:62)
	at sun.reflect.DelegatingMethodAccessorImpl.invoke(DelegatingMethodAccessorImpl.java:43)
	at java.lang.reflect.Method.invoke(Method.java:498)
	at com.carrotsearch.randomizedtesting.RandomizedRunner.invoke(RandomizedRunner.java:1713)
	at com.carrotsearch.randomizedtesting.RandomizedRunner$8.evaluate(RandomizedRunner.java:907)
	at com.carrotsearch.randomizedtesting.RandomizedRunner$9.evaluate(RandomizedRunner.java:943)
	at com.carrotsearch.randomizedtesting.RandomizedRunner$10.evaluate(RandomizedRunner.java:957)
	at com.carrotsearch.randomizedtesting.rules.SystemPropertiesRestoreRule$1.evaluate(SystemPropertiesRestoreRule.java:57)
	at org.apache.lucene.util.TestRuleSetupTeardownChained$1.evaluate(TestRuleSetupTeardownChained.java:49)
	at org.apache.lucene.util.AbstractBeforeAfterRule$1.evaluate(AbstractBeforeAfterRule.java:45)
	at org.apache.lucene.util.TestRuleThreadAndTestName$1.evaluate(TestRuleThreadAndTestName.java:48)
	at org.apache.lucene.util.TestRuleIgnoreAfterMaxFailures$1.evaluate(TestRuleIgnoreAfterMaxFailures.java:64)
	at org.apache.lucene.util.TestRuleMarkFailure$1.evaluate(TestRuleMarkFailure.java:47)
	at com.carrotsearch.randomizedtesting.rules.StatementAdapter.evaluate(StatementAdapter.java:36)
	at com.carrotsearch.randomizedtesting.ThreadLeakControl$StatementRunner.run(ThreadLeakControl.java:368)
	at com.carrotsearch.randomizedtesting.ThreadLeakControl.forkTimeoutingTask(ThreadLeakControl.java:817)
	at com.carrotsearch.randomizedtesting.ThreadLeakControl$3.evaluate(ThreadLeakControl.java:468)
	at com.carrotsearch.randomizedtesting.RandomizedRunner.runSingleTest(RandomizedRunner.java:916)
	at com.carrotsearch.randomizedtesting.RandomizedRunner$5.evaluate(RandomizedRunner.java:802)
	at com.carrotsearch.randomizedtesting.RandomizedRunner$6.evaluate(RandomizedRunner.java:852)
	at com.carrotsearch.randomizedtesting.RandomizedRunner$7.evaluate(RandomizedRunner.java:863)
	at com.carrotsearch.randomizedtesting.rules.StatementAdapter.evaluate(StatementAdapter.java:36)
	at com.carrotsearch.randomizedtesting.rules.SystemPropertiesRestoreRule$1.evaluate(SystemPropertiesRestoreRule.java:57)
	at org.apache.lucene.util.AbstractBeforeAfterRule$1.evaluate(AbstractBeforeAfterRule.java:45)
	at com.carrotsearch.randomizedtesting.rules.StatementAdapter.evaluate(StatementAdapter.java:36)
	at org.apache.lucene.util.TestRuleStoreClassName$1.evaluate(TestRuleStoreClassName.java:41)
	at com.carrotsearch.randomizedtesting.rules.NoShadowingOrOverridesOnMethodsRule$1.evaluate(NoShadowingOrOverridesOnMethodsRule.java:40)
	at com.carrotsearch.randomizedtesting.rules.NoShadowingOrOverridesOnMethodsRule$1.evaluate(NoShadowingOrOverridesOnMethodsRule.java:40)
	at com.carrotsearch.randomizedtesting.rules.StatementAdapter.evaluate(StatementAdapter.java:36)
	at com.carrotsearch.randomizedtesting.rules.StatementAdapter.evaluate(StatementAdapter.java:36)
	at com.carrotsearch.randomizedtesting.rules.StatementAdapter.evaluate(StatementAdapter.java:36)
	at org.apache.lucene.util.TestRuleAssertionsRequired$1.evaluate(TestRuleAssertionsRequired.java:53)
	at org.apache.lucene.util.TestRuleMarkFailure$1.evaluate(TestRuleMarkFailure.java:47)
	at org.apache.lucene.util.TestRuleIgnoreAfterMaxFailures$1.evaluate(TestRuleIgnoreAfterMaxFailures.java:64)
	at org.apache.lucene.util.TestRuleIgnoreTestSuites$1.evaluate(TestRuleIgnoreTestSuites.java:54)
	at com.carrotsearch.randomizedtesting.rules.StatementAdapter.evaluate(StatementAdapter.java:36)
	at com.carrotsearch.randomizedtesting.ThreadLeakControl$StatementRunner.run(ThreadLeakControl.java:368)
	at java.lang.Thread.run(Thread.java:745)


FAILED:  org.apache.solr.handler.admin.SegmentsInfoRequestHandlerTest.testSegmentInfosVersion

Error Message:
Exception during query

Stack Trace:
java.lang.RuntimeException: Exception during query
	at __randomizedtesting.SeedInfo.seed([9AE15D1126E42FB5:623FC8F95E88FEE6]:0)
	at org.apache.solr.SolrTestCaseJ4.assertQ(SolrTestCaseJ4.java:895)
	at org.apache.solr.handler.admin.SegmentsInfoRequestHandlerTest.testSegmentInfosVersion(SegmentsInfoRequestHandlerTest.java:70)
	at sun.reflect.NativeMethodAccessorImpl.invoke0(Native Method)
	at sun.reflect.NativeMethodAccessorImpl.invoke(NativeMethodAccessorImpl.java:62)
	at sun.reflect.DelegatingMethodAccessorImpl.invoke(DelegatingMethodAccessorImpl.java:43)
	at java.lang.reflect.Method.invoke(Method.java:498)
	at com.carrotsearch.randomizedtesting.RandomizedRunner.invoke(RandomizedRunner.java:1713)
	at com.carrotsearch.randomizedtesting.RandomizedRunner$8.evaluate(RandomizedRunner.java:907)
	at com.carrotsearch.randomizedtesting.RandomizedRunner$9.evaluate(RandomizedRunner.java:943)
	at com.carrotsearch.randomizedtesting.RandomizedRunner$10.evaluate(RandomizedRunner.java:957)
	at com.carrotsearch.randomizedtesting.rules.SystemPropertiesRestoreRule$1.evaluate(SystemPropertiesRestoreRule.java:57)
	at org.apache.lucene.util.TestRuleSetupTeardownChained$1.evaluate(TestRuleSetupTeardownChained.java:49)
	at org.apache.lucene.util.AbstractBeforeAfterRule$1.evaluate(AbstractBeforeAfterRule.java:45)
	at org.apache.lucene.util.TestRuleThreadAndTestName$1.evaluate(TestRuleThreadAndTestName.java:48)
	at org.apache.lucene.util.TestRuleIgnoreAfterMaxFailures$1.evaluate(TestRuleIgnoreAfterMaxFailures.java:64)
	at org.apache.lucene.util.TestRuleMarkFailure$1.evaluate(TestRuleMarkFailure.java:47)
	at com.carrotsearch.randomizedtesting.rules.StatementAdapter.evaluate(StatementAdapter.java:36)
	at com.carrotsearch.randomizedtesting.ThreadLeakControl$StatementRunner.run(ThreadLeakControl.java:368)
	at com.carrotsearch.randomizedtesting.ThreadLeakControl.forkTimeoutingTask(ThreadLeakControl.java:817)
	at com.carrotsearch.randomizedtesting.ThreadLeakControl$3.evaluate(ThreadLeakControl.java:468)
	at com.carrotsearch.randomizedtesting.RandomizedRunner.runSingleTest(RandomizedRunner.java:916)
	at com.carrotsearch.randomizedtesting.RandomizedRunner$5.evaluate(RandomizedRunner.java:802)
	at com.carrotsearch.randomizedtesting.RandomizedRunner$6.evaluate(RandomizedRunner.java:852)
	at com.carrotsearch.randomizedtesting.RandomizedRunner$7.evaluate(RandomizedRunner.java:863)
	at com.carrotsearch.randomizedtesting.rules.StatementAdapter.evaluate(StatementAdapter.java:36)
	at com.carrotsearch.randomizedtesting.rules.SystemPropertiesRestoreRule$1.evaluate(SystemPropertiesRestoreRule.java:57)
	at org.apache.lucene.util.AbstractBeforeAfterRule$1.evaluate(AbstractBeforeAfterRule.java:45)
	at com.carrotsearch.randomizedtesting.rules.StatementAdapter.evaluate(StatementAdapter.java:36)
	at org.apache.lucene.util.TestRuleStoreClassName$1.evaluate(TestRuleStoreClassName.java:41)
	at com.carrotsearch.randomizedtesting.rules.NoShadowingOrOverridesOnMethodsRule$1.evaluate(NoShadowingOrOverridesOnMethodsRule.java:40)
	at com.carrotsearch.randomizedtesting.rules.NoShadowingOrOverridesOnMethodsRule$1.evaluate(NoShadowingOrOverridesOnMethodsRule.java:40)
	at com.carrotsearch.randomizedtesting.rules.StatementAdapter.evaluate(StatementAdapter.java:36)
	at com.carrotsearch.randomizedtesting.rules.StatementAdapter.evaluate(StatementAdapter.java:36)
	at com.carrotsearch.randomizedtesting.rules.StatementAdapter.evaluate(StatementAdapter.java:36)
	at org.apache.lucene.util.TestRuleAssertionsRequired$1.evaluate(TestRuleAssertionsRequired.java:53)
	at org.apache.lucene.util.TestRuleMarkFailure$1.evaluate(TestRuleMarkFailure.java:47)
	at org.apache.lucene.util.TestRuleIgnoreAfterMaxFailures$1.evaluate(TestRuleIgnoreAfterMaxFailures.java:64)
	at org.apache.lucene.util.TestRuleIgnoreTestSuites$1.evaluate(TestRuleIgnoreTestSuites.java:54)
	at com.carrotsearch.randomizedtesting.rules.StatementAdapter.evaluate(StatementAdapter.java:36)
	at com.carrotsearch.randomizedtesting.ThreadLeakControl$StatementRunner.run(ThreadLeakControl.java:368)
	at java.lang.Thread.run(Thread.java:745)
Caused by: java.lang.RuntimeException: REQUEST FAILED: xpath=2=count(//lst[@name='segments']/lst/str[@name='version'][.='6.6.0'])
	xml response was: <?xml version="1.0" encoding="UTF-8"?>
<response>
<lst name="responseHeader"><int name="status">0</int><int name="QTime">1</int></lst><lst name="segments"><lst name="_0"><str name="name">_0</str><int name="delCount">1</int><long name="sizeInBytes">2048</long><int name="size">4</int><date name="age">2017-04-24T09:01:46.908Z</date><str name="source">flush</str><str name="version">6.6.0</str></lst><lst name="_1"><str name="name">_1</str><int name="delCount">0</int><long name="sizeInBytes">1870</long><int name="size">1</int><date name="age">2017-04-24T09:01:46.912Z</date><str name="source">flush</str><str name="version">6.6.0</str></lst><lst name="_2"><str name="name">_2</str><int name="delCount">0</int><long name="sizeInBytes">1981</long><int name="size">4</int><date name="age">2017-04-24T09:01:46.922Z</date><str name="source">flush</str><str name="version">6.6.0</str></lst><lst name="_3"><str name="name">_3</str><int name="delCount">0</int><long name="sizeInBytes">1870</long><int name="size">1</int><date name="age">2017-04-24T09:01:46.924Z</date><str name="source">flush</str><str name="version">6.6.0</str></lst></lst>
</response>

	request was:qt=/admin/segments&wt=xml
	at org.apache.solr.SolrTestCaseJ4.assertQ(SolrTestCaseJ4.java:888)
	... 40 more




Build Log:
[...truncated 12117 lines...]
   [junit4] Suite: org.apache.solr.cloud.TestStressCloudBlindAtomicUpdates
   [junit4]   2> Creating dataDir: /x1/jenkins/jenkins-slave/workspace/Lucene-Solr-NightlyTests-6.x/checkout/solr/build/solr-core/test/J0/temp/solr.cloud.TestStressCloudBlindAtomicUpdates_9AE15D1126E42FB5-001/init-core-data-001
   [junit4]   2> 1235904 WARN  (SUITE-TestStressCloudBlindAtomicUpdates-seed#[9AE15D1126E42FB5]-worker) [    ] o.a.s.SolrTestCaseJ4 startTrackingSearchers: numOpens=1 numCloses=1
   [junit4]   2> 1235905 INFO  (SUITE-TestStressCloudBlindAtomicUpdates-seed#[9AE15D1126E42FB5]-worker) [    ] o.a.s.SolrTestCaseJ4 Using PointFields
   [junit4]   2> 1235907 INFO  (SUITE-TestStressCloudBlindAtomicUpdates-seed#[9AE15D1126E42FB5]-worker) [    ] o.a.s.SolrTestCaseJ4 Randomized ssl (false) and clientAuth (false) via: @org.apache.solr.SolrTestCaseJ4$SuppressSSL(bugUrl=SSL overhead seems to cause OutOfMemory when stress testing)
   [junit4]   2> 1235907 INFO  (SUITE-TestStressCloudBlindAtomicUpdates-seed#[9AE15D1126E42FB5]-worker) [    ] o.a.s.c.MiniSolrCloudCluster Starting cluster of 10 servers in /x1/jenkins/jenkins-slave/workspace/Lucene-Solr-NightlyTests-6.x/checkout/solr/build/solr-core/test/J0/temp/solr.cloud.TestStressCloudBlindAtomicUpdates_9AE15D1126E42FB5-001/tempDir-001
   [junit4]   2> 1235908 INFO  (SUITE-TestStressCloudBlindAtomicUpdates-seed#[9AE15D1126E42FB5]-worker) [    ] o.a.s.c.ZkTestServer STARTING ZK TEST SERVER
   [junit4]   2> 1235919 INFO  (Thread-6309) [    ] o.a.s.c.ZkTestServer client port:0.0.0.0/0.0.0.0:0
   [junit4]   2> 1235919 INFO  (Thread-6309) [    ] o.a.s.c.ZkTestServer Starting server
   [junit4]   2> 1236011 INFO  (SUITE-TestStressCloudBlindAtomicUpdates-seed#[9AE15D1126E42FB5]-worker) [    ] o.a.s.c.ZkTestServer start zk server on port:59899
   [junit4]   2> 1236102 INFO  (jetty-launcher-2095-thread-1) [    ] o.e.j.s.Server jetty-9.3.14.v20161028
   [junit4]   2> 1236132 INFO  (jetty-launcher-2095-thread-2) [    ] o.e.j.s.Server jetty-9.3.14.v20161028
   [junit4]   2> 1236136 INFO  (jetty-launcher-2095-thread-3) [    ] o.e.j.s.Server jetty-9.3.14.v20161028
   [junit4]   2> 1236144 INFO  (jetty-launcher-2095-thread-4) [    ] o.e.j.s.Server jetty-9.3.14.v20161028
   [junit4]   2> 1236145 INFO  (jetty-launcher-2095-thread-5) [    ] o.e.j.s.Server jetty-9.3.14.v20161028
   [junit4]   2> 1236164 INFO  (jetty-launcher-2095-thread-6) [    ] o.e.j.s.Server jetty-9.3.14.v20161028
   [junit4]   2> 1236216 INFO  (jetty-launcher-2095-thread-3) [    ] o.e.j.s.h.ContextHandler Started o.e.j.s.ServletContextHandler@26d9323d{/solr,null,AVAILABLE}
   [junit4]   2> 1236216 INFO  (jetty-launcher-2095-thread-3) [    ] o.e.j.s.AbstractConnector Started ServerConnector@2f5cf1d4{HTTP/1.1,[http/1.1]}{127.0.0.1:52901}
   [junit4]   2> 1236217 INFO  (jetty-launcher-2095-thread-3) [    ] o.e.j.s.Server Started @1245211ms
   [junit4]   2> 1236217 INFO  (jetty-launcher-2095-thread-3) [    ] o.a.s.c.s.e.JettySolrRunner Jetty properties: {hostContext=/solr, hostPort=52901}
   [junit4]   2> 1236217 ERROR (jetty-launcher-2095-thread-3) [    ] o.a.s.s.StartupLoggingUtils Missing Java Option solr.log.dir. Logging may be missing or incomplete.
   [junit4]   2> 1236217 INFO  (jetty-launcher-2095-thread-3) [    ] o.a.s.s.SolrDispatchFilter  ___      _       Welcome to Apache Solr? version 6.6.0
   [junit4]   2> 1236217 INFO  (jetty-launcher-2095-thread-3) [    ] o.a.s.s.SolrDispatchFilter / __| ___| |_ _   Starting in cloud mode on port null
   [junit4]   2> 1236217 INFO  (jetty-launcher-2095-thread-3) [    ] o.a.s.s.SolrDispatchFilter \__ \/ _ \ | '_|  Install dir: null
   [junit4]   2> 1236217 INFO  (jetty-launcher-2095-thread-3) [    ] o.a.s.s.SolrDispatchFilter |___/\___/_|_|    Start time: 2017-04-24T07:48:50.309Z
   [junit4]   2> 1236308 INFO  (jetty-launcher-2095-thread-2) [    ] o.e.j.s.h.ContextHandler Started o.e.j.s.ServletContextHandler@a6d8fb{/solr,null,AVAILABLE}
   [junit4]   2> 1236309 INFO  (jetty-launcher-2095-thread-2) [    ] o.e.j.s.AbstractConnector Started ServerConnector@c0ca950{HTTP/1.1,[http/1.1]}{127.0.0.1:36697}
   [junit4]   2> 1236309 INFO  (jetty-launcher-2095-thread-2) [    ] o.e.j.s.Server Started @1245303ms
   [junit4]   2> 1236309 INFO  (jetty-launcher-2095-thread-2) [    ] o.a.s.c.s.e.JettySolrRunner Jetty properties: {hostContext=/solr, hostPort=36697}
   [junit4]   2> 1236309 ERROR (jetty-launcher-2095-thread-2) [    ] o.a.s.s.StartupLoggingUtils Missing Java Option solr.log.dir. Logging may be missing or incomplete.
   [junit4]   2> 1236309 INFO  (jetty-launcher-2095-thread-2) [    ] o.a.s.s.SolrDispatchFilter  ___      _       Welcome to Apache Solr? version 6.6.0
   [junit4]   2> 1236309 INFO  (jetty-launcher-2095-thread-2) [    ] o.a.s.s.SolrDispatchFilter / __| ___| |_ _   Starting in cloud mode on port null
   [junit4]   2> 1236309 INFO  (jetty-launcher-2095-thread-2) [    ] o.a.s.s.SolrDispatchFilter \__ \/ _ \ | '_|  Install dir: null
   [junit4]   2> 1236309 INFO  (jetty-launcher-2095-thread-2) [    ] o.a.s.s.SolrDispatchFilter |___/\___/_|_|    Start time: 2017-04-24T07:48:50.401Z
   [junit4]   2> 1236342 INFO  (jetty-launcher-2095-thread-2) [    ] o.a.s.s.SolrDispatchFilter solr.xml found in ZooKeeper. Loading...
   [junit4]   2> 1236460 INFO  (jetty-launcher-2095-thread-1) [    ] o.e.j.s.h.ContextHandler Started o.e.j.s.ServletContextHandler@695dece1{/solr,null,AVAILABLE}
   [junit4]   2> 1236460 INFO  (jetty-launcher-2095-thread-1) [    ] o.e.j.s.AbstractConnector Started ServerConnector@33c9e535{HTTP/1.1,[http/1.1]}{127.0.0.1:40779}
   [junit4]   2> 1236460 INFO  (jetty-launcher-2095-thread-1) [    ] o.e.j.s.Server Started @1245455ms
   [junit4]   2> 1236461 INFO  (jetty-launcher-2095-thread-1) [    ] o.a.s.c.s.e.JettySolrRunner Jetty properties: {hostContext=/solr, hostPort=40779}
   [junit4]   2> 1236461 ERROR (jetty-launcher-2095-thread-1) [    ] o.a.s.s.StartupLoggingUtils Missing Java Option solr.log.dir. Logging may be missing or incomplete.
   [junit4]   2> 1236461 INFO  (jetty-launcher-2095-thread-1) [    ] o.a.s.s.SolrDispatchFilter  ___      _       Welcome to Apache Solr? version 6.6.0
   [junit4]   2> 1236461 INFO  (jetty-launcher-2095-thread-1) [    ] o.a.s.s.SolrDispatchFilter / __| ___| |_ _   Starting in cloud mode on port null
   [junit4]   2> 1236461 INFO  (jetty-launcher-2095-thread-1) [    ] o.a.s.s.SolrDispatchFilter \__ \/ _ \ | '_|  Install dir: null
   [junit4]   2> 1236461 INFO  (jetty-launcher-2095-thread-1) [    ] o.a.s.s.SolrDispatchFilter |___/\___/_|_|    Start time: 2017-04-24T07:48:50.553Z
   [junit4]   2> 1236490 INFO  (jetty-launcher-2095-thread-3) [    ] o.a.s.s.SolrDispatchFilter solr.xml found in ZooKeeper. Loading...
   [junit4]   2> 1236546 INFO  (jetty-launcher-2095-thread-6) [    ] o.e.j.s.h.ContextHandler Started o.e.j.s.ServletContextHandler@466cd0e9{/solr,null,AVAILABLE}
   [junit4]   2> 1236547 INFO  (jetty-launcher-2095-thread-6) [    ] o.e.j.s.AbstractConnector Started ServerConnector@43ff5485{HTTP/1.1,[http/1.1]}{127.0.0.1:36785}
   [junit4]   2> 1236547 INFO  (jetty-launcher-2095-thread-6) [    ] o.e.j.s.Server Started @1245541ms
   [junit4]   2> 1236547 INFO  (jetty-launcher-2095-thread-6) [    ] o.a.s.c.s.e.JettySolrRunner Jetty properties: {hostContext=/solr, hostPort=36785}
   [junit4]   2> 1236547 ERROR (jetty-launcher-2095-thread-6) [    ] o.a.s.s.StartupLoggingUtils Missing Java Option solr.log.dir. Logging may be missing or incomplete.
   [junit4]   2> 1236547 INFO  (jetty-launcher-2095-thread-6) [    ] o.a.s.s.SolrDispatchFilter  ___      _       Welcome to Apache Solr? version 6.6.0
   [junit4]   2> 1236547 INFO  (jetty-launcher-2095-thread-6) [    ] o.a.s.s.SolrDispatchFilter / __| ___| |_ _   Starting in cloud mode on port null
   [junit4]   2> 1236547 INFO  (jetty-launcher-2095-thread-6) [    ] o.a.s.s.SolrDispatchFilter \__ \/ _ \ | '_|  Install dir: null
   [junit4]   2> 1236547 INFO  (jetty-launcher-2095-thread-6) [    ] o.a.s.s.SolrDispatchFilter |___/\___/_|_|    Start time: 2017-04-24T07:48:50.639Z
   [junit4]   2> 1236569 INFO  (jetty-launcher-2095-thread-9) [    ] o.e.j.s.Server jetty-9.3.14.v20161028
   [junit4]   2> 1236569 INFO  (jetty-launcher-2095-thread-7) [    ] o.e.j.s.Server jetty-9.3.14.v20161028
   [junit4]   2> 1236573 INFO  (jetty-launcher-2095-thread-8) [    ] o.e.j.s.Server jetty-9.3.14.v20161028
   [junit4]   2> 1236580 INFO  (jetty-launcher-2095-thread-10) [    ] o.e.j.s.Server jetty-9.3.14.v20161028
   [junit4]   2> 1236617 INFO  (jetty-launcher-2095-thread-5) [    ] o.e.j.s.h.ContextHandler Started o.e.j.s.ServletContextHandler@381bf054{/solr,null,AVAILABLE}
   [junit4]   2> 1236618 INFO  (jetty-launcher-2095-thread-5) [    ] o.e.j.s.AbstractConnector Started ServerConnector@29ea5678{HTTP/1.1,[http/1.1]}{127.0.0.1:58170}
   [junit4]   2> 1236618 INFO  (jetty-launcher-2095-thread-5) [    ] o.e.j.s.Server Started @1245612ms
   [junit4]   2> 1236618 INFO  (jetty-launcher-2095-thread-5) [    ] o.a.s.c.s.e.JettySolrRunner Jetty properties: {hostContext=/solr, hostPort=58170}
   [junit4]   2> 1236618 ERROR (jetty-launcher-2095-thread-5) [    ] o.a.s.s.StartupLoggingUtils Missing Java Option solr.log.dir. Logging may be missing or incomplete.
   [junit4]   2> 1236618 INFO  (jetty-launcher-2095-thread-5) [    ] o.a.s.s.SolrDispatchFilter  ___      _       Welcome to Apache Solr? version 6.6.0
   [junit4]   2> 1236618 INFO  (jetty-launcher-2095-thread-5) [    ] o.a.s.s.SolrDispatchFilter / __| ___| |_ _   Starting in cloud mode on port null
   [junit4]   2> 1236618 INFO  (jetty-launcher-2095-thread-5) [    ] o.a.s.s.SolrDispatchFilter \__ \/ _ \ | '_|  Install dir: null
   [junit4]   2> 1236618 INFO  (jetty-launcher-2095-thread-5) [    ] o.a.s.s.SolrDispatchFilter |___/\___/_|_|    Start time: 2017-04-24T07:48:50.710Z
   [junit4]   2> 1236882 INFO  (jetty-launcher-2095-thread-4) [    ] o.e.j.s.h.ContextHandler Started o.e.j.s.ServletContextHandler@53b82547{/solr,null,AVAILABLE}
   [junit4]   2> 1236883 INFO  (jetty-launcher-2095-thread-4) [    ] o.e.j.s.AbstractConnector Started ServerConnector@166c629d{HTTP/1.1,[http/1.1]}{127.0.0.1:36476}
   [junit4]   2> 1236883 INFO  (jetty-launcher-2095-thread-4) [    ] o.e.j.s.Server Started @1245877ms
   [junit4]   2> 1236883 INFO  (jetty-launcher-2095-thread-4) [    ] o.a.s.c.s.e.JettySolrRunner Jetty properties: {hostContext=/solr, hostPort=36476}
   [junit4]   2> 1236883 ERROR (jetty-launcher-2095-thread-4) [    ] o.a.s.s.StartupLoggingUtils Missing Java Option solr.log.dir. Logging may be missing or incomplete.
   [junit4]   2> 1236883 INFO  (jetty-launcher-2095-thread-4) [    ] o.a.s.s.SolrDispatchFilter  ___      _       Welcome to Apache Solr? version 6.6.0
   [junit4]   2> 1236883 INFO  (jetty-launcher-2095-thread-4) [    ] o.a.s.s.SolrDispatchFilter / __| ___| |_ _   Starting in cloud mode on port null
   [junit4]   2> 1236883 INFO  (jetty-launcher-2095-thread-4) [    ] o.a.s.s.SolrDispatchFilter \__ \/ _ \ | '_|  Install dir: null
   [junit4]   2> 1236883 INFO  (jetty-launcher-2095-thread-4) [    ] o.a.s.s.SolrDispatchFilter |___/\___/_|_|    Start time: 2017-04-24T07:48:50.975Z
   [junit4]   2> 1237040 INFO  (jetty-launcher-2095-thread-10) [    ] o.e.j.s.h.ContextHandler Started o.e.j.s.ServletContextHandler@2a42e1e5{/solr,null,AVAILABLE}
   [junit4]   2> 1237041 INFO  (jetty-launcher-2095-thread-10) [    ] o.e.j.s.AbstractConnector Started ServerConnector@2bbbe67b{HTTP/1.1,[http/1.1]}{127.0.0.1:44822}
   [junit4]   2> 1237041 INFO  (jetty-launcher-2095-thread-10) [    ] o.e.j.s.Server Started @1246035ms
   [junit4]   2> 1237041 INFO  (jetty-launcher-2095-thread-10) [    ] o.a.s.c.s.e.JettySolrRunner Jetty properties: {hostContext=/solr, hostPort=44822}
   [junit4]   2> 1237041 ERROR (jetty-launcher-2095-thread-10) [    ] o.a.s.s.StartupLoggingUtils Missing Java Option solr.log.dir. Logging may be missing or incomplete.
   [junit4]   2> 1237041 INFO  (jetty-launcher-2095-thread-10) [    ] o.a.s.s.SolrDispatchFilter  ___      _       Welcome to Apache Solr? version 6.6.0
   [junit4]   2> 1237041 INFO  (jetty-launcher-2095-thread-10) [    ] o.a.s.s.SolrDispatchFilter / __| ___| |_ _   Starting in cloud mode on port null
   [junit4]   2> 1237041 INFO  (jetty-launcher-2095-thread-10) [    ] o.a.s.s.SolrDispatchFilter \__ \/ _ \ | '_|  Install dir: null
   [junit4]   2> 1237042 INFO  (jetty-launcher-2095-thread-10) [    ] o.a.s.s.SolrDispatchFilter |___/\___/_|_|    Start time: 2017-04-24T07:48:51.134Z
   [junit4]   2> 1237072 INFO  (jetty-launcher-2095-thread-8) [    ] o.e.j.s.h.ContextHandler Started o.e.j.s.ServletContextHandler@17b04b8a{/solr,null,AVAILABLE}
   [junit4]   2> 1237073 INFO  (jetty-launcher-2095-thread-8) [    ] o.e.j.s.AbstractConnector Started ServerConnector@416efa84{HTTP/1.1,[http/1.1]}{127.0.0.1:60397}
   [junit4]   2> 1237073 INFO  (jetty-launcher-2095-thread-8) [    ] o.e.j.s.Server Started @1246067ms
   [junit4]   2> 1237073 INFO  (jetty-launcher-2095-thread-8) [    ] o.a.s.c.s.e.JettySolrRunner Jetty properties: {hostContext=/solr, hostPort=60397}
   [junit4]   2> 1237073 ERROR (jetty-launcher-2095-thread-8) [    ] o.a.s.s.StartupLoggingUtils Missing Java Option solr.log.dir. Logging may be missing or incomplete.
   [junit4]   2> 1237073 INFO  (jetty-launcher-2095-thread-8) [    ] o.a.s.s.SolrDispatchFilter  ___      _       Welcome to Apache Solr? version 6.6.0
   [junit4]   2> 1237073 INFO  (jetty-launcher-2095-thread-8) [    ] o.a.s.s.SolrDispatchFilter / __| ___| |_ _   Starting in cloud mode on port null
   [junit4]   2> 1237073 INFO  (jetty-launcher-2095-thread-8) [    ] o.a.s.s.SolrDispatchFilter \__ \/ _ \ | '_|  Install dir: null
   [junit4]   2> 1237073 INFO  (jetty-launcher-2095-thread-8) [    ] o.a.s.s.SolrDispatchFilter |___/\___/_|_|    Start time: 2017-04-24T07:48:51.165Z
   [junit4]   2> 1237105 INFO  (jetty-launcher-2095-thread-7) [    ] o.e.j.s.h.ContextHandler Started o.e.j.s.ServletContextHandler@2814ea64{/solr,null,AVAILABLE}
   [junit4]   2> 1237106 INFO  (jetty-launcher-2095-thread-7) [    ] o.e.j.s.AbstractConnector Started ServerConnector@2bc426e{HTTP/1.1,[http/1.1]}{127.0.0.1:57418}
   [junit4]   2> 1237106 INFO  (jetty-launcher-2095-thread-7) [    ] o.e.j.s.Server Started @1246100ms
   [junit4]   2> 1237106 INFO  (jetty-launcher-2095-thread-7) [    ] o.a.s.c.s.e.JettySolrRunner Jetty properties: {hostContext=/solr, hostPort=57418}
   [junit4]   2> 1237106 ERROR (jetty-launcher-2095-thread-7) [    ] o.a.s.s.StartupLoggingUtils Missing Java Option solr.log.dir. Logging may be missing or incomplete.
   [junit4]   2> 1237106 INFO  (jetty-launcher-2095-thread-7) [    ] o.a.s.s.SolrDispatchFilter  ___      _       Welcome to Apache Solr? version 6.6.0
   [junit4]   2> 1237116 INFO  (jetty-launcher-2095-thread-7) [    ] o.a.s.s.SolrDispatchFilter / __| ___| |_ _   Starting in cloud mode on port null
   [junit4]   2> 1237116 INFO  (jetty-launcher-2095-thread-7) [    ] o.a.s.s.SolrDispatchFilter \__ \/ _ \ | '_|  Install dir: null
   [junit4]   2> 1237116 INFO  (jetty-launcher-2095-thread-7) [    ] o.a.s.s.SolrDispatchFilter |___/\___/_|_|    Start time: 2017-04-24T07:48:51.208Z
   [junit4]   2> 1237136 INFO  (jetty-launcher-2095-thread-9) [    ] o.e.j.s.h.ContextHandler Started o.e.j.s.ServletContextHandler@7391a88a{/solr,null,AVAILABLE}
   [junit4]   2> 1237136 INFO  (jetty-launcher-2095-thread-9) [    ] o.e.j.s.AbstractConnector Started ServerConnector@18889945{HTTP/1.1,[http/1.1]}{127.0.0.1:50532}
   [junit4]   2> 1237137 INFO  (jetty-launcher-2095-thread-9) [    ] o.e.j.s.Server Started @1246131ms
   [junit4]   2> 1237137 INFO  (jetty-launcher-2095-thread-9) [    ] o.a.s.c.s.e.JettySolrRunner Jetty properties: {hostContext=/solr, hostPort=50532}
   [junit4]   2> 1237137 ERROR (jetty-launcher-2095-thread-9) [    ] o.a.s.s.StartupLoggingUtils Missing Java Option solr.log.dir. Logging may be missing or incomplete.
   [junit4]   2> 1237137 INFO  (jetty-launcher-2095-thread-9) [    ] o.a.s.s.SolrDispatchFilter  ___      _       Welcome to Apache Solr? version 6.6.0
   [junit4]   2> 1237137 INFO  (jetty-launcher-2095-thread-9) [    ] o.a.s.s.SolrDispatchFilter / __| ___| |_ _   Starting in cloud mode on port null
   [junit4]   2> 1237137 INFO  (jetty-launcher-2095-thread-9) [    ] o.a.s.s.SolrDispatchFilter \__ \/ _ \ | '_|  Install dir: null
   [junit4]   2> 1237137 INFO  (jetty-launcher-2095-thread-9) [    ] o.a.s.s.SolrDispatchFilter |___/\___/_|_|    Start time: 2017-04-24T07:48:51.229Z
   [junit4]   2> 1237183 INFO  (jetty-launcher-2095-thread-9) [    ] o.a.s.s.SolrDispatchFilter solr.xml found in ZooKeeper. Loading...
   [junit4]   2> 1237222 INFO  (jetty-launcher-2095-thread-2) [    ] o.a.s.u.UpdateShardHandler Creating UpdateShardHandler HTTP client with params: socketTimeout=340000&connTimeout=45000&retry=true
   [junit4]   2> 1237224 INFO  (jetty-launcher-2095-thread-2) [    ] o.a.s.c.ZkContainer Zookeeper client=127.0.0.1:59899/solr
   [junit4]   2> 1237346 INFO  (jetty-launcher-2095-thread-1) [    ] o.a.s.s.SolrDispatchFilter solr.xml found in ZooKeeper. Loading...
   [junit4]   2> 1237423 INFO  (jetty-launcher-2095-thread-9) [    ] o.a.s.u.UpdateShardHandler Creating UpdateShardHandler HTTP client with params: socketTimeout=340000&connTimeout=45000&retry=true
   [junit4]   2> 1237440 INFO  (jetty-launcher-2095-thread-9) [    ] o.a.s.c.ZkContainer Zookeeper client=127.0.0.1:59899/solr
   [junit4]   2> 1237417 INFO  (jetty-launcher-2095-thread-7) [    ] o.a.s.s.SolrDispatchFilter solr.xml found in ZooKeeper. Loading...
   [junit4]   2> 1237395 INFO  (jetty-launcher-2095-thread-10) [    ] o.a.s.s.SolrDispatchFilter solr.xml found in ZooKeeper. Loading...
   [junit4]   2> 1237392 INFO  (jetty-launcher-2095-thread-4) [    ] o.a.s.s.SolrDispatchFilter solr.xml found in ZooKeeper. Loading...
   [junit4]   2> 1237382 INFO  (jetty-launcher-2095-thread-8) [    ] o.a.s.s.SolrDispatchFilter solr.xml found in ZooKeeper. Loading...
   [junit4]   2> 1237348 INFO  (jetty-launcher-2095-thread-6) [    ] o.a.s.s.SolrDispatchFilter solr.xml found in ZooKeeper. Loading...
   [junit4]   2> 1237347 INFO  (jetty-launcher-2095-thread-3) [    ] o.a.s.u.UpdateShardHandler Creating UpdateShardHandler HTTP client with params: socketTimeout=340000&connTimeout=45000&retry=true
   [junit4]   2> 1237535 INFO  (jetty-launcher-2095-thread-3) [    ] o.a.s.c.ZkContainer Zookeeper client=127.0.0.1:59899/solr
   [junit4]   2> 1237549 INFO  (jetty-launcher-2095-thread-5) [    ] o.a.s.s.SolrDispatchFilter solr.xml found in ZooKeeper. Loading...
   [junit4]   2> 1237663 INFO  (jetty-launcher-2095-thread-1) [    ] o.a.s.u.UpdateShardHandler Creating UpdateShardHandler HTTP client with params: socketTimeout=340000&connTimeout=45000&retry=true
   [junit4]   2> 1237571 WARN  (NIOServerCxn.Factory:0.0.0.0/0.0.0.0:0) [    ] o.a.z.s.NIOServerCnxn caught end of stream exception
   [junit4]   2> EndOfStreamException: Unable to read additional data from client sessionid 0x15b9eef3ae70003, likely client has closed socket
   [junit4]   2> 	at org.apache.zookeeper.server.NIOServerCnxn.doIO(NIOServerCnxn.java:228)
   [junit4]   2> 	at org.apache.zookeeper.server.NIOServerCnxnFactory.run(NIOServerCnxnFactory.java:208)
   [junit4]   2> 	at java.lang.Thread.run(Thread.java:745)
   [junit4]   2> 1237685 WARN  (NIOServerCxn.Factory:0.0.0.0/0.0.0.0:0) [    ] o.a.z.s.NIOServerCnxn caught end of stream exception
   [junit4]   2> EndOfStreamException: Unable to read additional data from client sessionid 0x15b9eef3ae7000c, likely client has closed socket
   [junit4]   2> 	at org.apache.zookeeper.server.NIOServerCnxn.doIO(NIOServerCnxn.java:228)
   [junit4]   2> 	at org.apache.zookeeper.server.NIOServerCnxnFactory.run(NIOServerCnxnFactory.java:208)
   [junit4]   2> 	at java.lang.Thread.run(Thread.java:745)
   [junit4]   2> 1237691 WARN  (NIOServerCxn.Factory:0.0.0.0/0.0.0.0:0) [    ] o.a.z.s.NIOServerCnxn caught end of stream exception
   [junit4]   2> EndOfStreamException: Unable to read additional data from client sessionid 0x15b9eef3ae70004, likely client has closed socket
   [junit4]   2> 	at org.apache.zookeeper.server.NIOServerCnxn.doIO(NIOServerCnxn.java:228)
   [junit4]   2> 	at org.apache.zookeeper.server.NIOServerCnxnFactory.run(NIOServerCnxnFactory.java:208)
   [junit4]   2> 	at java.lang.Thread.run(Thread.java:745)
   [junit4]   2> 1237691 WARN  (NIOServerCxn.Factory:0.0.0.0/0.0.0.0:0) [    ] o.a.z.s.NIOServerCnxn caught end of stream exception
   [junit4]   2> EndOfStreamException: Unable to read additional data from client sessionid 0x15b9eef3ae70005, likely client has closed socket
   [junit4]   2> 	at org.apache.zookeeper.server.NIOServerCnxn.doIO(NIOServerCnxn.java:228)
   [junit4]   2> 	at org.apache.zookeeper.server.NIOServerCnxnFactory.run(NIOServerCnxnFactory.java:208)
   [junit4]   2> 	at java.lang.Thread.run(Thread.java:745)
   [junit4]   2> 1237691 WARN  (NIOServerCxn.Factory:0.0.0.0/0.0.0.0:0) [    ] o.a.z.s.NIOServerCnxn caught end of stream exception
   [junit4]   2> EndOfStreamException: Unable to read additional data from client sessionid 0x15b9eef3ae7000a, likely client has closed socket
   [junit4]   2> 	at org.apache.zookeeper.server.NIOServerCnxn.doIO(NIOServerCnxn.java:228)
   [junit4]   2> 	at org.apache.zookeeper.server.NIOServerCnxnFactory.run(NIOServerCnxnFactory.java:208)
   [junit4]   2> 	at java.lang.Thread.run(Thread.java:745)
   [junit4]   2> 1237706 WARN  (NIOServerCxn.Factory:0.0.0.0/0.0.0.0:0) [    ] o.a.z.s.NIOServerCnxn caught end of stream exception
   [junit4]   2> EndOfStreamException: Unable to read additional data from client sessionid 0x15b9eef3ae70006, likely client has closed socket
   [junit4]   2> 	at org.apache.zookeeper.server.NIOServerCnxn.doIO(NIOServerCnxn.java:228)
   [junit4]   2> 	at org.apache.zookeeper.server.NIOServerCnxnFactory.run(NIOServerCnxnFactory.java:208)
   [junit4]   2> 	at java.lang.Thread.run(Thread.java:745)
   [junit4]   2> 1237706 WARN  (NIOServerCxn.Factory:0.0.0.0/0.0.0.0:0) [    ] o.a.z.s.NIOServerCnxn caught end of stream exception
   [junit4]   2> EndOfStreamException: Unable to read additional data from client sessionid 0x15b9eef3ae70007, likely client has closed socket
   [junit4]   2> 	at org.apache.zookeeper.server.NIOServerCnxn.doIO(NIOServerCnxn.java:228)
   [junit4]   2> 	at org.apache.zookeeper.server.NIOServerCnxnFactory.run(NIOServerCnxnFactory.java:208)
   [junit4]   2> 	at java.lang.Thread.run(Thread.java:745)
   [junit4]   2> 1237711 INFO  (jetty-launcher-2095-thread-1) [    ] o.a.s.c.ZkContainer Zookeeper client=127.0.0.1:59899/solr
   [junit4]   2> 1237713 WARN  (NIOServerCxn.Factory:0.0.0.0/0.0.0.0:0) [    ] o.a.z.s.NIOServerCnxn caught end of stream exception
   [junit4]   2> EndOfStreamException: Unable to read additional data from client sessionid 0x15b9eef3ae7000b, likely client has closed socket
   [junit4]   2> 	at org.apache.zookeeper.server.NIOServerCnxn.doIO(NIOServerCnxn.java:228)
   [junit4]   2> 	at org.apache.zookeeper.server.NIOServerCnxnFactory.run(NIOServerCnxnFactory.java:208)
   [junit4]   2> 	at java.lang.Thread.run(Thread.java:745)
   [junit4]   2> 1237764 INFO  (jetty-launcher-2095-thread-5) [    ] o.a.s.u.UpdateShardHandler Creating UpdateShardHandler HTTP client with params: socketTimeout=340000&connTimeout=45000&retry=true
   [junit4]   2> 1237760 INFO  (jetty-launcher-2095-thread-7) [    ] o.a.s.u.UpdateShardHandler Creating UpdateShardHandler HTTP client with params: socketTimeout=340000&connTimeout=45000&retry=true
   [junit4]   2> 1237757 INFO  (jetty-launcher-2095-thread-4) [    ] o.a.s.u.UpdateShardHandler Creating UpdateShardHandler HTTP client with params: socketTimeout=340000&connTimeout=45000&retry=true
   [junit4]   2> 1237753 INFO  (jetty-launcher-2095-thread-6) [    ] o.a.s.u.UpdateShardHandler Creating UpdateShardHandler HTTP client with params: socketTimeout=340000&connTimeout=45000&retry=true
   [junit4]   2> 1237746 INFO  (jetty-launcher-2095-thread-10) [    ] o.a.s.u.UpdateShardHandler Creating UpdateShardHandler HTTP client with params: socketTimeout=340000&connTimeout=45000&retry=true
   [junit4]   2> 1237744 INFO  (jetty-launcher-2095-thread-8) [    ] o.a.s.u.UpdateShardHandler Creating UpdateShardHandler HTTP client with params: socketTimeout=340000&connTimeout=45000&retry=true
   [junit4]   2> 1237782 WARN  (NIOServerCxn.Factory:0.0.0.0/0.0.0.0:0) [    ] o.a.z.s.NIOServerCnxn caught end of stream exception
   [junit4]   2> EndOfStreamException: Unable to read additional data from client sessionid 0x15b9eef3ae7000d, likely client has closed socket
   [junit4]   2> 	at org.apache.zookeeper.server.NIOServerCnxn.doIO(NIOServerCnxn.java:228)
   [junit4]   2> 	at org.apache.zookeeper.server.NIOServerCnxnFactory.run(NIOServerCnxnFactory.java:208)
   [junit4]   2> 	at java.lang.Thread.run(Thread.java:745)
   [junit4]   2> 1237784 INFO  (jetty-launcher-2095-thread-5) [    ] o.a.s.c.ZkContainer Zookeeper client=127.0.0.1:59899/solr
   [junit4]   2> 1237815 INFO  (jetty-launcher-2095-thread-2) [n:127.0.0.1:36697_solr    ] o.a.s.c.Overseer Overseer (id=null) closing
   [junit4]   2> 1237873 INFO  (jetty-launcher-2095-thread-7) [    ] o.a.s.c.ZkContainer Zookeeper client=127.0.0.1:59899/solr
   [junit4]   2> 1237873 INFO  (jetty-launcher-2095-thread-4) [    ] o.a.s.c.ZkContainer Zookeeper client=127.0.0.1:59899/solr
   [junit4]   2> 1237914 INFO  (jetty-launcher-2095-thread-6) [    ] o.a.s.c.ZkContainer Zookeeper client=127.0.0.1:59899/solr
   [junit4]   2> 1237997 INFO  (jetty-launcher-2095-thread-10) [    ] o.a.s.c.ZkContainer Zookeeper client=127.0.0.1:59899/solr
   [junit4]   2> 1237825 INFO  (jetty-launcher-2095-thread-9) [n:127.0.0.1:50532_solr    ] o.a.s.c.Overseer Overseer (id=null) closing
   [junit4]   2> 1238173 INFO  (jetty-launcher-2095-thread-8) [    ] o.a.s.c.ZkContainer Zookeeper client=127.0.0.1:59899/solr
   [junit4]   2> 1237952 WARN  (NIOServerCxn.Factory:0.0.0.0/0.0.0.0:0) [    ] o.a.z.s.NIOServerCnxn caught end of stream exception
   [junit4]   2> EndOfStreamException: Unable to read additional data from client sessionid 0x15b9eef3ae70010, likely client has closed socket
   [junit4]   2> 	at org.apache.zookeeper.server.NIOServerCnxn.doIO(NIOServerCnxn.java:228)
   [junit4]   2> 	at org.apache.zookeeper.server.NIOServerCnxnFactory.run(NIOServerCnxnFactory.java:208)
   [junit4]   2> 	at java.lang.Thread.run(Thread.java:745)
   [junit4]   2> 1237914 INFO  (jetty-launcher-2095-thread-2) [n:127.0.0.1:36697_solr    ] o.a.s.c.OverseerElectionContext I am going to be the leader 127.0.0.1:36697_solr
   [junit4]   2> 1238194 INFO  (jetty-launcher-2095-thread-9) [n:127.0.0.1:50532_solr    ] o.a.s.c.ZkController Register node as live in ZooKeeper:/live_nodes/127.0.0.1:50532_solr
   [junit4]   2> 1238195 INFO  (jetty-launcher-2095-thread-2) [n:127.0.0.1:36697_solr    ] o.a.s.c.Overseer Overseer (id=97846567241187342-127.0.0.1:36697_solr-n_0000000000) starting
   [junit4]   2> 1238361 INFO  (jetty-launcher-2095-thread-3) [n:127.0.0.1:52901_solr    ] o.a.s.c.c.ZkStateReader Updated live nodes from ZooKeeper... (0) -> (1)
   [junit4]   2> 1238363 INFO  (jetty-launcher-2095-thread-3) [n:127.0.0.1:52901_solr    ] o.a.s.c.Overseer Overseer (id=null) closing
   [junit4]   2> 1238365 INFO  (jetty-launcher-2095-thread-3) [n:127.0.0.1:52901_solr    ] o.a.s.c.ZkController Register node as live in ZooKeeper:/live_nodes/127.0.0.1:52901_solr
   [junit4]   2> 1238428 INFO  (jetty-launcher-2095-thread-1) [n:127.0.0.1:40779_solr    ] o.a.s.c.c.ZkStateReader Updated live nodes from ZooKeeper... (0) -> (2)
   [junit4]   2> 1238431 INFO  (jetty-launcher-2095-thread-1) [n:127.0.0.1:40779_solr    ] o.a.s.c.Overseer Overseer (id=null) closing
   [junit4]   2> 1238433 INFO  (jetty-launcher-2095-thread-1) [n:127.0.0.1:40779_solr    ] o.a.s.c.ZkController Register node as live in ZooKeeper:/live_nodes/127.0.0.1:40779_solr
   [junit4]   2> 1238466 INFO  (jetty-launcher-2095-thread-5) [n:127.0.0.1:58170_solr    ] o.a.s.c.c.ZkStateReader Updated live nodes from ZooKeeper... (0) -> (3)
   [junit4]   2> 1238469 INFO  (jetty-launcher-2095-thread-5) [n:127.0.0.1:58170_solr    ] o.a.s.c.Overseer Overseer (id=null) closing
   [junit4]   2> 1238471 INFO  (jetty-launcher-2095-thread-5) [n:127.0.0.1:58170_solr    ] o.a.s.c.ZkController Register node as live in ZooKeeper:/live_nodes/127.0.0.1:58170_solr
   [junit4]   2> 1238536 INFO  (zkCallback-2131-thread-1-processing-n:127.0.0.1:52901_solr) [n:127.0.0.1:52901_solr    ] o.a.s.c.c.ZkStateReader Updated live nodes from ZooKeeper... (1) -> (4)
   [junit4]   2> 1238536 INFO  (zkCallback-2121-thread-1-processing-n:127.0.0.1:50532_solr) [n:127.0.0.1:50532_solr    ] o.a.s.c.c.ZkStateReader Updated live nodes from ZooKeeper... (0) -> (2)
   [junit4]   2> 1238536 INFO  (zkCallback-2117-thread-1-processing-n:127.0.0.1:36697_solr) [n:127.0.0.1:36697_solr    ] o.a.s.c.c.ZkStateReader Updated live nodes from ZooKeeper... (0) -> (4)
   [junit4]   2> 1238568 INFO  (jetty-launcher-2095-thread-2) [n:127.0.0.1:36697_solr    ] o.a.s.c.ZkController Register node as live in ZooKeeper:/live_nodes/127.0.0.1:36697_solr
   [junit4]   2> 1238639 INFO  (jetty-launcher-2095-thread-8) [n:127.0.0.1:60397_solr    ] o.a.s.c.c.ZkStateReader Updated live nodes from ZooKeeper... (0) -> (5)
   [junit4]   2> 1238652 INFO  (jetty-launcher-2095-thread-9) [n:127.0.0.1:50532_solr    ] o.a.s.c.CorePropertiesLocator Found 0 core definitions underneath /x1/jenkins/jenkins-slave/workspace/Lucene-Solr-NightlyTests-6.x/checkout/solr/build/solr-core/test/J0/temp/solr.cloud.TestStressCloudBlindAtomicUpdates_9AE15D1126E42FB5-001/tempDir-001/node8/.
   [junit4]   2> 1238659 INFO  (jetty-launcher-2095-thread-8) [n:127.0.0.1:60397_solr    ] o.a.s.c.Overseer Overseer (id=null) closing
   [junit4]   2> 1238661 INFO  (jetty-launcher-2095-thread-8) [n:127.0.0.1:60397_solr    ] o.a.s.c.ZkController Register node as live in ZooKeeper:/live_nodes/127.0.0.1:60397_solr
   [junit4]   2> 1238734 INFO  (zkCallback-2121-thread-2-processing-n:127.0.0.1:50532_solr) [n:127.0.0.1:50532_solr    ] o.a.s.c.c.ZkStateReader Updated live nodes from ZooKeeper... (2) -> (6)
   [junit4]   2> 1238743 INFO  (jetty-launcher-2095-thread-7) [n:127.0.0.1:57418_solr    ] o.a.s.c.c.ZkStateReader Updated live nodes from ZooKeeper... (0) -> (6)
   [junit4]   2> 1238745 INFO  (jetty-launcher-2095-thread-7) [n:127.0.0.1:57418_solr    ] o.a.s.c.Overseer Overseer (id=null) closing
   [junit4]   2> 1238747 INFO  (jetty-launcher-2095-thread-7) [n:127.0.0.1:57418_solr    ] o.a.s.c.ZkController Register node as live in ZooKeeper:/live_nodes/127.0.0.1:57418_solr
   [junit4]   2> 1238766 INFO  (jetty-launcher-2095-thread-2) [n:127.0.0.1:36697_solr    ] o.a.s.c.CorePropertiesLocator Found 0 core definitions underneath /x1/jenkins/jenkins-slave/workspace/Lucene-Solr-NightlyTests-6.x/checkout/solr/build/solr-core/test/J0/temp/solr.cloud.TestStressCloudBlindAtomicUpdates_9AE15D1126E42FB5-001/tempDir-001/node2/.
   [junit4]   2> 1238786 INFO  (zkCallback-2145-thread-1-processing-n:127.0.0.1:40779_solr) [n:127.0.0.1:40779_solr    ] o.a.s.c.c.ZkStateReader Updated live nodes from ZooKeeper... (2) -> (6)
   [junit4]   2> 1238786 INFO  (zkCallback-2140-thread-1-processing-n:127.0.0.1:58170_solr) [n:127.0.0.1:58170_solr    ] o.a.s.c.c.ZkStateReader Updated live nodes from ZooKeeper... (3) -> (6)
   [junit4]   2> 1238792 INFO  (zkCallback-2131-thread-2-processing-n:127.0.0.1:52901_solr) [n:127.0.0.1:52901_solr    ] o.a.s.c.c.ZkStateReader Updated live nodes from ZooKeeper... (4) -> (7)
   [junit4]   2> 1238798 INFO  (zkCallback-2117-thread-2-processing-n:127.0.0.1:36697_solr) [n:127.0.0.1:36697_solr    ] o.a.s.c.c.ZkStateReader Updated live nodes from ZooKeeper... (4) -> (7)
   [junit4]   2> 1238867 INFO  (zkCallback-2146-thread-1-processing-n:127.0.0.1:60397_solr) [n:127.0.0.1:60397_solr    ] o.a.s.c.c.ZkStateReader Updated live nodes from ZooKeeper... (5) -> (7)
   [junit4]   2> 1238904 INFO  (zkCallback-2121-thread-2-processing-n:127.0.0.1:50532_solr) [n:127.0.0.1:50532_solr    ] o.a.s.c.c.ZkStateReader Updated live nodes from ZooKeeper... (6) -> (7)
   [junit4]   2> 1238905 INFO  (zkCallback-2145-thread-2-processing-n:127.0.0.1:40779_solr) [n:127.0.0.1:40779_solr    ] o.a.s.c.c.ZkStateReader Updated live nodes from ZooKeeper... (6) -> (7)
   [junit4]   2> 1238935 INFO  (zkCallback-2141-thread-1-processing-n:127.0.0.1:57418_solr) [n:127.0.0.1:57418_solr    ] o.a.s.c.c.ZkStateReader Updated live nodes from ZooKeeper... (6) -> (7)
   [junit4]   2> 1238997 INFO  (jetty-launcher-2095-thread-5) [n:127.0.0.1:58170_solr    ] o.a.s.c.CorePropertiesLocator Found 0 core definitions underneath /x1/jenkins/jenkins-slave/workspace/Lucene-Solr-NightlyTests-6.x/checkout/solr/build/solr-core/test/J0/temp/solr.cloud.TestStressCloudBlindAtomicUpdates_9AE15D1126E42FB5-001/tempDir-001/node5/.
   [junit4]   2> 1239003 INFO  (jetty-launcher-2095-thread-6) [n:127.0.0.1:36785_solr    ] o.a.s.c.c.ZkStateReader Updated live nodes from ZooKeeper... (0) -> (7)
   [junit4]   2> 1239005 INFO  (jetty-launcher-2095-thread-6) [n:127.0.0.1:36785_solr    ] o.a.s.c.Overseer Overseer (id=null) closing
   [junit4]   2> 1239008 INFO  (jetty-launcher-2095-thread-6) [n:127.0.0.1:36785_solr    ] o.a.s.c.ZkController Register node as live in ZooKeeper:/live_nodes/127.0.0.1:36785_solr
   [junit4]   2> 1239010 INFO  (zkCallback-2131-thread-2-processing-n:127.0.0.1:52901_solr) [n:127.0.0.1:52901_solr    ] o.a.s.c.c.ZkStateReader Updated live nodes from ZooKeeper... (7) -> (8)
   [junit4]   2> 1239010 INFO  (zkCallback-2146-thread-1-processing-n:127.0.0.1:60397_solr) [n:127.0.0.1:60397_solr    ] o.a.s.c.c.ZkStateReader Updated live nodes from ZooKeeper... (7) -> (8)
   [junit4]   2> 1239010 INFO  (zkCallback-2121-thread-2-processing-n:127.0.0.1:50532_solr) [n:127.0.0.1:50532_solr    ] o.a.s.c.c.ZkStateReader Updated live nodes from ZooKeeper... (7) -> (8)
   [junit4]   2> 1239011 INFO  (zkCallback-2141-thread-1-processing-n:127.0.0.1:57418_solr) [n:127.0.0.1:57418_solr    ] o.a.s.c.c.ZkStateReader Updated live nodes from ZooKeeper... (7) -> (8)
   [junit4]   2> 1239011 INFO  (zkCallback-2117-thread-2-processing-n:127.0.0.1:36697_solr) [n:127.0.0.1:36697_solr    ] o.a.s.c.c.ZkStateReader Updated live nodes from ZooKeeper... (7) -> (8)
   [junit4]   2> 1239039 INFO  (zkCallback-2140-thread-2-processing-n:127.0.0.1:58170_solr) [n:127.0.0.1:58170_solr    ] o.a.s.c.c.ZkStateReader Updated live nodes from ZooKeeper... (6) -> (8)
   [junit4]   2> 1239043 INFO  (zkCallback-2145-thread-2-processing-n:127.0.0.1:40779_solr) [n:127.0.0.1:40779_solr    ] o.a.s.c.c.ZkStateReader Updated live nodes from ZooKeeper... (7) -> (8)
   [junit4]   2> 1239071 INFO  (zkCallback-2153-thread-1-processing-n:127.0.0.1:36785_solr) [n:127.0.0.1:36785_solr    ] o.a.s.c.c.ZkStateReader Updated live nodes from ZooKeeper... (7) -> (8)
   [junit4]   2> 1239099 INFO  (jetty-launcher-2095-thread-3) [n:127.0.0.1:52901_solr    ] o.a.s.c.CorePropertiesLocator Found 0 core definitions underneath /x1/jenkins/jenkins-slave/workspace/Lucene-Solr-NightlyTests-6.x/checkout/solr/build/solr-core/test/J0/temp/solr.cloud.TestStressCloudBlindAtomicUpdates_9AE15D1126E42FB5-001/tempDir-001/node3/.
   [junit4]   2> 1239111 INFO  (jetty-launcher-2095-thread-1) [n:127.0.0.1:40779_solr    ] o.a.s.c.CorePropertiesLocator Found 0 core definitions underneath /x1/jenkins/jenkins-slave/workspace/Lucene-Solr-NightlyTests-6.x/checkout/solr/build/solr-core/test/J0/temp/solr.cloud.TestStressCloudBlindAtomicUpdates_9AE15D1126E42FB5-001/tempDir-001/node1/.
   [junit4]   2> 1239115 INFO  (jetty-launcher-2095-thread-10) [n:127.0.0.1:44822_solr    ] o.a.s.c.c.ZkStateReader Updated live nodes from ZooKeeper... (0) -> (8)
   [junit4]   2> 1239117 INFO  (jetty-launcher-2095-thread-10) [n:127.0.0.1:44822_solr    ] o.a.s.c.Overseer Overseer (id=null) closing
   [junit4]   2> 1239120 INFO  (jetty-launcher-2095-thread-10) [n:127.0.0.1:44822_solr    ] o.a.s.c.ZkController Register node as live in ZooKeeper:/live_nodes/127.0.0.1:44822_solr
   [junit4]   2> 1239122 INFO  (zkCallback-2153-thread-1-processing-n:127.0.0.1:36785_solr) [n:127.0.0.1:36785_solr    ] o.a.s.c.c.ZkStateReader Updated live nodes from ZooKeeper... (8) -> (9)
   [junit4]   2> 1239122 INFO  (zkCallback-2145-thread-2-processing-n:127.0.0.1:40779_solr) [n:127.0.0.1:40779_solr    ] o.a.s.c.c.ZkStateReader Updated live nodes from ZooKeeper... (8) -> (9)
   [junit4]   2> 1239122 INFO  (zkCallback-2146-thread-1-processing-n:127.0.0.1:60397_solr) [n:127.0.0.1:60397_solr    ] o.a.s.c.c.ZkStateReader Updated live nodes from ZooKeeper... (8) -> (9)
   [junit4]   2> 1239123 INFO  (zkCallback-2121-thread-2-processing-n:127.0.0.1:50532_solr) [n:127.0.0.1:50532_solr    ] o.a.s.c.c.ZkStateReader Updated live nodes from ZooKeeper... (8) -> (9)
   [junit4]   2> 1239123 INFO  (zkCallback-2141-thread-1-processing-n:127.0.0.1:57418_solr) [n:127.0.0.1:57418_solr    ] o.a.s.c.c.ZkStateReader Updated live nodes from ZooKeeper... (8) -> (9)
   [junit4]   2> 1239123 INFO  (zkCallback-2131-thread-2-processing-n:127.0.0.1:52901_solr) [n:127.0.0.1:52901_solr    ] o.a.s.c.c.ZkStateReader Updated live nodes from ZooKeeper... (8) -> (9)
   [junit4]   2> 1239123 INFO  (zkCallback-2117-thread-2-processing-n:127.0.0.1:36697_solr) [n:127.0.0.1:36697_solr    ] o.a.s.c.c.ZkStateReader Updated live nodes from ZooKeeper... (8) -> (9)
   [junit4]   2> 1239172 INFO  (zkCallback-2140-thread-2-processing-n:127.0.0.1:58170_solr) [n:127.0.0.1:58170_solr    ] o.a.s.c.c.ZkStateReader Updated live nodes from ZooKeeper... (8) -> (9)
   [junit4]   2> 1239196 INFO  (zkCallback-2151-thread-1-processing-n:127.0.0.1:44822_solr) [n:127.0.0.1:44822_solr    ] o.a.s.c.c.ZkStateReader Updated live nodes from ZooKeeper... (8) -> (9)
   [junit4]   2> 1239516 INFO  (jetty-launcher-2095-thread-4) [n:127.0.0.1:36476_solr    ] o.a.s.c.c.ZkStateReader Updated live nodes from ZooKeeper... (0) -> (9)
   [junit4]   2> 1239519 INFO  (jetty-launcher-2095-thread-4) [n:127.0.0.1:36476_solr    ] o.a.s.c.Overseer Overseer (id=null) closing
   [junit4]   2> 1239521 INFO  (jetty-launcher-2095-thread-4) [n:127.0.0.1:36476_solr    ] o.a.s.c.ZkController Register node as live in ZooKeeper:/live_nodes/127.0.0.1:36476_solr
   [junit4]   2> 1239523 INFO  (zkCallback-2131-thread-2-processing-n:127.0.0.1:52901_solr) [n:127.0.0.1:52901_solr    ] o.a.s.c.c.ZkStateReader Updated live nodes from ZooKeeper... (9) -> (10)
   [junit4]   2> 1239523 INFO  (zkCallback-2145-thread-2-processing-n:127.0.0.1:40779_solr) [n:127.0.0.1:40779_solr    ] o.a.s.c.c.ZkStateReader Updated live nodes from ZooKeeper... (9) -> (10)
   [junit4]   2> 1239523 INFO  (zkCallback-2121-thread-2-processing-n:127.0.0.1:50532_solr) [n:127.0.0.1:50532_solr    ] o.a.s.c.c.ZkStateReader Updated live nodes from ZooKeeper... (9) -> (10)
   [junit4]   2> 1239524 INFO  (zkCallback-2140-thread-2-processing-n:127.0.0.1:58170_solr) [n:127.0.0.1:58170_solr    ] o.a.s.c.c.ZkStateReader Updated live nodes from ZooKeeper... (9) -> (10)
   [junit4]   2> 1239524 INFO  (zkCallback-2141-thread-1-processing-n:127.0.0.1:57418_solr) [n:127.0.0.1:57418_solr    ] o.a.s.c.c.ZkStateReader Updated live nodes from ZooKeeper... (9) -> (10)
   [junit4]   2> 1239524 INFO  (zkCallback-2151-thread-1-processing-n:127.0.0.1:44822_solr) [n:127.0.0.1:44822_solr    ] o.a.s.c.c.ZkStateReader Updated live nodes from ZooKeeper... (9) -> (10)
   [junit4]   2> 1239524 INFO  (zkCallback-2153-thread-1-processing-n:127.0.0.1:36785_solr) [n:127.0.0.1:36785_solr    ] o.a.s.c.c.ZkStateReader Updated live nodes from ZooKeeper... (9) -> (10)
   [junit4]   2> 1239524 INFO  (zkCallback-2117-thread-2-processing-n:127.0.0.1:36697_solr) [n:127.0.0.1:36697_solr    ] o.a.s.c.c.ZkStateReader Updated live nodes from ZooKeeper... (9) -> (10)
   [junit4]   2> 1239527 INFO  (zkCallback-2146-thread-1-processing-n:127.0.0.1:60397_solr) [n:127.0.0.1:60397_solr    ] o.a.s.c.c.ZkStateReader Updated live nodes from ZooKeeper... (9) -> (10)
   [junit4]   2> 1240420 INFO  (zkCallback-2154-thread-1-processing-n:127.0.0.1:36476_solr) [n:127.0.0.1:36476_solr    ] o.a.s.c.c.ZkStateReader Updated live nodes from ZooKeeper... (9) -> (10)
   [junit4]   2> 1240839 INFO  (jetty-launcher-2095-thread-8) [n:127.0.0.1:60397_solr    ] o.a.s.c.CorePropertiesLocator Found 0 core definitions underneath /x1/jenkins/jenkins-slave/workspace/Lucene-Solr-NightlyTests-6.x/checkout/solr/build/solr-core/test/J0/temp/solr.cloud.TestStressCloudBlindAtomicUpdates_9AE15D1126E42FB5-001/tempDir-001/node7/.
   [junit4]   2> 1240877 INFO  (jetty-launcher-2095-thread-6) [n:127.0.0.1:36785_solr    ] o.a.s.c.CorePropertiesLocator Found 0 core definitions underneath /x1/jenkins/jenkins-slave/workspace/Lucene-Solr-NightlyTests-6.x/checkout/solr/build/solr-core/test/J0/temp/solr.cloud.TestStressCloudBlindAtomicUpdates_9AE15D1126E42FB5-001/tempDir-001/node6/.
   [junit4]   2> 1241448 INFO  (jetty-launcher-2095-thread-10) [n:127.0.0.1:44822_solr    ] o.a.s.c.CorePropertiesLocator Found 0 core definitions underneath /x1/jenkins/jenkins-slave/workspace/Lucene-Solr-NightlyTests-6.x/checkout/solr/build/solr-core/test/J0/temp/solr.cloud.TestStressCloudBlindAtomicUpdates_9AE15D1126E42FB5-001/tempDir-001/node10/.
   [junit4]   2> 1241449 INFO  (jetty-launcher-2095-thread-7) [n:127.0.0.1:57418_solr    ] o.a.s.c.CorePropertiesLocator Found 0 core definitions underneath /x1/jenkins/jenkins-slave/workspace/Lucene-Solr-NightlyTests-6.x/checkout/solr/build/solr-core/test/J0/temp/solr.cloud.TestStressCloudBlindAtomicUpdates_9AE15D1126E42FB5-001/tempDir-001/node9/.
   [junit4]   2> 1241579 INFO  (jetty-launcher-2095-thread-4) [n:127.0.0.1:36476_solr    ] o.a.s.c.CorePropertiesLocator Found 0 core definitions underneath /x1/jenkins/jenkins-slave/workspace/Lucene-Solr-NightlyTests-6.x/checkout/solr/build/solr-core/test/J0/temp/solr.cloud.TestStressCloudBlindAtomicUpdates_9AE15D1126E42FB5-001/tempDir-001/node4/.
   [junit4]   2> 1249637 INFO  (SUITE-TestStressCloudBlindAtomicUpdates-seed#[9AE15D1126E42FB5]-worker) [    ] o.a.s.c.c.ZkStateReader Updated live nodes from ZooKeeper... (0) -> (10)
   [junit4]   2> 1249638 INFO  (SUITE-TestStressCloudBlindAtomicUpdates-seed#[9AE15D1126E42FB5]-worker) [    ] o.a.s.c.s.i.ZkClientClusterStateProvider Cluster at 127.0.0.1:59899/solr ready
   [junit4]   2> 1250471 INFO  (qtp11886472-13443) [n:127.0.0.1:40779_solr    ] o.a.s.h.a.CollectionsHandler Invoked Collection Action :create with params replicationFactor=2&property.config=solrconfig-tlog.xml&property.schema=schema-minimal-atomic-stress.xml&collection.configName=org.apache.solr.cloud.TestStressCloudBlindAtomicUpdates_config-set&name=test_col&action=CREATE&numShards=5&wt=javabin&version=2 and sendToOCPQueue=true
   [junit4]   2> 1250491 INFO  (OverseerThreadFactory-3286-thread-1-processing-n:127.0.0.1:36697_solr) [n:127.0.0.1:36697_solr    ] o.a.s.c.CreateCollectionCmd Create collection test_col
   [junit4]   2> 1250755 INFO  (qtp227331853-13453) [n:127.0.0.1:36785_solr    ] o.a.s.h.a.CoreAdminOperation core create command property.config=solrconfig-tlog.xml&property.schema=schema-minimal-atomic-stress.xml&qt=/admin/cores&collection.configName=org.apache.solr.cloud.TestStressCloudBlindAtomicUpdates_config-set&newCollection=true&name=test_col_shard4_replica1&action=CREATE&numShards=5&collection=test_col&shard=shard4&wt=javabin&version=2
   [junit4]   2> 1250756 INFO  (qtp227331853-13453) [n:127.0.0.1:36785_solr    ] o.a.s.c.TransientSolrCoreCacheDefault Allocating transient cache for 2147483647 transient cores
   [junit4]   2> 1250756 INFO  (qtp1386131883-13416) [n:127.0.0.1:52901_solr    ] o.a.s.h.a.CoreAdminOperation core create command property.config=solrconfig-tlog.xml&property.schema=schema-minimal-atomic-stress.xml&qt=/admin/cores&collection.configName=org.apache.solr.cloud.TestStressCloudBlindAtomicUpdates_config-set&newCollection=true&name=test_col_shard3_replica1&action=CREATE&numShards=5&collection=test_col&shard=shard3&wt=javabin&version=2
   [junit4]   2> 1250756 INFO  (qtp1386131883-13416) [n:127.0.0.1:52901_solr    ] o.a.s.c.TransientSolrCoreCacheDefault Allocating transient cache for 2147483647 transient cores
   [junit4]   2> 1250757 INFO  (qtp230287282-13429) [n:127.0.0.1:36697_solr    ] o.a.s.h.a.CoreAdminOperation core create command property.config=solrconfig-tlog.xml&property.schema=schema-minimal-atomic-stress.xml&qt=/admin/cores&collection.configName=org.apache.solr.cloud.TestStressCloudBlindAtomicUpdates_config-set&newCollection=true&name=test_col_shard5_replica2&action=CREATE&numShards=5&collection=test_col&shard=shard5&wt=javabin&version=2
   [junit4]   2> 1250757 INFO  (qtp230287282-13429) [n:127.0.0.1:36697_solr    ] o.a.s.c.TransientSolrCoreCacheDefault Allocating transient cache for 2147483647 transient cores
   [junit4]   2> 1250758 INFO  (qtp1041507910-13518) [n:127.0.0.1:57418_solr    ] o.a.s.h.a.CoreAdminOperation core create command property.config=solrconfig-tlog.xml&property.schema=schema-minimal-atomic-stress.xml&qt=/admin/cores&collection.configName=org.apache.solr.cloud.TestStressCloudBlindAtomicUpdates_config-set&newCollection=true&name=test_col_shard4_replica2&action=CREATE&numShards=5&collection=test_col&shard=shard4&wt=javabin&version=2
   [junit4]   2> 1250759 INFO  (qtp1041507910-13518) [n:127.0.0.1:57418_solr    ] o.a.s.c.TransientSolrCoreCacheDefault Allocating transient cache for 2147483647 transient cores
   [junit4]   2> 1250759 INFO  (qtp105500225-13485) [n:127.0.0.1:36476_solr    ] o.a.s.h.a.CoreAdminOperation core create command property.config=solrconfig-tlog.xml&property.schema=schema-minimal-atomic-stress.xml&qt=/admin/cores&collection.configName=org.apache.solr.cloud.TestStressCloudBlindAtomicUpdates_config-set&newCollection=true&name=test_col_shard2_replica2&action=CREATE&numShards=5&collection=test_col&shard=shard2&wt=javabin&version=2
   [junit4]   2> 1250894 INFO  (qtp11886472-13446) [n:127.0.0.1:40779_solr    ] o.a.s.h.a.CoreAdminOperation core create command property.config=solrconfig-tlog.xml&property.schema=schema-minimal-atomic-stress.xml&qt=/admin/cores&collection.configName=org.apache.solr.cloud.TestStressCloudBlindAtomicUpdates_config-set&newCollection=true&name=test_col_shard2_replica1&action=CREATE&numShards=5&collection=test_col&shard=shard2&wt=javabin&version=2
   [junit4]   2> 1250895 INFO  (qtp11886472-13446) [n:127.0.0.1:40779_solr    ] o.a.s.c.TransientSolrCoreCacheDefault Allocating transient cache for 2147483647 transient cores
   [junit4]   2> 1250895 INFO  (qtp1885058861-13496) [n:127.0.0.1:44822_solr    ] o.a.s.h.a.CoreAdminOperation core create command property.config=solrconfig-tlog.xml&property.schema=schema-minimal-atomic-stress.xml&qt=/admin/cores&collection.configName=org.apache.solr.cloud.TestStressCloudBlindAtomicUpdates_config-set&newCollection=true&name=test_col_shard5_replica1&action=CREATE&numShards=5&collection=test_col&shard=shard5&wt=javabin&version=2
   [junit4]   2> 1250895 INFO  (qtp1885058861-13496) [n:127.0.0.1:44822_solr    ] o.a.s.c.TransientSolrCoreCacheDefault Allocating transient cache for 2147483647 transient cores
   [junit4]   2> 1250896 INFO  (qtp1872717449-13471) [n:127.0.0.1:58170_solr    ] o.a.s.h.a.CoreAdminOperation core create command property.config=solrconfig-tlog.xml&property.schema=schema-minimal-atomic-stress.xml&qt=/admin/cores&collection.configName=org.apache.solr.cloud.TestStressCloudBlindAtomicUpdates_config-set&newCollection=true&name=test_col_shard1_replica2&action=CREATE&numShards=5&collection=test_col&shard=shard1&wt=javabin&version=2
   [junit4]   2> 1250896 INFO  (qtp1872717449-13471) [n:127.0.0.1:58170_solr    ] o.a.s.c.TransientSolrCoreCacheDefault Allocating transient cache for 2147483647 transient cores
   [junit4]   2> 1250897 INFO  (qtp1379431034-13508) [n:127.0.0.1:60397_solr    ] o.a.s.h.a.CoreAdminOperation core create command property.config=solrconfig-tlog.xml&property.schema=schema-minimal-atomic-stress.xml&qt=/admin/cores&collection.configName=org.apache.solr.cloud.TestStressCloudBlindAtomicUpdates_config-set&newCollection=true&name=test_col_shard1_replica1&action=CREATE&numShards=5&collection=test_col&shard=shard1&wt=javabin&version=2
   [junit4]   2> 1250897 INFO  (qtp1379431034-13508) [n:127.0.0.1:60397_solr    ] o.a.s.c.TransientSolrCoreCacheDefault Allocating transient cache for 2147483647 transient cores
   [junit4]   2> 1250897 INFO  (qtp1615930047-13531) [n:127.0.0.1:50532_solr    ] o.a.s.h.a.CoreAdminOperation core create command property.config=solrconfig-tlog.xml&property.schema=schema-minimal-atomic-stress.xml&qt=/admin/cores&collection.configName=org.apache.solr.cloud.TestStressCloudBlindAtomicUpdates_config-set&newCollection=true&name=test_col_shard3_replica2&action=CREATE&numShards=5&collection=test_col&shard=shard3&wt=javabin&version=2
   [junit4]   2> 1250898 INFO  (qtp1615930047-13531) [n:127.0.0.1:50532_solr    ] o.a.s.c.TransientSolrCoreCacheDefault Allocating transient cache for 2147483647 transient cores
   [junit4]   2> 1251163 INFO  (qtp105500225-13485) [n:127.0.0.1:36476_solr    ] o.a.s.c.TransientSolrCoreCacheDefault Allocating transient cache for 2147483647 transient cores
   [junit4]   2> 1251346 INFO  (zkCallback-2141-thread-1-processing-n:127.0.0.1:57418_solr) [n:127.0.0.1:57418_solr    ] o.a.s.c.c.ZkStateReader A cluster state change: [WatchedEvent state:SyncConnected type:NodeDataChanged path:/collections/test_col/state.json] for collection [test_col] has occurred - updating... (live nodes size: [10])
   [junit4]   2> 1251346 INFO  (zkCallback-2151-thread-1-processing-n:127.0.0.1:44822_solr) [n:127.0.0.1:44822_solr    ] o.a.s.c.c.ZkStateReader A cluster state change: [WatchedEvent state:SyncConnected type:NodeDataChanged path:/collections/test_col/state.json] for collection [test_col] has occurred - updating... (live nodes size: [10])
   [junit4]   2> 1251346 INFO  (zkCallback-2146-thread-1-processing-n:127.0.0.1:60397_solr) [n:127.0.0.1:60397_solr    ] o.a.s.c.c.ZkStateReader A cluster state change: [WatchedEvent state:SyncConnected type:NodeDataChanged path:/collections/test_col/state.json] for collection [test_col] has occurred - updating... (live nodes size: [10])
   [junit4]   2> 1251346 INFO  (zkCallback-2121-thread-2-processing-n:127.0.0.1:50532_solr) [n:127.0.0.1:50532_solr    ] o.a.s.c.c.ZkStateReader A cluster state change: [WatchedEvent state:SyncConnected type:NodeDataChanged path:/collections/test_col/state.json] for collection [test_col] has occurred - updating... (live nodes size: [10])
   [junit4]   2> 1251346 INFO  (zkCallback-2140-thread-2-processing-n:127.0.0.1:58170_solr) [n:127.0.0.1:58170_solr    ] o.a.s.c.c.ZkStateReader A cluster state change: [WatchedEvent state:SyncConnected type:NodeDataChanged path:/collections/test_col/state.json] for collection [test_col] has occurred - updating... (live nodes size: [10])
   [junit4]   2> 1251346 INFO  (zkCallback-2117-thread-2-processing-n:127.0.0.1:36697_solr) [n:127.0.0.1:36697_solr    ] o.a.s.c.c.ZkStateReader A cluster state change: [WatchedEvent state:SyncConnected type:NodeDataChanged path:/collections/test_col/state.json] for collection [test_col] has occurred - updating... (live nodes size: [10])
   [junit4]   2> 1251346 INFO  (zkCallback-2145-thread-2-processing-n:127.0.0.1:40779_solr) [n:127.0.0.1:40779_solr    ] o.a.s.c.c.ZkStateReader A cluster state change: [WatchedEvent state:SyncConnected type:NodeDataChanged path:/collections/test_col/state.json] for collection [test_col] has occurred - updating... (live nodes size: [10])
   [junit4]   2> 1251347 INFO  (zkCallback-2131-thread-2-processing-n:127.0.0.1:52901_solr) [n:127.0.0.1:52901_solr    ] o.a.s.c.c.ZkStateReader A cluster state change: [WatchedEvent state:SyncConnected type:NodeDataChanged path:/collections/test_col/state.json] for collection [test_col] has occurred - updating... (live nodes size: [10])
   [junit4]   2> 1251347 INFO  (zkCallback-2154-thread-1-processing-n:127.0.0.1:36476_solr) [n:127.0.0.1:36476_solr    ] o.a.s.c.c.ZkStateReader A cluster state change: [WatchedEvent state:SyncConnected type:NodeDataChanged path:/collections/test_col/state.json] for collection [test_col] has occurred - updating... (live nodes size: [10])
   [junit4]   2> 1251347 INFO  (zkCallback-2153-thread-1-processing-n:127.0.0.1:36785_solr) [n:127.0.0.1:36785_solr    ] o.a.s.c.c.ZkStateReader A cluster state change: [WatchedEvent state:SyncConnected type:NodeDataChanged path:/collections/test_col/state.json] for collection [test_col] has occurred - updating... (live nodes size: [10])
   [junit4]   2> 1252287 INFO  (qtp230287282-13429) [n:127.0.0.1:36697_solr c:test_col s:shard5  x:test_col_shard5_replica2] o.a.s.c.SolrConfig Using Lucene MatchVersion: 6.6.0
   [junit4]   2> 1252292 INFO  (qtp105500225-13485) [n:127.0.0.1:36476_solr c:test_col s:shard2  x:test_col_shard2_replica2] o.a.s.c.SolrConfig Using Lucene MatchVersion: 6.6.0
   [junit4]   2> 1252350 INFO  (qtp11886472-13446) [n:127.0.0.1:40779_solr c:test_col s:shard2  x:test_col_shard2_replica1] o.a.s.c.SolrConfig Using Lucene MatchVersion: 6.6.0
   [junit4]   2> 1252357 INFO  (qtp227331853-13453) [n:127.0.0.1:36785_solr c:test_col s:shard4  x:test_col_shard4_replica1] o.a.s.c.SolrConfig Using Lucene MatchVersion: 6.6.0
   [junit4]   2> 1252373 INFO  (qtp1041507910-13518) [n:127.0.0.1:57418_solr c:test_col s:shard4  x:test_col_shard4_replica2] o.a.s.c.SolrConfig Using Lucene MatchVersion: 6.6.0
   [junit4]   2> 1252375 INFO  (qtp1872717449-13471) [n:127.0.0.1:58170_solr c:test_col s:shard1  x:test_col_shard1_replica2] o.a.s.c.SolrConfig Using Lucene MatchVersion: 6.6.0
   [junit4]   2> 1252378 INFO  (qtp1885058861-13496) [n:127.0.0.1:44822_solr c:test_col s:shard5  x:test_col_shard5_replica1] o.a.s.c.SolrConfig Using Lucene MatchVersion: 6.6.0
   [junit4]   2> 1252392 INFO  (qtp230287282-13429) [n:127.0.0.1:36697_solr c:test_col s:shard5  x:test_col_shard5_replica2] o.a.s.s.IndexSchema [test_col_shard5_replica2] Schema name=minimal-atomic-stress
   [junit4]   2> 1252401 INFO  (qtp1386131883-13416) [n:127.0.0.1:52901_solr c:test_col s:shard3  x:test_col_shard3_replica1] o.a.s.c.SolrConfig Using Lucene MatchVersion: 6.6.0
   [junit4]   2> 1252435 INFO  (qtp1615930047-13531) [n:127.0.0.1:50532_solr c:test_col s:shard3  x:test_col_shard3_replica2] o.a.s.c.SolrConfig Using Lucene MatchVersion: 6.6.0
   [junit4]   2> 1252450 INFO  (qtp230287282-13429) [n:127.0.0.1:36697_solr c:test_col s:shard5  x:test_col_shard5_replica2] o.a.s.s.IndexSchema Loaded schema minimal-atomic-stress/1.6 with uniqueid field id
   [junit4]   2> 1252450 INFO  (qtp230287282-13429) [n:127.0.0.1:36697_solr c:test_col s:shard5  x:test_col_shard5_replica2] o.a.s.c.CoreContainer Creating SolrCore 'test_col_shard5_replica2' using configuration from collection test_col, trusted=true
   [junit4]   2> 1252450 INFO  (qtp230287282-13429) [n:127.0.0.1:36697_solr c:test_col s:shard5  x:test_col_shard5_replica2] o.a.s.c.SolrCore solr.RecoveryStrategy.Builder
   [junit4]   2> 1252450 INFO  (qtp230287282-13429) [n:127.0.0.1:36697_solr c:test_col s:shard5  x:test_col_shard5_replica2] o.a.s.c.SolrCore [[test_col_shard5_replica2] ] Opening new SolrCore at [/x1/jenkins/jenkins-slave/workspace/Lucene-Solr-NightlyTests-6.x/checkout/solr/build/solr-core/test/J0/temp/solr.cloud.TestStressCloudBlindAtomicUpdates_9AE15D1126E42FB5-001/tempDir-001/node2/test_col_shard5_replica2], dataDir=[/x1/jenkins/jenkins-slave/workspace/Lucene-Solr-NightlyTests-6.x/checkout/solr/build/solr-core/test/J0/temp/solr.cloud.TestStressCloudBlindAtomicUpdates_9AE15D1126E42FB5-001/tempDir-001/node2/./test_col_shard5_replica2/data/]
   [junit4]   2> 1252451 INFO  (qtp230287282-13429) [n:127.0.0.1:36697_solr c:test_col s:shard5  x:test_col_shard5_replica2] o.a.s.c.JmxMonitoredMap JMX monitoring is enabled. Adding Solr mbeans to JMX Server: com.sun.jmx.mbeanserver.JmxMBeanServer@56a83aa
   [junit4]   2> 1252453 INFO  (qtp230287282-13429) [n:127.0.0.1:36697_solr c:test_col s:shard5  x:test_col_shard5_replica2] o.a.s.u.RandomMergePolicy RandomMergePolicy wrapping class org.apache.lucene.index.TieredMergePolicy: [TieredMergePolicy: maxMergeAtOnce=22, maxMergeAtOnceExplicit=24, maxMergedSegmentMB=92.0673828125, floorSegmentMB=1.5703125, forceMergeDeletesPctAllowed=21.888740769713117, segmentsPerTier=12.0, maxCFSSegmentSizeMB=8.796093022207999E12, noCFSRatio=0.3317574062755069
   [junit4]   2> 1252453 INFO  (qtp227331853-13453) [n:127.0.0.1:36785_solr c:test_col s:shard4  x:test_col_shard4_replica1] o.a.s.s.IndexSchema [test_col_shard4_replica1] Schema name=minimal-atomic-stress
   [junit4]   2> 1252457 INFO  (qtp11886472-13446) [n:127.0.0.1:40779_solr c:test_col s:shard2  x:test_col_shard2_replica1] o.a.s.s.IndexSchema [test_col_shard2_replica1] Schema name=minimal-atomic-stress
   [junit4]   2> 1252462 INFO  (qtp227331853-13453) [n:127.0.0.1:36785_solr c:test_col s:shard4  x:test_col_shard4_replica1] o.a.s.s.IndexSchema Loaded schema minimal-atomic-stress/1.6 with uniqueid field id
   [junit4]   2> 1252462 INFO  (qtp227331853-13453) [n:127.0.0.1:36785_solr c:test_col s:shard4  x:test_col_shard4_replica1] o.a.s.c.CoreContainer Creating SolrCore 'test_col_shard4_replica1' using configuration from collection test_col, trusted=true
   [junit4]   2> 1252463 INFO  (qtp227331853-13453) [n:127.0.0.1:36785_solr c:test_col s:shard4  x:test_col_shard4_replica1] o.a.s.c.SolrCore solr.RecoveryStrategy.Builder
   [junit4]   2> 1252463 INFO  (qtp227331853-13453) [n:127.0.0.1:36785_solr c:test_col s:shard4  x:test_col_shard4_replica1] o.a.s.c.SolrCore [[test_col_shard4_replica1] ] Opening new SolrCore at [/x1/jenkins/jenkins-slave/workspace/Lucene-Solr-NightlyTests-6.x/checkout/solr/build/solr-core/test/J0/temp/solr.cloud.TestStressCloudBlindAtomicUpdates_9AE15D1126E42FB5-001/tempDir-001/node6/test_col_shard4_replica1], dataDir=[/x1/jenkins/jenkins-slave/workspace/Lucene-Solr-NightlyTests-6.x/checkout/solr/build/solr-core/test/J0/temp/solr.cloud.TestStressCloudBlindAtomicUpdates_9AE15D1126E42FB5-001/tempDir-001/node6/./test_col_shard4_replica1/data/]
   [junit4]   2> 1252490 INFO  (qtp227331853-13453) [n:127.0.0.1:36785_solr c:test_col s:shard4  x:test_col_shard4_replica1] o.a.s.c.JmxMonitoredMap JMX monitoring is enabled. Adding Solr mbeans to JMX Server: com.sun.jmx.mbeanserver.JmxMBeanServer@56a83aa
   [junit4]   2> 1252497 INFO  (qtp227331853-13453) [n:127.0.0.1:36785_solr c:test_col s:shard4  x:test_col_shard4_replica1] o.a.s.u.RandomMergePolicy RandomMergePolicy wrapping class org.apache.lucene.index.TieredMergePolicy: [TieredMergePolicy: maxMergeAtOnce=22, maxMergeAtOnceExplicit=24, maxMergedSegmentMB=92.0673828125, floorSegmentMB=1.5703125, forceMergeDeletesPctAllowed=21.888740769713117, segmentsPerTier=12.0, maxCFSSegmentSizeMB=8.796093022207999E12, noCFSRatio=0.3317574062755069
   [junit4]   2> 1252489 INFO  (qtp1615930047-13531) [n:127.0.0.1:50532_solr c:test_col s:shard3  x:test_col_shard3_replica2] o.a.s.s.IndexSchema [test_col_shard3_replica2] Schema name=minimal-atomic-stress
   [junit4]   2> 1252489 INFO  (qtp1379431034-13508) [n:127.0.0.1:60397_solr c:test_col s:shard1  x:test_col_shard1_replica1] o.a.s.c.SolrConfig Using Lucene MatchVersion: 6.6.0
   [junit4]   2> 1252502 INFO  (qtp1615930047-13531) [n:127.0.0.1:50532_solr c:test_col s:shard3  x:test_col_shard3_replica2] o.a.s.s.IndexSchema Loaded schema minimal-atomic-stress/1.6 with uniqueid field id
   [junit4]   2> 1252502 INFO  (qtp1615930047-13531) [n:127.0.0.1:50532_solr c:test_col s:shard3  x:test_col_shard3_replica2] o.a.s.c.CoreContainer Creating SolrCore 'test_col_shard3_replica2' using configuration from collection test_col, trusted=true
   [junit4]   2> 1252503 INFO  (qtp11886472-13446) [n:127.0.0.1:40779_solr c:test_col s:shard2  x:test_col_shard2_replica1] o.a.s.s.IndexSchema Loaded schema minimal-atomic-stress/1.6 with uniqueid field id
   [junit4]   2> 1252503 INFO  (qtp11886472-13446) [n:127.0.0.1:40779_solr c:test_col s:shard2  x:test_col_shard2_replica1] o.a.s.c.CoreContainer Creating SolrCore 'test_col_shard2_replica1' using configuration from collection test_col, trusted=true
   [junit4]   2> 1252503 INFO  (qtp11886472-13446) [n:127.0.0.1:40779_solr c:test_col s:shard2  x:test_col_shard2_replica1] o.a.s.c.SolrCore solr.RecoveryStrategy.Builder
   [junit4]   2> 1252503 INFO  (qtp11886472-13446) [n:127.0.0.1:40779_solr c:test_col s:shard2  x:test_col_shard2_replica1] o.a.s.c.SolrCore [[test_col_shard2_replica1] ] Opening new SolrCore at [/x1/jenkins/jenkins-slave/workspace/Lucene-Solr-NightlyTests-6.x/checkout/solr/build/solr-core/test/J0/temp/solr.cloud.TestStressCloudBlindAtomicUpdates_9AE15D1126E42FB5-001/tempDir-001/node1/test_col_shard2_replica1], dataDir=[/x1/jenkins/jenkins-slave/workspace/Lucene-Solr-NightlyTests-6.x/checkout/solr/build/solr-core/test/J0/temp/solr.cloud.TestStressCloudBlindAtomicUpdates_9AE15D1126E42FB5-001/tempDir-001/node1/./test_col_shard2_replica1/data/]
   [junit4]   2> 1252504 INFO  (qtp11886472-13446) [n:127.0.0.1:40779_solr c:test_col s:shard2  x:test_col_shard2_replica1] o.a.s.c.JmxMonitoredMap JMX monitoring is enabled. Adding Solr mbeans to JMX Server: com.sun.jmx.mbeanserver.JmxMBeanServer@56a83aa
   [junit4]   2> 1252477 INFO  (qtp1041507910-13518) [n:127.0.0.1:57418_solr c:test_col s:shard4  x:test_col_shard4_replica2] o.a.s.s.IndexSchema [test_col_shard4_replica2] Schema name=minimal-atomic-stress
   [junit4]   2> 1252509 INFO  (qtp1041507910-13518) [n:127.0.0.1:57418_solr c:test_col s:shard4  x:test_col_shard4_replica2] o.a.s.s.IndexSchema Loaded schema minimal-atomic-stress/1.6 with uniqueid field id
   [junit4]   2> 1252509 INFO  (qtp1041507910-13518) [n:127.0.0.1:57418_solr c:test_col s:shard4  x:test_col_shard4_replica2] o.a.s.c.CoreContainer Creating SolrCore 'test_col_shard4_replica2' using configuration from collection test_col, trusted=true
   [junit4]   2> 1252510 INFO  (qtp1041507910-13518) [n:127.0.0.1:57418_solr c:test_col s:shard4  x:test_col_shard4_replica2] o.a.s.c.SolrCore solr.RecoveryStrategy.Builder
   [junit4]   2> 1252510 INFO  (qtp1041507910-13518) [n:127.0.0.1:57418_solr c:test_col s:shard4  x:test_col_shard4_replica2] o.a.s.c.SolrCore [[test_col_shard4_replica2] ] Opening new SolrCore at [/x1/jenkins/jenkins-slave/workspace/Lucene-Solr-NightlyTests-6.x/checkout/solr/build/solr-core/test/J0/temp/solr.cloud.TestStressCloudBlindAtomicUpdates_9AE15D1126E42FB5-001/tempDir-001/node9/test_col_shard4_replica2], dataDir=[/x1/jenkins/jenkins-slave/workspace/Lucene-Solr-NightlyTests-6.x/checkout/solr/build/solr-core/test/J0/temp/solr.cloud.TestStressCloudBlindAtomicUpdates_9AE15D1126E42FB5-001/tempDir-001/node9/./test_col_shard4_replica2/data/]
   [junit4]   2> 1252510 INFO  (qtp1041507910-13518) [n:127.0.0.1:57418_solr c:test_col s:shard4  x:test_col_shard4_replica2] o.a.s.c.JmxMonitoredMap JMX monitoring is enabled. Adding Solr mbeans to JMX Server: com.sun.jmx.mbeanserver.JmxMBeanServer@56a83aa
   [junit4]   2> 1252474 INFO  (qtp1872717449-13471) [n:127.0.0.1:58170_solr c:test_col s:shard1  x:test_col_shard1_replica2] o.a.s.s.IndexSchema [test_col_shard1_replica2] Schema name=minimal-atomic-stress
   [junit4]   2> 1252471 INFO  (qtp105500225-13485) [n:127.0.0.1:36476_solr c:test_col s:shard2  x:test_col_shard2_replica2] o.a.s.s.IndexSchema [test_col_shard2_replica2] Schema name=minimal-atomic-stress
   [junit4]   2> 1252513 INFO  (qtp105500225-13485) [n:127.0.0.1:36476_solr c:test_col s:shard2  x:test_col_shard2_replica2] o.a.s.s.IndexSchema Loaded schema minimal-atomic-stress/1.6 with uniqueid field id
   [junit4]   2> 1252513 INFO  (qtp105500225-13485) [n:127.0.0.1:36476_solr c:test_col s:shard2  x:test_col_shard2_replica2] o.a.s.c.CoreContainer Creating SolrCore 'test_col_shard2_replica2' using configuration from collection test_col, trusted=true
   [junit4]   2> 1252515 INFO  (qtp105500225-13485) [n:127.0.0.1:36476_solr c:test_col s:shard2  x:test_col_shard2_replica2] o.a.s.c.SolrCore solr.RecoveryStrategy.Builder
   [junit4]   2> 1252515 INFO  (qtp105500225-13485) [n:127.0.0.1:36476_solr c:test_col s:shard2  x:test_col_shard2_replica2] o.a.s.c.SolrCore [[test_col_shard2_replica2] ] Opening new SolrCore at [/x1/jenkins/jenkins-slave/workspace/Lucene-Solr-NightlyTests-6.x/checkout/solr/build/solr-core/test/J0/temp/solr.cloud.TestStressCloudBlindAtomicUpdates_9AE15D1126E42FB5-001/tempDir-001/node4/test_col_shard2_replica2], dataDir=[/x1/jenkins/jenkins-slave/workspace/Lucene-Solr-NightlyTests-6.x/checkout/solr/build/solr-core/test/J0/temp/solr.cloud.TestStressCloudBlindAtomicUpdates_9AE15D1126E42FB5-001/tempDir-001/node4/./test_col_shard2_replica2/data/]
   [junit4]   2> 1252515 INFO  (qtp105500225-13485) [n:127.0.0.1:36476_solr c:test_col s:shard2  x:test_col_shard2_replica2] o.a.s.c.JmxMonitoredMap JMX monitoring is enabled. Adding Solr mbeans to JMX Server: com.sun.jmx.mbeanserver.JmxMBeanServer@56a83aa
   [junit4]   2> 1252518 INFO  (qtp1872717449-13471) [n:127.0.0.1:58170_solr c:test_col s:shard1  x:test_col_shard1_replica2] o.a.s.s.IndexSchema Loaded schema minimal-atomic-stress/1.6 with uniqueid field id
   [junit4]   2> 1252518 INFO  (qtp1872717449-13471) [n:127.0.0.1:58170_solr c:test_col s:shard1  x:test_col_shard1_replica2] o.a.s.c.CoreContainer Creating SolrCore 'test_col_shard1_replica2' using configuration from collection test_col, trusted=true
   [junit4]   2> 1252523 INFO  (qtp105500225-13485) [n:127.0.0.1:36476_solr c:test_col s:shard2  x:test_col_shard2_replica2] o.a.s.u.RandomMergePolicy RandomMergePolicy wrapping class org.apache.lucene.index.TieredMergePolicy: [TieredMergePolicy: maxMergeAtOnce=22, maxMergeAtOnceExplicit=24, maxMergedSegmentMB=92.0673828125, floorSegmentMB=1.5703125, forceMergeDeletesPctAllowed=21.888740769713117, segmentsPerTier=12.0, maxCFSSegmentSizeMB=8.796093022207999E12, noCFSRatio=0.3317574062755069
   [junit4]   2> 1252527 INFO  (qtp1615930047-13531) [n:127.0.0.1:50532_solr c:test_col s:shard3  x:test_col_shard3_replica2] o.a.s.c.SolrCore solr.RecoveryStrategy.Builder
   [junit4]   2> 1252527 INFO  (qtp1615930047-13531) [n:127.0.0.1:50532_solr c:test_col s:shard3  x:test_col_shard3_replica2] o.a.s.c.SolrCore [[test_col_shard3_replica2] ] Opening new SolrCore at [/x1/jenkins/jenkins-slave/workspace/Lucene-Solr-NightlyTests-6.x/checkout/solr/build/solr-core/test/J0/temp/solr.cloud.TestStressCloudBlindAtomicUpdates_9AE15D1126E42FB5-001/tempDir-001/node8/test_col_shard3_replica2], dataDir=[/x1/jenkins/jenkins-slave/workspace/Lucene-Solr-NightlyTests-6.x/checkout/solr/build/solr-core/test/J0/temp/solr.cloud.TestStressCloudBlindAtomicUpdates_9AE15D1126E42FB5-001/tempDir-001/node8/./test_col_shard3_replica2/data/]
   [junit4]   2> 1252528 INFO  (qtp1615930047-13531) [n:127.0.0.1:50532_solr c:test_col s:shard3  x:test_col_shard3_replica2] o.a.s.c.JmxMonitoredMap JMX monitoring is enabled. Adding Solr mbeans to JMX Server: com.sun.jmx.mbeanserver.JmxMBeanServer@56a83aa
   [junit4]   2> 1252540 INFO  (qtp11886472-13446) [n:127.0.0.1:40779_solr c:test_col s:shard2  x:test_col_shard2_replica1] o.a.s.u.RandomMergePolicy RandomMergePolicy wrapping class org.apache.lucene.index.TieredMergePolicy: [TieredMergePolicy: maxMergeAtOnce=22, maxMergeAtOnceExplicit=24, maxMergedSegmentMB=92.0673828125, floorSegmentMB=1.5703125, forceMergeDeletesPctAllowed=21.888740769713117, segmentsPerTier=12.0, maxCFSSegmentSizeMB=8.796093022207999E12, noCFSRatio=0.3317574062755069
   [junit4]   2> 1252552 INFO  (qtp1041507910-13518) [n:127.0.0.1:57418_solr c:test_col s:shard4  x:test_col_shard4_replica2] o.a.s.u.RandomMergePolicy RandomMergePolicy wrapping class org.apache.lucene.index.TieredMergePolicy: [TieredMergePolicy: maxMergeAtOnce=22, maxMergeAtOnceExplicit=24, maxMergedSegmentMB=92.0673828125, floorSegmentMB=1.5703125, forceMergeDeletesPctAllowed=21.888740769713117, segmentsPerTier=12.0, maxCFSSegmentSizeMB=8.796093022207999E12, noCFSRatio=0.3317574062755069
   [junit4]   2> 1252559 INFO  (qtp1615930047-13531) [n:127.0.0.1:50532_solr c:test_col s:shard3  x:test_col_shard3_replica2] o.a.s.u.RandomMergePolicy RandomMergePolicy wrapping class org.apache.lucene.index.TieredMergePolicy: [TieredMergePolicy: maxMergeAtOnce=22, maxMergeAtOnceExplicit=24, maxMergedSegmentMB=92.0673828125, floorSegmentMB=1.5703125, forceMergeDeletesPctAllowed=21.888740769713117, segmentsPerTier=12.0, maxCFSSegmentSizeMB=8.796093022207999E12, noCFSRatio=0.3317574062755069
   [junit4]   2> 1252587 WARN  (qtp105500225-13485) [n:127.0.0.1:36476_solr c:test_col s:shard2  x:test_col_shard2_replica2] o.a.s.c.RequestHandlers INVALID paramSet a in requestHandler {type = requestHandler,name = /dump,class = DumpRequestHandler,attributes = {initParams=a, name=/dump, class=DumpRequestHandler},args = {defaults={a=A,b=B}}}
   [junit4]   2> 1252594 INFO  (qtp1379431034-13508) [n:127.0.0.1:60397_solr c:test_col s:shard1  x:test_col_shard1_replica1] o.a.s.s.IndexSchema [test_col_shard1_replica1] Schema name=minimal-atomic-stress
   [junit4]   2> 1252589 WARN  (qtp230287282-13429) [n:127.0.0.1:36697_solr c:test_col s:shard5  x:test_col_shard5_replica2] o.a.s.c.RequestHandlers INVALID paramSet a in requestHandler {type = requestHandler,name = /dump,class = DumpRequestHandler,attribu

[...truncated too long message...]

sts.file.encoding=US-ASCII
   [junit4] ERROR   0.01s J1 | SegmentsInfoRequestHandlerTest.testSegmentInfosVersion <<<
   [junit4]    > Throwable #1: java.lang.RuntimeException: Exception during query
   [junit4]    > 	at __randomizedtesting.SeedInfo.seed([9AE15D1126E42FB5:623FC8F95E88FEE6]:0)
   [junit4]    > 	at org.apache.solr.SolrTestCaseJ4.assertQ(SolrTestCaseJ4.java:895)
   [junit4]    > 	at org.apache.solr.handler.admin.SegmentsInfoRequestHandlerTest.testSegmentInfosVersion(SegmentsInfoRequestHandlerTest.java:70)
   [junit4]    > 	at java.lang.Thread.run(Thread.java:745)
   [junit4]    > Caused by: java.lang.RuntimeException: REQUEST FAILED: xpath=2=count(//lst[@name='segments']/lst/str[@name='version'][.='6.6.0'])
   [junit4]    > 	xml response was: <?xml version="1.0" encoding="UTF-8"?>
   [junit4]    > <response>
   [junit4]    > <lst name="responseHeader"><int name="status">0</int><int name="QTime">1</int></lst><lst name="segments"><lst name="_0"><str name="name">_0</str><int name="delCount">1</int><long name="sizeInBytes">2048</long><int name="size">4</int><date name="age">2017-04-24T09:01:46.908Z</date><str name="source">flush</str><str name="version">6.6.0</str></lst><lst name="_1"><str name="name">_1</str><int name="delCount">0</int><long name="sizeInBytes">1870</long><int name="size">1</int><date name="age">2017-04-24T09:01:46.912Z</date><str name="source">flush</str><str name="version">6.6.0</str></lst><lst name="_2"><str name="name">_2</str><int name="delCount">0</int><long name="sizeInBytes">1981</long><int name="size">4</int><date name="age">2017-04-24T09:01:46.922Z</date><str name="source">flush</str><str name="version">6.6.0</str></lst><lst name="_3"><str name="name">_3</str><int name="delCount">0</int><long name="sizeInBytes">1870</long><int name="size">1</int><date name="age">2017-04-24T09:01:46.924Z</date><str name="source">flush</str><str name="version">6.6.0</str></lst></lst>
   [junit4]    > </response>
   [junit4]    > 	request was:qt=/admin/segments&wt=xml
   [junit4]    > 	at org.apache.solr.SolrTestCaseJ4.assertQ(SolrTestCaseJ4.java:888)
   [junit4]    > 	... 40 more
   [junit4]   2> 5616074 INFO  (TEST-SegmentsInfoRequestHandlerTest.testSegmentInfos-seed#[9AE15D1126E42FB5]) [    ] o.a.s.SolrTestCaseJ4 ###Starting testSegmentInfos
   [junit4]   2> 5616074 INFO  (TEST-SegmentsInfoRequestHandlerTest.testSegmentInfos-seed#[9AE15D1126E42FB5]) [    ] o.a.s.c.S.Request [collection1]  webapp=null path=null params={qt=/admin/segments&wt=xml} status=0 QTime=0
   [junit4]   2> 5616075 INFO  (TEST-SegmentsInfoRequestHandlerTest.testSegmentInfos-seed#[9AE15D1126E42FB5]) [    ] o.a.s.SolrTestCaseJ4 ###Ending testSegmentInfos
   [junit4]   2> 5616078 INFO  (TEST-SegmentsInfoRequestHandlerTest.testSegmentInfosData-seed#[9AE15D1126E42FB5]) [    ] o.a.s.SolrTestCaseJ4 ###Starting testSegmentInfosData
   [junit4]   2> 5616078 INFO  (TEST-SegmentsInfoRequestHandlerTest.testSegmentInfosData-seed#[9AE15D1126E42FB5]) [    ] o.a.s.c.S.Request [collection1]  webapp=null path=null params={qt=/admin/segments&wt=xml} status=0 QTime=0
   [junit4]   2> 5616079 INFO  (TEST-SegmentsInfoRequestHandlerTest.testSegmentInfosData-seed#[9AE15D1126E42FB5]) [    ] o.a.s.SolrTestCaseJ4 ###Ending testSegmentInfosData
   [junit4]   2> 5616079 INFO  (SUITE-SegmentsInfoRequestHandlerTest-seed#[9AE15D1126E42FB5]-worker) [    ] o.a.s.SolrTestCaseJ4 ###deleteCore
   [junit4]   2> 5616079 INFO  (SUITE-SegmentsInfoRequestHandlerTest-seed#[9AE15D1126E42FB5]-worker) [    ] o.a.s.c.CoreContainer Shutting down CoreContainer instance=653877249
   [junit4]   2> 5616080 INFO  (coreCloseExecutor-9483-thread-1) [    x:collection1] o.a.s.c.SolrCore [collection1]  CLOSING SolrCore org.apache.solr.core.SolrCore@48d8872a
   [junit4]   2> 5616177 INFO  (coreCloseExecutor-9483-thread-1) [    x:collection1] o.a.s.m.SolrMetricManager Closing metric reporters for: solr.core.collection1
   [junit4]   2> 5616182 INFO  (SUITE-SegmentsInfoRequestHandlerTest-seed#[9AE15D1126E42FB5]-worker) [    ] o.a.s.m.SolrMetricManager Closing metric reporters for: solr.node
   [junit4]   2> NOTE: leaving temporary files on disk at: /x1/jenkins/jenkins-slave/workspace/Lucene-Solr-NightlyTests-6.x/checkout/solr/build/solr-core/test/J1/temp/solr.handler.admin.SegmentsInfoRequestHandlerTest_9AE15D1126E42FB5-001
   [junit4]   2> NOTE: test params are: codec=Asserting(Lucene62), sim=RandomSimilarity(queryNorm=true,coord=no): {}, locale=ca, timezone=PRT
   [junit4]   2> NOTE: Linux 3.13.0-85-generic amd64/Oracle Corporation 1.8.0_121 (64-bit)/cpus=4,threads=1,free=225179248,total=524288000
   [junit4]   2> NOTE: All tests run in this JVM: [TestSchemaResource, TestSimpleTrackingShardHandler, TestWordDelimiterFilterFactory, TestFieldTypeCollectionResource, TestDistributedGrouping, HighlighterMaxOffsetTest, TestCoreAdminApis, TestSolrConfigHandlerConcurrent, TestRebalanceLeaders, JsonLoaderTest, MoreLikeThisHandlerTest, TestConfigSetImmutable, TestNRTOpen, TestTestInjection, JvmMetricsTest, TestSearchPerf, TestHdfsCloudBackupRestore, WordBreakSolrSpellCheckerTest, RestartWhileUpdatingTest, TestBulkSchemaConcurrent, TestXmlQParserPlugin, TestMiniSolrCloudCluster, EchoParamsTest, SimpleMLTQParserTest, ShardRoutingTest, TestLMDirichletSimilarityFactory, TestNoOpRegenerator, TestFieldCacheSanityChecker, DistributedQueueTest, BasicFunctionalityTest, BasicAuthIntegrationTest, SolrIndexConfigTest, SortByFunctionTest, BJQParserTest, TestSweetSpotSimilarityFactory, SmileWriterTest, TestDistribDocBasedVersion, SolrCloudExampleTest, ZkStateWriterTest, HdfsTlogReplayBufferedWhileIndexingTest, DocValuesTest, TestStressUserVersions, TestDocTermOrds, QueryResultKeyTest, TestCloudDeleteByQuery, MoveReplicaTest, SampleTest, TestObjectReleaseTracker, DistributedTermsComponentTest, TestUpdate, TestFiltering, TestNumericTerms32, ConvertedLegacyTest, TestRequestStatusCollectionAPI, TestRandomCollapseQParserPlugin, MultiTermTest, ParsingFieldUpdateProcessorsTest, TestLeaderInitiatedRecoveryThread, IndexBasedSpellCheckerTest, ShardRoutingCustomTest, SystemInfoHandlerTest, DateMathParserTest, TestBlobHandler, DirectSolrSpellCheckerTest, DirectoryFactoryTest, RemoteQueryErrorTest, ManagedSchemaRoundRobinCloudTest, DeleteInactiveReplicaTest, BlockJoinFacetSimpleTest, DistributedFacetPivotSmallAdvancedTest, TestCopyFieldCollectionResource, DistributedIntervalFacetingTest, HdfsNNFailoverTest, TestRTGBase, TestOnReconnectListenerSupport, DateRangeFieldTest, IndexSchemaTest, AddBlockUpdateTest, FullHLLTest, TermsComponentTest, RankQueryTest, TestNonDefinedSimilarityFactory, TestCloudSchemaless, TestRecoveryHdfs, LoggingHandlerTest, ConjunctionSolrSpellCheckerTest, ConnectionReuseTest, ForceLeaderTest, SchemaVersionSpecificBehaviorTest, SimplePostToolTest, TestCoreContainer, SuggestComponentTest, ConnectionManagerTest, TestCustomDocTransformer, TestConfigSetsAPIZkFailure, CopyFieldTest, TestFieldCacheVsDocValues, VMParamsZkACLAndCredentialsProvidersTest, TestBlendedInfixSuggestions, DirectSolrConnectionTest, RulesTest, CloneFieldUpdateProcessorFactoryTest, TestGraphTermsQParserPlugin, ChaosMonkeySafeLeaderTest, ShufflingReplicaListTransformerTest, TestScoreJoinQPScore, SharedFSAutoReplicaFailoverUtilsTest, InfoHandlerTest, CachingDirectoryFactoryTest, TestPartialUpdateDeduplication, TestSubQueryTransformerDistrib, TestIntervalFaceting, TestFuzzyAnalyzedSuggestions, CursorMarkTest, FileUtilsTest, UUIDUpdateProcessorFallbackTest, TestHashPartitioner, BasicDistributedZk2Test, CollectionsAPIDistributedZkTest, OpenCloseCoreStressTest, OverseerTest, LeaderElectionIntegrationTest, FullSolrCloudDistribCmdsTest, ClusterStateUpdateTest, TestRandomFaceting, LeaderElectionTest, ZkSolrClientTest, TestRandomDVFaceting, ZkCLITest, AutoCommitTest, TestFaceting, ZkControllerTest, TestJoin, TestStressVersions, SimpleFacetsTest, TestSolr4Spatial, SolrCoreTest, SpellCheckComponentTest, SolrCmdDistributorTest, PeerSyncTest, DirectUpdateHandlerTest, TestBadConfig, HighlighterTest, SoftAutoCommitTest, TestSolrDeletionPolicy1, XsltUpdateRequestHandlerTest, CacheHeaderTest, TestQueryUtils, PrimitiveFieldTypeTest, XmlUpdateRequestHandlerTest, DocumentBuilderTest, TermVectorComponentTest, TestIndexingPerformance, FieldAnalysisRequestHandlerTest, FastVectorHighlighterTest, IndexSchemaRuntimeFieldTest, TestCollationField, JSONWriterTest, QueryParsingTest, CSVRequestHandlerTest, SearchHandlerTest, SOLR749Test, AlternateDirectoryTest, TestSolrIndexConfig, ResponseLogComponentTest, TestMergePolicyConfig, OutputWriterTest, TestLuceneMatchVersion, SpellPossibilityIteratorTest, TestCharFilters, TestIBSimilarityFactory, TestJmxMonitoredMap, TestFastOutputStream, OpenExchangeRatesOrgProviderTest, TestFastLRUCache, ChaosMonkeyNothingIsSafeTest, AssignTest, AsyncCallRequestStatusResponseTest, CdcrReplicationDistributedZkTest, CdcrReplicationHandlerTest, CleanupOldIndexTest, CollectionReloadTest, CollectionsAPISolrJTest, DeleteStatusTest, DistributedVersionInfoTest, LeaderFailureAfterFreshStartTest, OverriddenZkACLAndCredentialsProvidersTest, OverseerModifyCollectionTest, OverseerTaskQueueTest, SaslZkACLProviderTest, SharedFSAutoReplicaFailoverTest, TestRandomRequestDistribution, TestSSLRandomization, TestShortCircuitedRequests, TestSizeLimitedDistributedMap, TestSolrCloudWithKerberosAlt, TestTolerantUpdateProcessorRandomCloud, TriLevelCompositeIdRoutingTest, HdfsChaosMonkeyNothingIsSafeTest, HdfsRecoverLeaseTest, HdfsRestartWhileUpdatingTest, ZkStateReaderTest, RuleEngineTest, CoreSorterTest, TestBackupRepositoryFactory, TestConfigOverlay, TestConfigSetProperties, TestConfigSets, TestCorePropertiesReload, TestDynamicLoading, RequestLoggingTest, TestReplicationHandlerBackup, TestSQLHandlerNonCloud, CoreAdminCreateDiscoverTest, CoreAdminRequestStatusTest, MetricsHandlerTest, SecurityConfHandlerTest, SegmentsInfoRequestHandlerTest]
   [junit4] Completed [577/704 (3!)] on J1 in 0.70s, 3 tests, 1 error <<< FAILURES!

[...truncated 43774 lines...]