You are viewing a plain text version of this content. The canonical link for it is here.
Posted to dev@zookeeper.apache.org by Apache Jenkins Server <je...@builds.apache.org> on 2016/09/11 02:34:51 UTC

ZooKeeper_branch34_jdk7 - Build # 1222 - Failure

See https://builds.apache.org/job/ZooKeeper_branch34_jdk7/1222/

###################################################################################
########################## LAST 60 LINES OF THE CONSOLE ###########################
[...truncated 219615 lines...]
    [junit] 2016-09-11 02:35:01,485 [myid:] - INFO  [main:FinalRequestProcessor@402] - shutdown of request processor complete
    [junit] 2016-09-11 02:35:01,485 [myid:] - INFO  [main:FourLetterWordMain@62] - connecting to 127.0.0.1 11221
    [junit] 2016-09-11 02:35:01,486 [myid:] - INFO  [main:JMXEnv@146] - ensureOnly:[]
    [junit] 2016-09-11 02:35:01,488 [myid:] - INFO  [main:ClientBase@445] - STARTING server
    [junit] 2016-09-11 02:35:01,488 [myid:] - INFO  [main:ClientBase@366] - CREATING server instance 127.0.0.1:11221
    [junit] 2016-09-11 02:35:01,489 [myid:] - INFO  [main:NIOServerCnxnFactory@89] - binding to port 0.0.0.0/0.0.0.0:11221
    [junit] 2016-09-11 02:35:01,489 [myid:] - INFO  [main:ClientBase@341] - STARTING server instance 127.0.0.1:11221
    [junit] 2016-09-11 02:35:01,489 [myid:] - INFO  [main:ZooKeeperServer@173] - Created server with tickTime 3000 minSessionTimeout 6000 maxSessionTimeout 60000 datadir /home/jenkins/jenkins-slave/workspace/ZooKeeper_branch34_jdk7/branch-3.4/build/test/tmp/test3832182907502848533.junit.dir/version-2 snapdir /home/jenkins/jenkins-slave/workspace/ZooKeeper_branch34_jdk7/branch-3.4/build/test/tmp/test3832182907502848533.junit.dir/version-2
    [junit] 2016-09-11 02:35:01,494 [myid:] - ERROR [main:ZooKeeperServer@472] - ZKShutdownHandler is not registered, so ZooKeeper server won't take any action on ERROR or SHUTDOWN server state changes
    [junit] 2016-09-11 02:35:01,494 [myid:] - INFO  [main:FourLetterWordMain@62] - connecting to 127.0.0.1 11221
    [junit] 2016-09-11 02:35:01,495 [myid:] - INFO  [NIOServerCxn.Factory:0.0.0.0/0.0.0.0:11221:NIOServerCnxnFactory@192] - Accepted socket connection from /127.0.0.1:55640
    [junit] 2016-09-11 02:35:01,495 [myid:] - INFO  [NIOServerCxn.Factory:0.0.0.0/0.0.0.0:11221:NIOServerCnxn@827] - Processing stat command from /127.0.0.1:55640
    [junit] 2016-09-11 02:35:01,496 [myid:] - INFO  [Thread-4:NIOServerCnxn$StatCommand@663] - Stat command output
    [junit] 2016-09-11 02:35:01,496 [myid:] - INFO  [Thread-4:NIOServerCnxn@1008] - Closed socket connection for client /127.0.0.1:55640 (no session established for client)
    [junit] 2016-09-11 02:35:01,496 [myid:] - INFO  [main:JMXEnv@229] - ensureParent:[InMemoryDataTree, StandaloneServer_port]
    [junit] 2016-09-11 02:35:01,498 [myid:] - INFO  [main:JMXEnv@246] - expect:InMemoryDataTree
    [junit] 2016-09-11 02:35:01,498 [myid:] - INFO  [main:JMXEnv@250] - found:InMemoryDataTree org.apache.ZooKeeperService:name0=StandaloneServer_port11221,name1=InMemoryDataTree
    [junit] 2016-09-11 02:35:01,499 [myid:] - INFO  [main:JMXEnv@246] - expect:StandaloneServer_port
    [junit] 2016-09-11 02:35:01,499 [myid:] - INFO  [main:JMXEnv@250] - found:StandaloneServer_port org.apache.ZooKeeperService:name0=StandaloneServer_port11221
    [junit] 2016-09-11 02:35:01,499 [myid:] - INFO  [main:JUnit4ZKTestRunner$LoggedInvokeMethod@58] - Memory used 32617
    [junit] 2016-09-11 02:35:01,499 [myid:] - INFO  [main:JUnit4ZKTestRunner$LoggedInvokeMethod@63] - Number of threads 20
    [junit] 2016-09-11 02:35:01,500 [myid:] - INFO  [main:JUnit4ZKTestRunner$LoggedInvokeMethod@78] - FINISHED TEST METHOD testQuota
    [junit] 2016-09-11 02:35:01,500 [myid:] - INFO  [main:ClientBase@522] - tearDown starting
    [junit] 2016-09-11 02:35:01,564 [myid:] - INFO  [main:ZooKeeper@684] - Session: 0x1571719113f0000 closed
    [junit] 2016-09-11 02:35:01,564 [myid:] - INFO  [main:ClientBase@492] - STOPPING server
    [junit] 2016-09-11 02:35:01,565 [myid:] - INFO  [main-EventThread:ClientCnxn$EventThread@519] - EventThread shut down for session: 0x1571719113f0000
    [junit] 2016-09-11 02:35:01,565 [myid:] - INFO  [NIOServerCxn.Factory:0.0.0.0/0.0.0.0:11221:NIOServerCnxnFactory@219] - NIOServerCnxn factory exited run method
    [junit] 2016-09-11 02:35:01,565 [myid:] - INFO  [main:ZooKeeperServer@497] - shutting down
    [junit] 2016-09-11 02:35:01,565 [myid:] - ERROR [main:ZooKeeperServer@472] - ZKShutdownHandler is not registered, so ZooKeeper server won't take any action on ERROR or SHUTDOWN server state changes
    [junit] 2016-09-11 02:35:01,566 [myid:] - INFO  [main:SessionTrackerImpl@225] - Shutting down
    [junit] 2016-09-11 02:35:01,566 [myid:] - INFO  [main:PrepRequestProcessor@765] - Shutting down
    [junit] 2016-09-11 02:35:01,566 [myid:] - INFO  [main:SyncRequestProcessor@208] - Shutting down
    [junit] 2016-09-11 02:35:01,566 [myid:] - INFO  [ProcessThread(sid:0 cport:11221)::PrepRequestProcessor@143] - PrepRequestProcessor exited loop!
    [junit] 2016-09-11 02:35:01,567 [myid:] - INFO  [SyncThread:0:SyncRequestProcessor@186] - SyncRequestProcessor exited!
    [junit] 2016-09-11 02:35:01,567 [myid:] - INFO  [main:FinalRequestProcessor@402] - shutdown of request processor complete
    [junit] 2016-09-11 02:35:01,568 [myid:] - INFO  [main:FourLetterWordMain@62] - connecting to 127.0.0.1 11221
    [junit] 2016-09-11 02:35:01,568 [myid:] - INFO  [main:JMXEnv@146] - ensureOnly:[]
    [junit] 2016-09-11 02:35:01,572 [myid:] - INFO  [main:ClientBase@547] - fdcount after test is: 37 at start it was 25
    [junit] 2016-09-11 02:35:01,572 [myid:] - INFO  [main:ClientBase@549] - sleeping for 20 secs
    [junit] 2016-09-11 02:35:01,573 [myid:] - INFO  [main:ZKTestCase$1@65] - SUCCEEDED testQuota
    [junit] 2016-09-11 02:35:01,573 [myid:] - INFO  [main:ZKTestCase$1@60] - FINISHED testQuota
    [junit] Tests run: 1, Failures: 0, Errors: 0, Skipped: 0, Time elapsed: 0.649 sec

BUILD FAILED
/home/jenkins/jenkins-slave/workspace/ZooKeeper_branch34_jdk7/branch-3.4/build.xml:1320: Tests failed!

Total time: 22 minutes 18 seconds
Build step 'Execute shell' marked build as failure
Recording test results
Setting ANT_LATEST__HOME=/home/jenkins/tools/ant/latest
Setting JDK_1_7_LATEST__HOME=/home/jenkins/tools/java/latest1.7
Setting ANT_LATEST__HOME=/home/jenkins/tools/ant/latest
Setting JDK_1_7_LATEST__HOME=/home/jenkins/tools/java/latest1.7
Email was triggered for: Failure - Any
Sending email for trigger: Failure - Any
Setting ANT_LATEST__HOME=/home/jenkins/tools/ant/latest
Setting JDK_1_7_LATEST__HOME=/home/jenkins/tools/java/latest1.7
Setting ANT_LATEST__HOME=/home/jenkins/tools/ant/latest
Setting JDK_1_7_LATEST__HOME=/home/jenkins/tools/java/latest1.7



###################################################################################
############################## FAILED TESTS (if any) ##############################
1 tests failed.
FAILED:  org.apache.zookeeper.server.ZxidRolloverTest.testRolloverThenFollowerRestart

Error Message:
waiting for server up

Stack Trace:
java.lang.AssertionError: waiting for server up
	at org.apache.zookeeper.test.QuorumUtil.startAll(QuorumUtil.java:137)
	at org.apache.zookeeper.server.ZxidRolloverTest.startAll(ZxidRolloverTest.java:149)
	at org.apache.zookeeper.server.ZxidRolloverTest.setUp(ZxidRolloverTest.java:64)