You are viewing a plain text version of this content. The canonical link for it is here.
Posted to notifications@directory.apache.org by Apache Jenkins Server <je...@builds.apache.org> on 2011/07/25 05:05:12 UTC
Build failed in Jenkins: dir-studio-maven-plugin-jdk15-deploy-site
#337
See <https://builds.apache.org/job/dir-studio-maven-plugin-jdk15-deploy-site/337/>
------------------------------------------
Started by timer
Building remotely on ubuntu1
Updating http://svn.apache.org/repos/asf/directory/buildtools/studio-plugin/trunk
At revision 1150528
no change for http://svn.apache.org/repos/asf/directory/buildtools/studio-plugin/trunk since the previous build
Found mavenVersion 3.0.3 from file jar:file:/home/hudson/tools/maven/latest3/lib/maven-core-3.0.3.jar!/META-INF/maven/org.apache.maven/maven-core/pom.properties
Parsing POMs
[trunk] $ /home/hudson/tools/java/latest1.5/bin/java -cp /home/jenkins/jenkins-slave/maven3-agent.jar:/home/hudson/tools/maven/latest3/boot/plexus-classworlds-2.4.jar org.jvnet.hudson.maven3.agent.Maven3Main /home/hudson/tools/maven/latest3 /home/jenkins/jenkins-slave/slave.jar /home/jenkins/jenkins-slave/maven3-interceptor.jar 56016
ERROR: Failed to parse POMs
java.io.IOException: Cannot run program "/home/hudson/tools/java/latest1.5/bin/java" (in directory "<https://builds.apache.org/job/dir-studio-maven-plugin-jdk15-deploy-site/ws/trunk")>: java.io.IOException: error=2, No such file or directory
at java.lang.ProcessBuilder.start(ProcessBuilder.java:459)
at hudson.Proc$LocalProc.<init>(Proc.java:244)
at hudson.Proc$LocalProc.<init>(Proc.java:216)
at hudson.Launcher$LocalLauncher.launch(Launcher.java:698)
at hudson.Launcher$ProcStarter.start(Launcher.java:329)
at hudson.Launcher$RemoteLaunchCallable.call(Launcher.java:923)
at hudson.Launcher$RemoteLaunchCallable.call(Launcher.java:890)
at hudson.remoting.UserRequest.perform(UserRequest.java:118)
at hudson.remoting.UserRequest.perform(UserRequest.java:48)
at hudson.remoting.Request$2.run(Request.java:270)
at java.util.concurrent.Executors$RunnableAdapter.call(Executors.java:441)
at java.util.concurrent.FutureTask$Sync.innerRun(FutureTask.java:303)
at java.util.concurrent.FutureTask.run(FutureTask.java:138)
at java.util.concurrent.ThreadPoolExecutor$Worker.runTask(ThreadPoolExecutor.java:886)
at java.util.concurrent.ThreadPoolExecutor$Worker.run(ThreadPoolExecutor.java:908)
at java.lang.Thread.run(Thread.java:619)
Caused by: java.io.IOException: java.io.IOException: error=2, No such file or directory
at java.lang.UNIXProcess.<init>(UNIXProcess.java:148)
at java.lang.ProcessImpl.start(ProcessImpl.java:65)
at java.lang.ProcessBuilder.start(ProcessBuilder.java:452)
... 15 more
Jenkins build is back to normal :
dir-studio-maven-plugin-jdk15-deploy-site #338
Posted by Apache Jenkins Server <je...@builds.apache.org>.
See <https://builds.apache.org/job/dir-studio-maven-plugin-jdk15-deploy-site/338/>