You are viewing a plain text version of this content. The canonical link for it is here.
Posted to builds@solr.apache.org by Apache Jenkins Server <je...@builds.apache.org> on 2025/12/11 18:48:19 UTC
[JENKINS] Solr » Solr-Test-10.x - Build # 545 - Failure!
Build: https://ci-builds.apache.org/job/Solr/job/Solr-Test-10.x/545/
No tests ran.
Build Log:
[...truncated 164 lines...]
BUILD FAILED in 1m 24s
54 actionable tasks: 54 executed
Publishing build scan...
https://develocity.apache.org/s/fj7ft474w2ygw
Build step 'Invoke Gradle script' changed build result to FAILURE
Build step 'Invoke Gradle script' marked build as failure
Archiving artifacts
Recording test results
ERROR: Step ‘Publish JUnit test result report’ failed: No test report files were found. Configuration error?
Email was triggered for: Failure - Any
Sending email for trigger: Failure - Any
[JENKINS] Solr » Solr-Test-10.x - Build # 547 - Still Failing!
Posted by Apache Jenkins Server <je...@builds.apache.org>.
Build: https://ci-builds.apache.org/job/Solr/job/Solr-Test-10.x/547/
No tests ran.
Build Log:
[...truncated 163 lines...]
BUILD FAILED in 1m 22s
54 actionable tasks: 54 executed
Publishing build scan...
https://develocity.apache.org/s/6hi4icyhd5mo6
Build step 'Invoke Gradle script' changed build result to FAILURE
Build step 'Invoke Gradle script' marked build as failure
Archiving artifacts
Recording test results
ERROR: Step ‘Publish JUnit test result report’ failed: No test report files were found. Configuration error?
Email was triggered for: Failure - Any
Sending email for trigger: Failure - Any
[JENKINS] Solr » Solr-Test-10.x - Build # 546 - Still Failing!
Posted by Apache Jenkins Server <je...@builds.apache.org>.
Build: https://ci-builds.apache.org/job/Solr/job/Solr-Test-10.x/546/
No tests ran.
Build Log:
[...truncated 163 lines...]
BUILD FAILED in 1m 36s
54 actionable tasks: 54 executed
Publishing build scan...
https://develocity.apache.org/s/h334rsq3zuadq
Build step 'Invoke Gradle script' changed build result to FAILURE
Build step 'Invoke Gradle script' marked build as failure
Archiving artifacts
Recording test results
ERROR: Step ‘Publish JUnit test result report’ failed: No test report files were found. Configuration error?
Email was triggered for: Failure - Any
Sending email for trigger: Failure - Any