You are viewing a plain text version of this content. The canonical link for it is here.
Posted to yarn-dev@hadoop.apache.org by Apache Jenkins Server <je...@builds.apache.org> on 2015/05/21 23:51:09 UTC
Failed: YARN-1012 PreCommit Build #8048
Jira: https://issues.apache.org/jira/browse/YARN-1012
Build: https://builds.apache.org/job/PreCommit-YARN-Build/8048/
###################################################################################
########################## LAST 60 LINES OF THE CONSOLE ###########################
[...truncated 326 lines...]
| | | | eclipse:eclipse.
| +1 | findbugs | 3m 56s | The patch does not introduce any
| | | | new Findbugs (version 3.0.0)
| | | | warnings.
| +1 | yarn tests | 0m 23s | Tests passed in hadoop-yarn-api.
| -1 | yarn tests | 1m 55s | Tests failed in hadoop-yarn-common.
| +1 | yarn tests | 6m 17s | Tests passed in
| | | | hadoop-yarn-server-nodemanager.
| | | 50m 4s |
Reason | Tests
Failed unit tests | hadoop.yarn.api.TestPBImplRecords
|| Subsystem || Report/Notes ||
============================================================================
| Patch URL | http://issues.apache.org/jira/secure/attachment/12734640/YARN-1012-5.patch |
| Optional Tests | javadoc javac unit findbugs checkstyle |
| git revision | trunk / 05e04f3 |
| hadoop-yarn-api test log | /home/jenkins/jenkins-slave/workspace/PreCommit-YARN-Build/patchprocess/testrun_hadoop-yarn-api.txt |
| hadoop-yarn-common test log | /home/jenkins/jenkins-slave/workspace/PreCommit-YARN-Build/patchprocess/testrun_hadoop-yarn-common.txt |
| hadoop-yarn-server-nodemanager test log | /home/jenkins/jenkins-slave/workspace/PreCommit-YARN-Build/patchprocess/testrun_hadoop-yarn-server-nodemanager.txt |
| Test Results | https://builds.apache.org/job/PreCommit-YARN-Build/8048/testReport/ |
| Java | 1.7.0_55 |
| uname | Linux asf904.gq1.ygridcore.net 3.13.0-36-lowlatency #63-Ubuntu SMP PREEMPT Wed Sep 3 21:56:12 UTC 2014 x86_64 x86_64 x86_64 GNU/Linux |
============================================================================
============================================================================
Adding comment to JIRA
============================================================================
============================================================================
Comment added.
3c38cb8483881f50cfbeb48610558468860ea50c logged out
============================================================================
============================================================================
Finished build.
============================================================================
============================================================================
Build step 'Execute shell' marked build as failure
Archiving artifacts
Sending artifact delta relative to PreCommit-YARN-Build #8042
Archived 42 artifacts
Archive block size is 32768
Received 223 blocks and 22566309 bytes
Compression is 24.5%
Took 9 sec
[description-setter] Could not determine description.
Recording test results
Publish JUnit test result report is waiting for a checkpoint on PreCommit-YARN-Build #8047
Email was triggered for: Failure
Sending email for trigger: Failure
###################################################################################
############################## FAILED TESTS (if any) ##############################
1 tests failed.
FAILED: org.apache.hadoop.yarn.api.TestPBImplRecords.testContainerStatusPBImpl
Error Message:
type class org.apache.hadoop.yarn.api.records.ResourceUtilization is not supported
Stack Trace:
java.lang.IllegalArgumentException: type class org.apache.hadoop.yarn.api.records.ResourceUtilization is not supported
at org.apache.hadoop.yarn.api.TestPBImplRecords.genTypeValue(TestPBImplRecords.java:396)
at org.apache.hadoop.yarn.api.TestPBImplRecords.getGetSetPairs(TestPBImplRecords.java:573)
at org.apache.hadoop.yarn.api.TestPBImplRecords.validatePBImplRecord(TestPBImplRecords.java:588)
at org.apache.hadoop.yarn.api.TestPBImplRecords.testContainerStatusPBImpl(TestPBImplRecords.java:977)
Success: YARN-3701 PreCommit Build #8051
Posted by Apache Jenkins Server <je...@builds.apache.org>.
Jira: https://issues.apache.org/jira/browse/YARN-3701
Build: https://builds.apache.org/job/PreCommit-YARN-Build/8051/
###################################################################################
########################## LAST 60 LINES OF THE CONSOLE ###########################
[...truncated 262 lines...]
| +1 | release audit | 0m 23s | The applied patch does not increase
| | | | the total number of release audit
| | | | warnings.
| +1 | checkstyle | 0m 31s | There were no new checkstyle
| | | | issues.
| +1 | whitespace | 0m 0s | The patch has no lines that end in
| | | | whitespace.
| +1 | install | 1m 36s | mvn install still works.
| +1 | eclipse:eclipse | 0m 34s | The patch built with
| | | | eclipse:eclipse.
| +1 | findbugs | 0m 51s | The patch does not introduce any
| | | | new Findbugs (version 3.0.0)
| | | | warnings.
| +1 | yarn tests | 3m 6s | Tests passed in
| | | | hadoop-yarn-server-applicationhistory
| | | | service.
| | | 39m 53s |
|| Subsystem || Report/Notes ||
============================================================================
| Patch URL | http://issues.apache.org/jira/secure/attachment/12734673/YARN-3701.1.patch |
| Optional Tests | javadoc javac unit findbugs checkstyle |
| git revision | trunk / 53fafcf |
| hadoop-yarn-server-applicationhistoryservice test log | /home/jenkins/jenkins-slave/workspace/PreCommit-YARN-Build/patchprocess/testrun_hadoop-yarn-server-applicationhistoryservice.txt |
| Test Results | https://builds.apache.org/job/PreCommit-YARN-Build/8051/testReport/ |
| Java | 1.7.0_55 |
| uname | Linux asf903.gq1.ygridcore.net 3.13.0-36-lowlatency #63-Ubuntu SMP PREEMPT Wed Sep 3 21:56:12 UTC 2014 x86_64 x86_64 x86_64 GNU/Linux |
============================================================================
============================================================================
Adding comment to JIRA
============================================================================
============================================================================
Comment added.
eb235d153825e6e560a0dfbe5a74bced3197d7a7 logged out
============================================================================
============================================================================
Finished build.
============================================================================
============================================================================
Archiving artifacts
Sending artifact delta relative to PreCommit-YARN-Build #8042
Archived 24 artifacts
Archive block size is 32768
Received 55 blocks and 7963892 bytes
Compression is 18.5%
Took 4.1 sec
Description set: YARN-3701
Recording test results
Email was triggered for: Success
Sending email for trigger: Success
###################################################################################
############################## FAILED TESTS (if any) ##############################
All tests passed
Failed: YARN-3700 PreCommit Build #8050
Posted by Apache Jenkins Server <je...@builds.apache.org>.
Jira: https://issues.apache.org/jira/browse/YARN-3700
Build: https://builds.apache.org/job/PreCommit-YARN-Build/8050/
###################################################################################
########################## LAST 60 LINES OF THE CONSOLE ###########################
[...truncated 291 lines...]
| | | | whitespace.
| +1 | install | 1m 35s | mvn install still works.
| +1 | eclipse:eclipse | 0m 33s | The patch built with
| | | | eclipse:eclipse.
| +1 | findbugs | 3m 38s | The patch does not introduce any
| | | | new Findbugs (version 3.0.0)
| | | | warnings.
| +1 | yarn tests | 0m 25s | Tests passed in hadoop-yarn-api.
| +1 | yarn tests | 1m 58s | Tests passed in hadoop-yarn-common.
| +1 | yarn tests | 3m 11s | Tests passed in
| | | | hadoop-yarn-server-applicationhistory
| | | | service.
| | | 46m 58s |
|| Subsystem || Report/Notes ||
============================================================================
| Patch URL | http://issues.apache.org/jira/secure/attachment/12734660/YARN-3700.1.patch |
| Optional Tests | javadoc javac unit findbugs checkstyle |
| git revision | trunk / 4fc942a |
| checkstyle | /home/jenkins/jenkins-slave/workspace/PreCommit-YARN-Build/patchprocess/diffcheckstylehadoop-yarn-api.txt |
| hadoop-yarn-api test log | /home/jenkins/jenkins-slave/workspace/PreCommit-YARN-Build/patchprocess/testrun_hadoop-yarn-api.txt |
| hadoop-yarn-common test log | /home/jenkins/jenkins-slave/workspace/PreCommit-YARN-Build/patchprocess/testrun_hadoop-yarn-common.txt |
| hadoop-yarn-server-applicationhistoryservice test log | /home/jenkins/jenkins-slave/workspace/PreCommit-YARN-Build/patchprocess/testrun_hadoop-yarn-server-applicationhistoryservice.txt |
| Test Results | https://builds.apache.org/job/PreCommit-YARN-Build/8050/testReport/ |
| Java | 1.7.0_55 |
| uname | Linux asf904.gq1.ygridcore.net 3.13.0-36-lowlatency #63-Ubuntu SMP PREEMPT Wed Sep 3 21:56:12 UTC 2014 x86_64 x86_64 x86_64 GNU/Linux |
============================================================================
============================================================================
Adding comment to JIRA
============================================================================
============================================================================
Comment added.
4f401bce220c48e55eac18c3be1e3cd37141db9c logged out
============================================================================
============================================================================
Finished build.
============================================================================
============================================================================
Build step 'Execute shell' marked build as failure
Archiving artifacts
Sending artifact delta relative to PreCommit-YARN-Build #8042
Archived 43 artifacts
Archive block size is 32768
Received 228 blocks and 22277312 bytes
Compression is 25.1%
Took 7.5 sec
[description-setter] Could not determine description.
Recording test results
Email was triggered for: Failure
Sending email for trigger: Failure
###################################################################################
############################## FAILED TESTS (if any) ##############################
All tests passed
Failed: YARN-3244 PreCommit Build #8049
Posted by Apache Jenkins Server <je...@builds.apache.org>.
Jira: https://issues.apache.org/jira/browse/YARN-3244
Build: https://builds.apache.org/job/PreCommit-YARN-Build/8049/
###################################################################################
########################## LAST 60 LINES OF THE CONSOLE ###########################
[...truncated 280 lines...]
| -1 | checkstyle | 1m 12s | The applied patch generated 8 new
| | | | checkstyle issues (total was 241,
| | | | now 249).
| +1 | whitespace | 0m 0s | The patch has no lines that end in
| | | | whitespace.
| +1 | install | 1m 35s | mvn install still works.
| +1 | eclipse:eclipse | 0m 34s | The patch built with
| | | | eclipse:eclipse.
| +1 | findbugs | 2m 46s | The patch does not introduce any
| | | | new Findbugs (version 3.0.0)
| | | | warnings.
| +1 | yarn tests | 0m 30s | Tests passed in hadoop-yarn-api.
| +1 | yarn tests | 1m 58s | Tests passed in hadoop-yarn-common.
| | | 41m 22s |
|| Subsystem || Report/Notes ||
============================================================================
| Patch URL | http://issues.apache.org/jira/secure/attachment/12734647/YARN-3244.4.patch |
| Optional Tests | javadoc javac unit findbugs checkstyle |
| git revision | trunk / 4513761 |
| checkstyle | /home/jenkins/jenkins-slave/workspace/PreCommit-YARN-Build/patchprocess/diffcheckstylehadoop-yarn-api.txt |
| hadoop-yarn-api test log | /home/jenkins/jenkins-slave/workspace/PreCommit-YARN-Build/patchprocess/testrun_hadoop-yarn-api.txt |
| hadoop-yarn-common test log | /home/jenkins/jenkins-slave/workspace/PreCommit-YARN-Build/patchprocess/testrun_hadoop-yarn-common.txt |
| Test Results | https://builds.apache.org/job/PreCommit-YARN-Build/8049/testReport/ |
| Java | 1.7.0_55 |
| uname | Linux asf902.gq1.ygridcore.net 3.13.0-36-lowlatency #63-Ubuntu SMP PREEMPT Wed Sep 3 21:56:12 UTC 2014 x86_64 x86_64 x86_64 GNU/Linux |
============================================================================
============================================================================
Adding comment to JIRA
============================================================================
============================================================================
Comment added.
b8fc18abe483b7152dbef4c9ac1371728a17670f logged out
============================================================================
============================================================================
Finished build.
============================================================================
============================================================================
Build step 'Execute shell' marked build as failure
Archiving artifacts
Sending artifact delta relative to PreCommit-YARN-Build #8042
Archived 34 artifacts
Archive block size is 32768
Received 54 blocks and 25769395 bytes
Compression is 6.4%
Took 6.6 sec
[description-setter] Could not determine description.
Recording test results
Email was triggered for: Failure
Sending email for trigger: Failure
###################################################################################
############################## FAILED TESTS (if any) ##############################
All tests passed