You are viewing a plain text version of this content. The canonical link for it is here.
Posted to builds@solr.apache.org by Policeman Jenkins Server via builds <bu...@solr.apache.org> on 2026/03/30 23:30:44 UTC

[JENKINS] Solr-main-Linux (64bit/hotspot/jdk-23.0.2) - Build # 32569 - Failure!

Build: https://jenkins.thetaphi.de/job/Solr-main-Linux/32569/
Java: 64bit/hotspot/jdk-23.0.2 -XX:-UseCompressedOops -XX:+UseZGC

All tests passed

[JENKINS] Solr-main-Linux (64bit/hotspot/jdk-26) - Build # 32571 - Failure!

Posted by Policeman Jenkins Server via builds <bu...@solr.apache.org>.
Build: https://jenkins.thetaphi.de/job/Solr-main-Linux/32571/
Java: 64bit/hotspot/jdk-26 -XX:+UseCompressedOops -XX:+UseZGC

5 tests failed.
FAILED:  org.apache.solr.handler.admin.HealthCheckHandlerTest.testV1FailureResponseIncludesStatusField

Error Message:
javax.net.ssl.SSLHandshakeException: (certificate_unknown) PKIX path building failed: sun.security.provider.certpath.SunCertPathBuilderException: unable to find valid certification path to requested target

Stack Trace:
javax.net.ssl.SSLHandshakeException: (certificate_unknown) PKIX path building failed: sun.security.provider.certpath.SunCertPathBuilderException: unable to find valid certification path to requested target
	at __randomizedtesting.SeedInfo.seed([77A5BB09E123C26E:ED9D3D29F2240E74]:0)
	at java.net.http/jdk.internal.net.http.HttpClientImpl.send(HttpClientImpl.java:1049)
	at java.net.http/jdk.internal.net.http.HttpClientFacade.send(HttpClientFacade.java:133)
	at org.apache.solr.handler.admin.HealthCheckHandlerTest.testV1FailureResponseIncludesStatusField(HealthCheckHandlerTest.java:177)
	at java.base/jdk.internal.reflect.DirectMethodHandleAccessor.invoke(DirectMethodHandleAccessor.java:104)
	at java.base/java.lang.reflect.Method.invoke(Method.java:565)
	at com.carrotsearch.randomizedtesting.RandomizedRunner.invoke(RandomizedRunner.java:1763)
	at com.carrotsearch.randomizedtesting.RandomizedRunner$8.evaluate(RandomizedRunner.java:946)
	at com.carrotsearch.randomizedtesting.RandomizedRunner$9.evaluate(RandomizedRunner.java:982)
	at com.carrotsearch.randomizedtesting.RandomizedRunner$10.evaluate(RandomizedRunner.java:996)
	at com.carrotsearch.randomizedtesting.rules.SystemPropertiesRestoreRule$1.evaluate(SystemPropertiesRestoreRule.java:80)
	at org.junit.rules.RunRules.evaluate(RunRules.java:20)
	at org.apache.lucene.tests.util.TestRuleSetupTeardownChained$1.evaluate(TestRuleSetupTeardownChained.java:48)
	at org.apache.lucene.tests.util.AbstractBeforeAfterRule$1.evaluate(AbstractBeforeAfterRule.java:43)
	at org.apache.lucene.tests.util.TestRuleThreadAndTestName$1.evaluate(TestRuleThreadAndTestName.java:45)
	at org.apache.lucene.tests.util.TestRuleIgnoreAfterMaxFailures$1.evaluate(TestRuleIgnoreAfterMaxFailures.java:60)
	at org.apache.lucene.tests.util.TestRuleMarkFailure$1.evaluate(TestRuleMarkFailure.java:44)
	at org.junit.rules.RunRules.evaluate(RunRules.java:20)
	at com.carrotsearch.randomizedtesting.rules.StatementAdapter.evaluate(StatementAdapter.java:36)
	at com.carrotsearch.randomizedtesting.ThreadLeakControl$StatementRunner.run(ThreadLeakControl.java:390)
	at com.carrotsearch.randomizedtesting.ThreadLeakControl.forkTimeoutingTask(ThreadLeakControl.java:843)
	at com.carrotsearch.randomizedtesting.ThreadLeakControl$3.evaluate(ThreadLeakControl.java:490)
	at com.carrotsearch.randomizedtesting.RandomizedRunner.runSingleTest(RandomizedRunner.java:955)
	at com.carrotsearch.randomizedtesting.RandomizedRunner$5.evaluate(RandomizedRunner.java:840)
	at com.carrotsearch.randomizedtesting.RandomizedRunner$6.evaluate(RandomizedRunner.java:891)
	at com.carrotsearch.randomizedtesting.RandomizedRunner$7.evaluate(RandomizedRunner.java:902)
	at com.carrotsearch.randomizedtesting.rules.StatementAdapter.evaluate(StatementAdapter.java:36)
	at com.carrotsearch.randomizedtesting.rules.StatementAdapter.evaluate(StatementAdapter.java:36)
	at org.apache.lucene.tests.util.AbstractBeforeAfterRule$1.evaluate(AbstractBeforeAfterRule.java:43)
	at com.carrotsearch.randomizedtesting.rules.SystemPropertiesRestoreRule$1.evaluate(SystemPropertiesRestoreRule.java:80)
	at org.junit.rules.RunRules.evaluate(RunRules.java:20)
	at org.apache.lucene.tests.util.AbstractBeforeAfterRule$1.evaluate(AbstractBeforeAfterRule.java:43)
	at com.carrotsearch.randomizedtesting.rules.StatementAdapter.evaluate(StatementAdapter.java:36)
	at org.apache.lucene.tests.util.TestRuleStoreClassName$1.evaluate(TestRuleStoreClassName.java:38)
	at com.carrotsearch.randomizedtesting.rules.NoShadowingOrOverridesOnMethodsRule$1.evaluate(NoShadowingOrOverridesOnMethodsRule.java:40)
	at com.carrotsearch.randomizedtesting.rules.NoShadowingOrOverridesOnMethodsRule$1.evaluate(NoShadowingOrOverridesOnMethodsRule.java:40)
	at com.carrotsearch.randomizedtesting.rules.StatementAdapter.evaluate(StatementAdapter.java:36)
	at com.carrotsearch.randomizedtesting.rules.StatementAdapter.evaluate(StatementAdapter.java:36)
	at org.apache.lucene.tests.util.TestRuleAssertionsRequired$1.evaluate(TestRuleAssertionsRequired.java:53)
	at org.apache.lucene.tests.util.AbstractBeforeAfterRule$1.evaluate(AbstractBeforeAfterRule.java:43)
	at org.apache.lucene.tests.util.TestRuleMarkFailure$1.evaluate(TestRuleMarkFailure.java:44)
	at org.apache.lucene.tests.util.TestRuleIgnoreAfterMaxFailures$1.evaluate(TestRuleIgnoreAfterMaxFailures.java:60)
	at org.apache.lucene.tests.util.TestRuleIgnoreTestSuites$1.evaluate(TestRuleIgnoreTestSuites.java:47)
	at org.junit.rules.RunRules.evaluate(RunRules.java:20)
	at com.carrotsearch.randomizedtesting.rules.StatementAdapter.evaluate(StatementAdapter.java:36)
	at com.carrotsearch.randomizedtesting.ThreadLeakControl$StatementRunner.run(ThreadLeakControl.java:390)
	at com.carrotsearch.randomizedtesting.ThreadLeakControl.lambda$forkTimeoutingTask$0(ThreadLeakControl.java:850)
	at java.base/java.lang.Thread.run(Thread.java:1516)
Caused by: javax.net.ssl.SSLHandshakeException: (certificate_unknown) PKIX path building failed: sun.security.provider.certpath.SunCertPathBuilderException: unable to find valid certification path to requested target
	at java.base/sun.security.ssl.Alert.createSSLException(Alert.java:130)
	at java.base/sun.security.ssl.TransportContext.fatal(TransportContext.java:376)
	at java.base/sun.security.ssl.TransportContext.fatal(TransportContext.java:319)
	at java.base/sun.security.ssl.TransportContext.fatal(TransportContext.java:314)
	at java.base/sun.security.ssl.CertificateMessage$T13CertificateConsumer.checkServerCerts(CertificateMessage.java:1310)
	at java.base/sun.security.ssl.CertificateMessage$T13CertificateConsumer.onConsumeCertificate(CertificateMessage.java:1172)
	at java.base/sun.security.ssl.CertificateMessage$T13CertificateConsumer.consume(CertificateMessage.java:1115)
	at java.base/sun.security.ssl.SSLHandshake.consume(SSLHandshake.java:421)
	at java.base/sun.security.ssl.HandshakeContext.dispatch(HandshakeContext.java:477)
	at java.base/sun.security.ssl.SSLEngineImpl$DelegatedTask.run(SSLEngineImpl.java:1207)
	at java.base/java.util.ArrayList.forEach(ArrayList.java:1612)
	at java.net.http/jdk.internal.net.http.common.SSLFlowDelegate.lambda$executeTasks$0(SSLFlowDelegate.java:1148)
	at java.net.http/jdk.internal.net.http.HttpClientImpl$DelegatingExecutor.execute(HttpClientImpl.java:202)
	at java.net.http/jdk.internal.net.http.common.SSLFlowDelegate.executeTasks(SSLFlowDelegate.java:1143)
	at java.net.http/jdk.internal.net.http.common.SSLFlowDelegate.doHandshake(SSLFlowDelegate.java:1109)
	at java.net.http/jdk.internal.net.http.common.SSLFlowDelegate$Reader.processData(SSLFlowDelegate.java:508)
	at java.net.http/jdk.internal.net.http.common.SSLFlowDelegate$Reader$ReaderDownstreamPusher.run(SSLFlowDelegate.java:283)
	at java.net.http/jdk.internal.net.http.common.SequentialScheduler$LockingRestartableTask.run(SequentialScheduler.java:182)
	at java.net.http/jdk.internal.net.http.common.SequentialScheduler$CompleteRestartableTask.run(SequentialScheduler.java:149)
	at java.net.http/jdk.internal.net.http.common.SequentialScheduler$SchedulableTask.run(SequentialScheduler.java:207)
	at java.base/java.util.concurrent.ThreadPoolExecutor.runWorker(ThreadPoolExecutor.java:1090)
	at java.base/java.util.concurrent.ThreadPoolExecutor$Worker.run(ThreadPoolExecutor.java:614)
	... 1 more
Caused by: sun.security.validator.ValidatorException: PKIX path building failed: sun.security.provider.certpath.SunCertPathBuilderException: unable to find valid certification path to requested target
	at java.base/sun.security.validator.PKIXValidator.doBuild(PKIXValidator.java:386)
	at java.base/sun.security.validator.PKIXValidator.engineValidate(PKIXValidator.java:269)
	at java.base/sun.security.validator.Validator.validate(Validator.java:256)
	at java.base/sun.security.ssl.X509TrustManagerImpl.checkTrusted(X509TrustManagerImpl.java:319)
	at java.base/sun.security.ssl.X509TrustManagerImpl.checkServerTrusted(X509TrustManagerImpl.java:147)
	at java.base/sun.security.ssl.CertificateMessage$T13CertificateConsumer.checkServerCerts(CertificateMessage.java:1280)
	... 18 more
Caused by: sun.security.provider.certpath.SunCertPathBuilderException: unable to find valid certification path to requested target
	at java.base/sun.security.provider.certpath.SunCertPathBuilder.build(SunCertPathBuilder.java:148)
	at java.base/sun.security.provider.certpath.SunCertPathBuilder.engineBuild(SunCertPathBuilder.java:129)
	at java.base/java.security.cert.CertPathBuilder.build(CertPathBuilder.java:299)
	at java.base/sun.security.validator.PKIXValidator.doBuild(PKIXValidator.java:381)
	... 23 more


FAILED:  org.apache.solr.handler.admin.HealthCheckHandlerTest.testV1FailureResponseIncludesStatusField

Error Message:
javax.net.ssl.SSLHandshakeException: (certificate_unknown) PKIX path building failed: sun.security.provider.certpath.SunCertPathBuilderException: unable to find valid certification path to requested target

Stack Trace:
javax.net.ssl.SSLHandshakeException: (certificate_unknown) PKIX path building failed: sun.security.provider.certpath.SunCertPathBuilderException: unable to find valid certification path to requested target
	at __randomizedtesting.SeedInfo.seed([77A5BB09E123C26E:ED9D3D29F2240E74]:0)
	at java.net.http/jdk.internal.net.http.HttpClientImpl.send(HttpClientImpl.java:1049)
	at java.net.http/jdk.internal.net.http.HttpClientFacade.send(HttpClientFacade.java:133)
	at org.apache.solr.handler.admin.HealthCheckHandlerTest.testV1FailureResponseIncludesStatusField(HealthCheckHandlerTest.java:177)
	at java.base/jdk.internal.reflect.DirectMethodHandleAccessor.invoke(DirectMethodHandleAccessor.java:104)
	at java.base/java.lang.reflect.Method.invoke(Method.java:565)
	at com.carrotsearch.randomizedtesting.RandomizedRunner.invoke(RandomizedRunner.java:1763)
	at com.carrotsearch.randomizedtesting.RandomizedRunner$8.evaluate(RandomizedRunner.java:946)
	at com.carrotsearch.randomizedtesting.RandomizedRunner$9.evaluate(RandomizedRunner.java:982)
	at com.carrotsearch.randomizedtesting.RandomizedRunner$10.evaluate(RandomizedRunner.java:996)
	at com.carrotsearch.randomizedtesting.rules.SystemPropertiesRestoreRule$1.evaluate(SystemPropertiesRestoreRule.java:80)
	at org.junit.rules.RunRules.evaluate(RunRules.java:20)
	at org.apache.lucene.tests.util.TestRuleSetupTeardownChained$1.evaluate(TestRuleSetupTeardownChained.java:48)
	at org.apache.lucene.tests.util.AbstractBeforeAfterRule$1.evaluate(AbstractBeforeAfterRule.java:43)
	at org.apache.lucene.tests.util.TestRuleThreadAndTestName$1.evaluate(TestRuleThreadAndTestName.java:45)
	at org.apache.lucene.tests.util.TestRuleIgnoreAfterMaxFailures$1.evaluate(TestRuleIgnoreAfterMaxFailures.java:60)
	at org.apache.lucene.tests.util.TestRuleMarkFailure$1.evaluate(TestRuleMarkFailure.java:44)
	at org.junit.rules.RunRules.evaluate(RunRules.java:20)
	at com.carrotsearch.randomizedtesting.rules.StatementAdapter.evaluate(StatementAdapter.java:36)
	at com.carrotsearch.randomizedtesting.ThreadLeakControl$StatementRunner.run(ThreadLeakControl.java:390)
	at com.carrotsearch.randomizedtesting.ThreadLeakControl.forkTimeoutingTask(ThreadLeakControl.java:843)
	at com.carrotsearch.randomizedtesting.ThreadLeakControl$3.evaluate(ThreadLeakControl.java:490)
	at com.carrotsearch.randomizedtesting.RandomizedRunner.runSingleTest(RandomizedRunner.java:955)
	at com.carrotsearch.randomizedtesting.RandomizedRunner$5.evaluate(RandomizedRunner.java:840)
	at com.carrotsearch.randomizedtesting.RandomizedRunner$6.evaluate(RandomizedRunner.java:891)
	at com.carrotsearch.randomizedtesting.RandomizedRunner$7.evaluate(RandomizedRunner.java:902)
	at com.carrotsearch.randomizedtesting.rules.StatementAdapter.evaluate(StatementAdapter.java:36)
	at com.carrotsearch.randomizedtesting.rules.StatementAdapter.evaluate(StatementAdapter.java:36)
	at org.apache.lucene.tests.util.AbstractBeforeAfterRule$1.evaluate(AbstractBeforeAfterRule.java:43)
	at com.carrotsearch.randomizedtesting.rules.SystemPropertiesRestoreRule$1.evaluate(SystemPropertiesRestoreRule.java:80)
	at org.junit.rules.RunRules.evaluate(RunRules.java:20)
	at org.apache.lucene.tests.util.AbstractBeforeAfterRule$1.evaluate(AbstractBeforeAfterRule.java:43)
	at com.carrotsearch.randomizedtesting.rules.StatementAdapter.evaluate(StatementAdapter.java:36)
	at org.apache.lucene.tests.util.TestRuleStoreClassName$1.evaluate(TestRuleStoreClassName.java:38)
	at com.carrotsearch.randomizedtesting.rules.NoShadowingOrOverridesOnMethodsRule$1.evaluate(NoShadowingOrOverridesOnMethodsRule.java:40)
	at com.carrotsearch.randomizedtesting.rules.NoShadowingOrOverridesOnMethodsRule$1.evaluate(NoShadowingOrOverridesOnMethodsRule.java:40)
	at com.carrotsearch.randomizedtesting.rules.StatementAdapter.evaluate(StatementAdapter.java:36)
	at com.carrotsearch.randomizedtesting.rules.StatementAdapter.evaluate(StatementAdapter.java:36)
	at org.apache.lucene.tests.util.TestRuleAssertionsRequired$1.evaluate(TestRuleAssertionsRequired.java:53)
	at org.apache.lucene.tests.util.AbstractBeforeAfterRule$1.evaluate(AbstractBeforeAfterRule.java:43)
	at org.apache.lucene.tests.util.TestRuleMarkFailure$1.evaluate(TestRuleMarkFailure.java:44)
	at org.apache.lucene.tests.util.TestRuleIgnoreAfterMaxFailures$1.evaluate(TestRuleIgnoreAfterMaxFailures.java:60)
	at org.apache.lucene.tests.util.TestRuleIgnoreTestSuites$1.evaluate(TestRuleIgnoreTestSuites.java:47)
	at org.junit.rules.RunRules.evaluate(RunRules.java:20)
	at com.carrotsearch.randomizedtesting.rules.StatementAdapter.evaluate(StatementAdapter.java:36)
	at com.carrotsearch.randomizedtesting.ThreadLeakControl$StatementRunner.run(ThreadLeakControl.java:390)
	at com.carrotsearch.randomizedtesting.ThreadLeakControl.lambda$forkTimeoutingTask$0(ThreadLeakControl.java:850)
	at java.base/java.lang.Thread.run(Thread.java:1516)
Caused by: javax.net.ssl.SSLHandshakeException: (certificate_unknown) PKIX path building failed: sun.security.provider.certpath.SunCertPathBuilderException: unable to find valid certification path to requested target
	at java.base/sun.security.ssl.Alert.createSSLException(Alert.java:130)
	at java.base/sun.security.ssl.TransportContext.fatal(TransportContext.java:376)
	at java.base/sun.security.ssl.TransportContext.fatal(TransportContext.java:319)
	at java.base/sun.security.ssl.TransportContext.fatal(TransportContext.java:314)
	at java.base/sun.security.ssl.CertificateMessage$T13CertificateConsumer.checkServerCerts(CertificateMessage.java:1310)
	at java.base/sun.security.ssl.CertificateMessage$T13CertificateConsumer.onConsumeCertificate(CertificateMessage.java:1172)
	at java.base/sun.security.ssl.CertificateMessage$T13CertificateConsumer.consume(CertificateMessage.java:1115)
	at java.base/sun.security.ssl.SSLHandshake.consume(SSLHandshake.java:421)
	at java.base/sun.security.ssl.HandshakeContext.dispatch(HandshakeContext.java:477)
	at java.base/sun.security.ssl.SSLEngineImpl$DelegatedTask.run(SSLEngineImpl.java:1207)
	at java.base/java.util.ArrayList.forEach(ArrayList.java:1612)
	at java.net.http/jdk.internal.net.http.common.SSLFlowDelegate.lambda$executeTasks$0(SSLFlowDelegate.java:1148)
	at java.net.http/jdk.internal.net.http.HttpClientImpl$DelegatingExecutor.execute(HttpClientImpl.java:202)
	at java.net.http/jdk.internal.net.http.common.SSLFlowDelegate.executeTasks(SSLFlowDelegate.java:1143)
	at java.net.http/jdk.internal.net.http.common.SSLFlowDelegate.doHandshake(SSLFlowDelegate.java:1109)
	at java.net.http/jdk.internal.net.http.common.SSLFlowDelegate$Reader.processData(SSLFlowDelegate.java:508)
	at java.net.http/jdk.internal.net.http.common.SSLFlowDelegate$Reader$ReaderDownstreamPusher.run(SSLFlowDelegate.java:283)
	at java.net.http/jdk.internal.net.http.common.SequentialScheduler$LockingRestartableTask.run(SequentialScheduler.java:182)
	at java.net.http/jdk.internal.net.http.common.SequentialScheduler$CompleteRestartableTask.run(SequentialScheduler.java:149)
	at java.net.http/jdk.internal.net.http.common.SequentialScheduler$SchedulableTask.run(SequentialScheduler.java:207)
	at java.base/java.util.concurrent.ThreadPoolExecutor.runWorker(ThreadPoolExecutor.java:1090)
	at java.base/java.util.concurrent.ThreadPoolExecutor$Worker.run(ThreadPoolExecutor.java:614)
	... 1 more
Caused by: sun.security.validator.ValidatorException: PKIX path building failed: sun.security.provider.certpath.SunCertPathBuilderException: unable to find valid certification path to requested target
	at java.base/sun.security.validator.PKIXValidator.doBuild(PKIXValidator.java:386)
	at java.base/sun.security.validator.PKIXValidator.engineValidate(PKIXValidator.java:269)
	at java.base/sun.security.validator.Validator.validate(Validator.java:256)
	at java.base/sun.security.ssl.X509TrustManagerImpl.checkTrusted(X509TrustManagerImpl.java:319)
	at java.base/sun.security.ssl.X509TrustManagerImpl.checkServerTrusted(X509TrustManagerImpl.java:147)
	at java.base/sun.security.ssl.CertificateMessage$T13CertificateConsumer.checkServerCerts(CertificateMessage.java:1280)
	... 18 more
Caused by: sun.security.provider.certpath.SunCertPathBuilderException: unable to find valid certification path to requested target
	at java.base/sun.security.provider.certpath.SunCertPathBuilder.build(SunCertPathBuilder.java:148)
	at java.base/sun.security.provider.certpath.SunCertPathBuilder.engineBuild(SunCertPathBuilder.java:129)
	at java.base/java.security.cert.CertPathBuilder.build(CertPathBuilder.java:299)
	at java.base/sun.security.validator.PKIXValidator.doBuild(PKIXValidator.java:381)
	... 23 more


FAILED:  org.apache.solr.handler.admin.HealthCheckHandlerTest.testV1FailureResponseIncludesStatusField

Error Message:
javax.net.ssl.SSLHandshakeException: (certificate_unknown) PKIX path building failed: sun.security.provider.certpath.SunCertPathBuilderException: unable to find valid certification path to requested target

Stack Trace:
javax.net.ssl.SSLHandshakeException: (certificate_unknown) PKIX path building failed: sun.security.provider.certpath.SunCertPathBuilderException: unable to find valid certification path to requested target
	at __randomizedtesting.SeedInfo.seed([77A5BB09E123C26E:ED9D3D29F2240E74]:0)
	at java.net.http/jdk.internal.net.http.HttpClientImpl.send(HttpClientImpl.java:1049)
	at java.net.http/jdk.internal.net.http.HttpClientFacade.send(HttpClientFacade.java:133)
	at org.apache.solr.handler.admin.HealthCheckHandlerTest.testV1FailureResponseIncludesStatusField(HealthCheckHandlerTest.java:177)
	at java.base/jdk.internal.reflect.DirectMethodHandleAccessor.invoke(DirectMethodHandleAccessor.java:104)
	at java.base/java.lang.reflect.Method.invoke(Method.java:565)
	at com.carrotsearch.randomizedtesting.RandomizedRunner.invoke(RandomizedRunner.java:1763)
	at com.carrotsearch.randomizedtesting.RandomizedRunner$8.evaluate(RandomizedRunner.java:946)
	at com.carrotsearch.randomizedtesting.RandomizedRunner$9.evaluate(RandomizedRunner.java:982)
	at com.carrotsearch.randomizedtesting.RandomizedRunner$10.evaluate(RandomizedRunner.java:996)
	at com.carrotsearch.randomizedtesting.rules.SystemPropertiesRestoreRule$1.evaluate(SystemPropertiesRestoreRule.java:80)
	at org.junit.rules.RunRules.evaluate(RunRules.java:20)
	at org.apache.lucene.tests.util.TestRuleSetupTeardownChained$1.evaluate(TestRuleSetupTeardownChained.java:48)
	at org.apache.lucene.tests.util.AbstractBeforeAfterRule$1.evaluate(AbstractBeforeAfterRule.java:43)
	at org.apache.lucene.tests.util.TestRuleThreadAndTestName$1.evaluate(TestRuleThreadAndTestName.java:45)
	at org.apache.lucene.tests.util.TestRuleIgnoreAfterMaxFailures$1.evaluate(TestRuleIgnoreAfterMaxFailures.java:60)
	at org.apache.lucene.tests.util.TestRuleMarkFailure$1.evaluate(TestRuleMarkFailure.java:44)
	at org.junit.rules.RunRules.evaluate(RunRules.java:20)
	at com.carrotsearch.randomizedtesting.rules.StatementAdapter.evaluate(StatementAdapter.java:36)
	at com.carrotsearch.randomizedtesting.ThreadLeakControl$StatementRunner.run(ThreadLeakControl.java:390)
	at com.carrotsearch.randomizedtesting.ThreadLeakControl.forkTimeoutingTask(ThreadLeakControl.java:843)
	at com.carrotsearch.randomizedtesting.ThreadLeakControl$3.evaluate(ThreadLeakControl.java:490)
	at com.carrotsearch.randomizedtesting.RandomizedRunner.runSingleTest(RandomizedRunner.java:955)
	at com.carrotsearch.randomizedtesting.RandomizedRunner$5.evaluate(RandomizedRunner.java:840)
	at com.carrotsearch.randomizedtesting.RandomizedRunner$6.evaluate(RandomizedRunner.java:891)
	at com.carrotsearch.randomizedtesting.RandomizedRunner$7.evaluate(RandomizedRunner.java:902)
	at com.carrotsearch.randomizedtesting.rules.StatementAdapter.evaluate(StatementAdapter.java:36)
	at com.carrotsearch.randomizedtesting.rules.StatementAdapter.evaluate(StatementAdapter.java:36)
	at org.apache.lucene.tests.util.AbstractBeforeAfterRule$1.evaluate(AbstractBeforeAfterRule.java:43)
	at com.carrotsearch.randomizedtesting.rules.SystemPropertiesRestoreRule$1.evaluate(SystemPropertiesRestoreRule.java:80)
	at org.junit.rules.RunRules.evaluate(RunRules.java:20)
	at org.apache.lucene.tests.util.AbstractBeforeAfterRule$1.evaluate(AbstractBeforeAfterRule.java:43)
	at com.carrotsearch.randomizedtesting.rules.StatementAdapter.evaluate(StatementAdapter.java:36)
	at org.apache.lucene.tests.util.TestRuleStoreClassName$1.evaluate(TestRuleStoreClassName.java:38)
	at com.carrotsearch.randomizedtesting.rules.NoShadowingOrOverridesOnMethodsRule$1.evaluate(NoShadowingOrOverridesOnMethodsRule.java:40)
	at com.carrotsearch.randomizedtesting.rules.NoShadowingOrOverridesOnMethodsRule$1.evaluate(NoShadowingOrOverridesOnMethodsRule.java:40)
	at com.carrotsearch.randomizedtesting.rules.StatementAdapter.evaluate(StatementAdapter.java:36)
	at com.carrotsearch.randomizedtesting.rules.StatementAdapter.evaluate(StatementAdapter.java:36)
	at org.apache.lucene.tests.util.TestRuleAssertionsRequired$1.evaluate(TestRuleAssertionsRequired.java:53)
	at org.apache.lucene.tests.util.AbstractBeforeAfterRule$1.evaluate(AbstractBeforeAfterRule.java:43)
	at org.apache.lucene.tests.util.TestRuleMarkFailure$1.evaluate(TestRuleMarkFailure.java:44)
	at org.apache.lucene.tests.util.TestRuleIgnoreAfterMaxFailures$1.evaluate(TestRuleIgnoreAfterMaxFailures.java:60)
	at org.apache.lucene.tests.util.TestRuleIgnoreTestSuites$1.evaluate(TestRuleIgnoreTestSuites.java:47)
	at org.junit.rules.RunRules.evaluate(RunRules.java:20)
	at com.carrotsearch.randomizedtesting.rules.StatementAdapter.evaluate(StatementAdapter.java:36)
	at com.carrotsearch.randomizedtesting.ThreadLeakControl$StatementRunner.run(ThreadLeakControl.java:390)
	at com.carrotsearch.randomizedtesting.ThreadLeakControl.lambda$forkTimeoutingTask$0(ThreadLeakControl.java:850)
	at java.base/java.lang.Thread.run(Thread.java:1516)
Caused by: javax.net.ssl.SSLHandshakeException: (certificate_unknown) PKIX path building failed: sun.security.provider.certpath.SunCertPathBuilderException: unable to find valid certification path to requested target
	at java.base/sun.security.ssl.Alert.createSSLException(Alert.java:130)
	at java.base/sun.security.ssl.TransportContext.fatal(TransportContext.java:376)
	at java.base/sun.security.ssl.TransportContext.fatal(TransportContext.java:319)
	at java.base/sun.security.ssl.TransportContext.fatal(TransportContext.java:314)
	at java.base/sun.security.ssl.CertificateMessage$T13CertificateConsumer.checkServerCerts(CertificateMessage.java:1310)
	at java.base/sun.security.ssl.CertificateMessage$T13CertificateConsumer.onConsumeCertificate(CertificateMessage.java:1172)
	at java.base/sun.security.ssl.CertificateMessage$T13CertificateConsumer.consume(CertificateMessage.java:1115)
	at java.base/sun.security.ssl.SSLHandshake.consume(SSLHandshake.java:421)
	at java.base/sun.security.ssl.HandshakeContext.dispatch(HandshakeContext.java:477)
	at java.base/sun.security.ssl.SSLEngineImpl$DelegatedTask.run(SSLEngineImpl.java:1207)
	at java.base/java.util.ArrayList.forEach(ArrayList.java:1612)
	at java.net.http/jdk.internal.net.http.common.SSLFlowDelegate.lambda$executeTasks$0(SSLFlowDelegate.java:1148)
	at java.net.http/jdk.internal.net.http.HttpClientImpl$DelegatingExecutor.execute(HttpClientImpl.java:202)
	at java.net.http/jdk.internal.net.http.common.SSLFlowDelegate.executeTasks(SSLFlowDelegate.java:1143)
	at java.net.http/jdk.internal.net.http.common.SSLFlowDelegate.doHandshake(SSLFlowDelegate.java:1109)
	at java.net.http/jdk.internal.net.http.common.SSLFlowDelegate$Reader.processData(SSLFlowDelegate.java:508)
	at java.net.http/jdk.internal.net.http.common.SSLFlowDelegate$Reader$ReaderDownstreamPusher.run(SSLFlowDelegate.java:283)
	at java.net.http/jdk.internal.net.http.common.SequentialScheduler$LockingRestartableTask.run(SequentialScheduler.java:182)
	at java.net.http/jdk.internal.net.http.common.SequentialScheduler$CompleteRestartableTask.run(SequentialScheduler.java:149)
	at java.net.http/jdk.internal.net.http.common.SequentialScheduler$TryEndDeferredCompleter.complete(SequentialScheduler.java:324)
	at java.net.http/jdk.internal.net.http.common.SequentialScheduler$CompleteRestartableTask.run(SequentialScheduler.java:151)
	at java.net.http/jdk.internal.net.http.common.SequentialScheduler$SchedulableTask.run(SequentialScheduler.java:207)
	at java.base/java.util.concurrent.ThreadPoolExecutor.runWorker(ThreadPoolExecutor.java:1090)
	at java.base/java.util.concurrent.ThreadPoolExecutor$Worker.run(ThreadPoolExecutor.java:614)
	... 1 more
Caused by: sun.security.validator.ValidatorException: PKIX path building failed: sun.security.provider.certpath.SunCertPathBuilderException: unable to find valid certification path to requested target
	at java.base/sun.security.validator.PKIXValidator.doBuild(PKIXValidator.java:386)
	at java.base/sun.security.validator.PKIXValidator.engineValidate(PKIXValidator.java:269)
	at java.base/sun.security.validator.Validator.validate(Validator.java:256)
	at java.base/sun.security.ssl.X509TrustManagerImpl.checkTrusted(X509TrustManagerImpl.java:319)
	at java.base/sun.security.ssl.X509TrustManagerImpl.checkServerTrusted(X509TrustManagerImpl.java:147)
	at java.base/sun.security.ssl.CertificateMessage$T13CertificateConsumer.checkServerCerts(CertificateMessage.java:1280)
	... 20 more
Caused by: sun.security.provider.certpath.SunCertPathBuilderException: unable to find valid certification path to requested target
	at java.base/sun.security.provider.certpath.SunCertPathBuilder.build(SunCertPathBuilder.java:148)
	at java.base/sun.security.provider.certpath.SunCertPathBuilder.engineBuild(SunCertPathBuilder.java:129)
	at java.base/java.security.cert.CertPathBuilder.build(CertPathBuilder.java:299)
	at java.base/sun.security.validator.PKIXValidator.doBuild(PKIXValidator.java:381)
	... 25 more


FAILED:  org.apache.solr.handler.admin.HealthCheckHandlerTest.testV1FailureResponseIncludesStatusField

Error Message:
javax.net.ssl.SSLHandshakeException: (certificate_unknown) PKIX path building failed: sun.security.provider.certpath.SunCertPathBuilderException: unable to find valid certification path to requested target

Stack Trace:
javax.net.ssl.SSLHandshakeException: (certificate_unknown) PKIX path building failed: sun.security.provider.certpath.SunCertPathBuilderException: unable to find valid certification path to requested target
	at __randomizedtesting.SeedInfo.seed([77A5BB09E123C26E:ED9D3D29F2240E74]:0)
	at java.net.http/jdk.internal.net.http.HttpClientImpl.send(HttpClientImpl.java:1049)
	at java.net.http/jdk.internal.net.http.HttpClientFacade.send(HttpClientFacade.java:133)
	at org.apache.solr.handler.admin.HealthCheckHandlerTest.testV1FailureResponseIncludesStatusField(HealthCheckHandlerTest.java:177)
	at java.base/jdk.internal.reflect.DirectMethodHandleAccessor.invoke(DirectMethodHandleAccessor.java:104)
	at java.base/java.lang.reflect.Method.invoke(Method.java:565)
	at com.carrotsearch.randomizedtesting.RandomizedRunner.invoke(RandomizedRunner.java:1763)
	at com.carrotsearch.randomizedtesting.RandomizedRunner$8.evaluate(RandomizedRunner.java:946)
	at com.carrotsearch.randomizedtesting.RandomizedRunner$9.evaluate(RandomizedRunner.java:982)
	at com.carrotsearch.randomizedtesting.RandomizedRunner$10.evaluate(RandomizedRunner.java:996)
	at com.carrotsearch.randomizedtesting.rules.SystemPropertiesRestoreRule$1.evaluate(SystemPropertiesRestoreRule.java:80)
	at org.junit.rules.RunRules.evaluate(RunRules.java:20)
	at org.apache.lucene.tests.util.TestRuleSetupTeardownChained$1.evaluate(TestRuleSetupTeardownChained.java:48)
	at org.apache.lucene.tests.util.AbstractBeforeAfterRule$1.evaluate(AbstractBeforeAfterRule.java:43)
	at org.apache.lucene.tests.util.TestRuleThreadAndTestName$1.evaluate(TestRuleThreadAndTestName.java:45)
	at org.apache.lucene.tests.util.TestRuleIgnoreAfterMaxFailures$1.evaluate(TestRuleIgnoreAfterMaxFailures.java:60)
	at org.apache.lucene.tests.util.TestRuleMarkFailure$1.evaluate(TestRuleMarkFailure.java:44)
	at org.junit.rules.RunRules.evaluate(RunRules.java:20)
	at com.carrotsearch.randomizedtesting.rules.StatementAdapter.evaluate(StatementAdapter.java:36)
	at com.carrotsearch.randomizedtesting.ThreadLeakControl$StatementRunner.run(ThreadLeakControl.java:390)
	at com.carrotsearch.randomizedtesting.ThreadLeakControl.forkTimeoutingTask(ThreadLeakControl.java:843)
	at com.carrotsearch.randomizedtesting.ThreadLeakControl$3.evaluate(ThreadLeakControl.java:490)
	at com.carrotsearch.randomizedtesting.RandomizedRunner.runSingleTest(RandomizedRunner.java:955)
	at com.carrotsearch.randomizedtesting.RandomizedRunner$5.evaluate(RandomizedRunner.java:840)
	at com.carrotsearch.randomizedtesting.RandomizedRunner$6.evaluate(RandomizedRunner.java:891)
	at com.carrotsearch.randomizedtesting.RandomizedRunner$7.evaluate(RandomizedRunner.java:902)
	at com.carrotsearch.randomizedtesting.rules.StatementAdapter.evaluate(StatementAdapter.java:36)
	at com.carrotsearch.randomizedtesting.rules.StatementAdapter.evaluate(StatementAdapter.java:36)
	at org.apache.lucene.tests.util.AbstractBeforeAfterRule$1.evaluate(AbstractBeforeAfterRule.java:43)
	at com.carrotsearch.randomizedtesting.rules.SystemPropertiesRestoreRule$1.evaluate(SystemPropertiesRestoreRule.java:80)
	at org.junit.rules.RunRules.evaluate(RunRules.java:20)
	at org.apache.lucene.tests.util.AbstractBeforeAfterRule$1.evaluate(AbstractBeforeAfterRule.java:43)
	at com.carrotsearch.randomizedtesting.rules.StatementAdapter.evaluate(StatementAdapter.java:36)
	at org.apache.lucene.tests.util.TestRuleStoreClassName$1.evaluate(TestRuleStoreClassName.java:38)
	at com.carrotsearch.randomizedtesting.rules.NoShadowingOrOverridesOnMethodsRule$1.evaluate(NoShadowingOrOverridesOnMethodsRule.java:40)
	at com.carrotsearch.randomizedtesting.rules.NoShadowingOrOverridesOnMethodsRule$1.evaluate(NoShadowingOrOverridesOnMethodsRule.java:40)
	at com.carrotsearch.randomizedtesting.rules.StatementAdapter.evaluate(StatementAdapter.java:36)
	at com.carrotsearch.randomizedtesting.rules.StatementAdapter.evaluate(StatementAdapter.java:36)
	at org.apache.lucene.tests.util.TestRuleAssertionsRequired$1.evaluate(TestRuleAssertionsRequired.java:53)
	at org.apache.lucene.tests.util.AbstractBeforeAfterRule$1.evaluate(AbstractBeforeAfterRule.java:43)
	at org.apache.lucene.tests.util.TestRuleMarkFailure$1.evaluate(TestRuleMarkFailure.java:44)
	at org.apache.lucene.tests.util.TestRuleIgnoreAfterMaxFailures$1.evaluate(TestRuleIgnoreAfterMaxFailures.java:60)
	at org.apache.lucene.tests.util.TestRuleIgnoreTestSuites$1.evaluate(TestRuleIgnoreTestSuites.java:47)
	at org.junit.rules.RunRules.evaluate(RunRules.java:20)
	at com.carrotsearch.randomizedtesting.rules.StatementAdapter.evaluate(StatementAdapter.java:36)
	at com.carrotsearch.randomizedtesting.ThreadLeakControl$StatementRunner.run(ThreadLeakControl.java:390)
	at com.carrotsearch.randomizedtesting.ThreadLeakControl.lambda$forkTimeoutingTask$0(ThreadLeakControl.java:850)
	at java.base/java.lang.Thread.run(Thread.java:1516)
Caused by: javax.net.ssl.SSLHandshakeException: (certificate_unknown) PKIX path building failed: sun.security.provider.certpath.SunCertPathBuilderException: unable to find valid certification path to requested target
	at java.base/sun.security.ssl.Alert.createSSLException(Alert.java:130)
	at java.base/sun.security.ssl.TransportContext.fatal(TransportContext.java:376)
	at java.base/sun.security.ssl.TransportContext.fatal(TransportContext.java:319)
	at java.base/sun.security.ssl.TransportContext.fatal(TransportContext.java:314)
	at java.base/sun.security.ssl.CertificateMessage$T13CertificateConsumer.checkServerCerts(CertificateMessage.java:1310)
	at java.base/sun.security.ssl.CertificateMessage$T13CertificateConsumer.onConsumeCertificate(CertificateMessage.java:1172)
	at java.base/sun.security.ssl.CertificateMessage$T13CertificateConsumer.consume(CertificateMessage.java:1115)
	at java.base/sun.security.ssl.SSLHandshake.consume(SSLHandshake.java:421)
	at java.base/sun.security.ssl.HandshakeContext.dispatch(HandshakeContext.java:477)
	at java.base/sun.security.ssl.SSLEngineImpl$DelegatedTask.run(SSLEngineImpl.java:1207)
	at java.base/java.util.ArrayList.forEach(ArrayList.java:1612)
	at java.net.http/jdk.internal.net.http.common.SSLFlowDelegate.lambda$executeTasks$0(SSLFlowDelegate.java:1148)
	at java.net.http/jdk.internal.net.http.HttpClientImpl$DelegatingExecutor.execute(HttpClientImpl.java:202)
	at java.net.http/jdk.internal.net.http.common.SSLFlowDelegate.executeTasks(SSLFlowDelegate.java:1143)
	at java.net.http/jdk.internal.net.http.common.SSLFlowDelegate.doHandshake(SSLFlowDelegate.java:1109)
	at java.net.http/jdk.internal.net.http.common.SSLFlowDelegate$Reader.processData(SSLFlowDelegate.java:508)
	at java.net.http/jdk.internal.net.http.common.SSLFlowDelegate$Reader$ReaderDownstreamPusher.run(SSLFlowDelegate.java:283)
	at java.net.http/jdk.internal.net.http.common.SequentialScheduler$LockingRestartableTask.run(SequentialScheduler.java:182)
	at java.net.http/jdk.internal.net.http.common.SequentialScheduler$CompleteRestartableTask.run(SequentialScheduler.java:149)
	at java.net.http/jdk.internal.net.http.common.SequentialScheduler$TryEndDeferredCompleter.complete(SequentialScheduler.java:324)
	at java.net.http/jdk.internal.net.http.common.SequentialScheduler$CompleteRestartableTask.run(SequentialScheduler.java:151)
	at java.net.http/jdk.internal.net.http.common.SequentialScheduler$SchedulableTask.run(SequentialScheduler.java:207)
	at java.base/java.util.concurrent.ThreadPoolExecutor.runWorker(ThreadPoolExecutor.java:1090)
	at java.base/java.util.concurrent.ThreadPoolExecutor$Worker.run(ThreadPoolExecutor.java:614)
	... 1 more
Caused by: sun.security.validator.ValidatorException: PKIX path building failed: sun.security.provider.certpath.SunCertPathBuilderException: unable to find valid certification path to requested target
	at java.base/sun.security.validator.PKIXValidator.doBuild(PKIXValidator.java:386)
	at java.base/sun.security.validator.PKIXValidator.engineValidate(PKIXValidator.java:269)
	at java.base/sun.security.validator.Validator.validate(Validator.java:256)
	at java.base/sun.security.ssl.X509TrustManagerImpl.checkTrusted(X509TrustManagerImpl.java:319)
	at java.base/sun.security.ssl.X509TrustManagerImpl.checkServerTrusted(X509TrustManagerImpl.java:147)
	at java.base/sun.security.ssl.CertificateMessage$T13CertificateConsumer.checkServerCerts(CertificateMessage.java:1280)
	... 20 more
Caused by: sun.security.provider.certpath.SunCertPathBuilderException: unable to find valid certification path to requested target
	at java.base/sun.security.provider.certpath.SunCertPathBuilder.build(SunCertPathBuilder.java:148)
	at java.base/sun.security.provider.certpath.SunCertPathBuilder.engineBuild(SunCertPathBuilder.java:129)
	at java.base/java.security.cert.CertPathBuilder.build(CertPathBuilder.java:299)
	at java.base/sun.security.validator.PKIXValidator.doBuild(PKIXValidator.java:381)
	... 25 more


FAILED:  org.apache.solr.update.SolrIndexFingerprintTest.testSequentialVsParallelFingerprint

Error Message:
java.lang.OutOfMemoryError: Java heap space

Stack Trace:
java.lang.OutOfMemoryError: Java heap space
	at __randomizedtesting.SeedInfo.seed([77A5BB09E123C26E:17D0988DB7913073]:0)
	at java.base/java.util.HashMap.newNode(HashMap.java:1910)
	at java.base/java.util.HashMap.putVal(HashMap.java:638)
	at java.base/java.util.HashMap.put(HashMap.java:619)
	at java.base/java.util.HashSet.add(HashSet.java:230)
	at java.base/java.util.AbstractCollection.addAll(AbstractCollection.java:338)
	at org.apache.lucene.index.SegmentInfos.files(SegmentInfos.java:943)
	at org.apache.lucene.index.IndexFileDeleter.incRef(IndexFileDeleter.java:615)
	at org.apache.lucene.index.IndexFileDeleter.checkpoint(IndexFileDeleter.java:571)
	at org.apache.lucene.index.IndexWriter.finishCommit(IndexWriter.java:4214)
	at org.apache.lucene.index.IndexWriter.commitInternal(IndexWriter.java:4168)
	at org.apache.lucene.index.IndexWriter.commit(IndexWriter.java:4122)
	at org.apache.solr.update.DirectUpdateHandler2.commit(DirectUpdateHandler2.java:871)
	at org.apache.solr.update.processor.RunUpdateProcessorFactory$RunUpdateProcessor.processCommit(RunUpdateProcessorFactory.java:100)
	at org.apache.solr.update.processor.UpdateRequestProcessor.processCommit(UpdateRequestProcessor.java:66)
	at org.apache.solr.update.processor.UpdateRequestProcessor.processCommit(UpdateRequestProcessor.java:66)
	at org.apache.solr.update.processor.DistributedUpdateProcessor.doLocalCommit(DistributedUpdateProcessor.java:1174)
	at org.apache.solr.update.processor.DistributedUpdateProcessor.processCommit(DistributedUpdateProcessor.java:1160)
	at org.apache.solr.update.processor.LogUpdateProcessorFactory$LogUpdateProcessor.processCommit(LogUpdateProcessorFactory.java:173)
	at org.apache.solr.handler.loader.XMLLoader.processUpdate(XMLLoader.java:214)
	at org.apache.solr.handler.loader.XMLLoader.load(XMLLoader.java:120)
	at org.apache.solr.handler.UpdateRequestHandler$1.load(UpdateRequestHandler.java:101)
	at org.apache.solr.handler.ContentStreamHandlerBase.handleRequestBody(ContentStreamHandlerBase.java:99)
	at org.apache.solr.handler.RequestHandlerBase.handleRequest(RequestHandlerBase.java:251)
	at org.apache.solr.core.SolrCore.execute(SolrCore.java:2932)
	at org.apache.solr.client.solrj.embedded.EmbeddedSolrServer.request(EmbeddedSolrServer.java:228)
	at org.apache.solr.client.solrj.SolrClient.request(SolrClient.java:1195)
	at org.apache.solr.util.TestHarness.update(TestHarness.java:272)
	at org.apache.solr.util.BaseTestHarness.checkUpdateStatus(BaseTestHarness.java:270)
	at org.apache.solr.util.BaseTestHarness.validateUpdate(BaseTestHarness.java:238)
	at org.apache.solr.SolrTestCaseJ4.checkUpdateU(SolrTestCaseJ4.java:841)
	at org.apache.solr.SolrTestCaseJ4.assertU(SolrTestCaseJ4.java:823)
	at org.apache.solr.SolrTestCaseJ4.assertU(SolrTestCaseJ4.java:818)

[JENKINS] Solr-main-Linux (64bit/hotspot/jdk-22.0.2) - Build # 32570 - Still unstable!

Posted by Policeman Jenkins Server via builds <bu...@solr.apache.org>.
Build: https://jenkins.thetaphi.de/job/Solr-main-Linux/32570/
Java: 64bit/hotspot/jdk-22.0.2 -XX:+UseCompressedOops -XX:+UseZGC

13 tests failed.
FAILED:  org.apache.solr.update.SolrIndexFingerprintTest.classMethod

Error Message:
java.lang.AssertionError: ObjectTracker found 1 object(s) that were not released!!! [MockDirectoryWrapper]
org.apache.lucene.tests.store.MockDirectoryWrapper:org.apache.solr.common.util.ObjectReleaseTracker$ObjectTrackerException: org.apache.lucene.tests.store.MockDirectoryWrapper@2006458046
	at org.apache.solr.common.util.ObjectReleaseTracker.track(ObjectReleaseTracker.java:57)
	at org.apache.solr.core.CachingDirectoryFactory.get(CachingDirectoryFactory.java:405)
	at org.apache.solr.update.SolrIndexWriter.create(SolrIndexWriter.java:115)
	at org.apache.solr.core.SolrCore.initIndex(SolrCore.java:914)
	at org.apache.solr.core.SolrCore.<init>(SolrCore.java:1136)
	at org.apache.solr.core.SolrCore.<init>(SolrCore.java:1064)
	at org.apache.solr.core.CoreContainer.createFromDescriptor(CoreContainer.java:1679)
	at org.apache.solr.core.CoreContainer.lambda$loadInternal$6(CoreContainer.java:996)
	at org.apache.solr.util.stats.OtelInstrumentedExecutorService$InstrumentedRunnable.run(OtelInstrumentedExecutorService.java:256)
	at org.apache.solr.common.util.ExecutorUtil$MDCAwareThreadPoolExecutor.lambda$execute$0(ExecutorUtil.java:381)
	at java.base/java.util.concurrent.ThreadPoolExecutor.runWorker(ThreadPoolExecutor.java:1144)
	at java.base/java.util.concurrent.ThreadPoolExecutor$Worker.run(ThreadPoolExecutor.java:642)
	at java.base/java.lang.Thread.run(Thread.java:1570)
Caused by: java.lang.Exception: Submitter stack trace
	at org.apache.solr.common.util.ExecutorUtil$MDCAwareThreadPoolExecutor.execute(ExecutorUtil.java:348)
	at org.apache.solr.util.stats.OtelInstrumentedExecutorService.execute(OtelInstrumentedExecutorService.java:156)
	at org.apache.solr.core.CoreContainer.loadInternal(CoreContainer.java:985)
	at org.apache.solr.core.CoreContainer.load(CoreContainer.java:754)
	at org.apache.solr.util.TestHarness.<init>(TestHarness.java:171)
	at org.apache.solr.util.TestHarness.<init>(TestHarness.java:139)
	at org.apache.solr.util.TestHarness.<init>(TestHarness.java:147)
	at org.apache.solr.util.TestHarness.<init>(TestHarness.java:91)
	at org.apache.solr.SolrTestCaseJ4.createCore(SolrTestCaseJ4.java:706)
	at org.apache.solr.SolrTestCaseJ4.initCore(SolrTestCaseJ4.java:696)
	at org.apache.solr.SolrTestCaseJ4.initCore(SolrTestCaseJ4.java:559)
	at org.apache.solr.SolrTestCaseJ4.initCore(SolrTestCaseJ4.java:546)
	at org.apache.solr.update.SolrIndexFingerprintTest.beforeTests(SolrIndexFingerprintTest.java:32)
	at java.base/jdk.internal.reflect.DirectMethodHandleAccessor.invoke(DirectMethodHandleAccessor.java:103)
	at java.base/java.lang.reflect.Method.invoke(Method.java:580)
	at com.carrotsearch.randomizedtesting.RandomizedRunner.invoke(RandomizedRunner.java:1763)
	at com.carrotsearch.randomizedtesting.RandomizedRunner$6.evaluate(RandomizedRunner.java:886)
	at com.carrotsearch.randomizedtesting.RandomizedRunner$7.evaluate(RandomizedRunner.java:902)
	at com.carrotsearch.randomizedtesting.rules.StatementAdapter.evaluate(StatementAdapter.java:36)
	at com.carrotsearch.randomizedtesting.rules.StatementAdapter.evaluate(StatementAdapter.java:36)
	at org.apache.lucene.tests.util.AbstractBeforeAfterRule$1.evaluate(AbstractBeforeAfterRule.java:43)
	at com.carrotsearch.randomizedtesting.rules.SystemPropertiesRestoreRule$1.evaluate(SystemPropertiesRestoreRule.java:80)
	at org.junit.rules.RunRules.evaluate(RunRules.java:20)
	at org.apache.lucene.tests.util.AbstractBeforeAfterRule$1.evaluate(AbstractBeforeAfterRule.java:43)
	at com.carrotsearch.randomizedtesting.rules.StatementAdapter.evaluate(StatementAdapter.java:36)
	at org.apache.lucene.tests.util.TestRuleStoreClassName$1.evaluate(TestRuleStoreClassName.java:38)
	at com.carrotsearch.randomizedtesting.rules.NoShadowingOrOverridesOnMethodsRule$1.evaluate(NoShadowingOrOverridesOnMethodsRule.java:40)
	at com.carrotsearch.randomizedtesting.rules.NoShadowingOrOverridesOnMethodsRule$1.evaluate(NoShadowingOrOverridesOnMethodsRule.java:40)
	at com.carrotsearch.randomizedtesting.rules.StatementAdapter.evaluate(StatementAdapter.java:36)
	at com.carrotsearch.randomizedtesting.rules.StatementAdapter.evaluate(StatementAdapter.java:36)
	at org.apache.lucene.tests.util.TestRuleAssertionsRequired$1.evaluate(TestRuleAssertionsRequired.java:53)
	at org.apache.lucene.tests.util.AbstractBeforeAfterRule$1.evaluate(AbstractBeforeAfterRule.java:43)
	at org.apache.lucene.tests.util.TestRuleMarkFailure$1.evaluate(TestRuleMarkFailure.java:44)
	at org.apache.lucene.tests.util.TestRuleIgnoreAfterMaxFailures$1.evaluate(TestRuleIgnoreAfterMaxFailures.java:60)
	at org.apache.lucene.tests.util.TestRuleIgnoreTestSuites$1.evaluate(TestRuleIgnoreTestSuites.java:47)
	at org.junit.rules.RunRules.evaluate(RunRules.java:20)
	at com.carrotsearch.randomizedtesting.rules.StatementAdapter.evaluate(StatementAdapter.java:36)
	at com.carrotsearch.randomizedtesting.ThreadLeakControl$StatementRunner.run(ThreadLeakControl.java:390)
	at com.carrotsearch.randomizedtesting.ThreadLeakControl.lambda$forkTimeoutingTask$0(ThreadLeakControl.java:850)
	... 1 more

 expected null, but was:<ObjectTracker found 1 object(s) that were not released!!! [MockDirectoryWrapper]
org.apache.lucene.tests.store.MockDirectoryWrapper:org.apache.solr.common.util.ObjectReleaseTracker$ObjectTrackerException: org.apache.lucene.tests.store.MockDirectoryWrapper@2006458046
	at org.apache.solr.common.util.ObjectReleaseTracker.track(ObjectReleaseTracker.java:57)
	at org.apache.solr.core.CachingDirectoryFactory.get(CachingDirectoryFactory.java:405)
	at org.apache.solr.update.SolrIndexWriter.create(SolrIndexWriter.java:115)
	at org.apache.solr.core.SolrCore.initIndex(SolrCore.java:914)
	at org.apache.solr.core.SolrCore.<init>(SolrCore.java:1136)
	at org.apache.solr.core.SolrCore.<init>(SolrCore.java:1064)
	at org.apache.solr.core.CoreContainer.createFromDescriptor(CoreContainer.java:1679)
	at org.apache.solr.core.CoreContainer.lambda$loadInternal$6(CoreContainer.java:996)
	at org.apache.solr.util.stats.OtelInstrumentedExecutorService$InstrumentedRunnable.run(OtelInstrumentedExecutorService.java:256)
	at org.apache.solr.common.util.ExecutorUtil$MDCAwareThreadPoolExecutor.lambda$execute$0(ExecutorUtil.java:381)
	at java.base/java.util.concurrent.ThreadPoolExecutor.runWorker(ThreadPoolExecutor.java:1144)
	at java.base/java.util.concurrent.ThreadPoolExecutor$Worker.run(ThreadPoolExecutor.java:642)
	at java.base/java.lang.Thread.run(Thread.java:1570)
Caused by: java.lang.Exception: Submitter stack trace
	at org.apache.solr.common.util.ExecutorUtil$MDCAwareThreadPoolExecutor.execute(ExecutorUtil.java:348)
	at org.apache.solr.util.stats.OtelInstrumentedExecutorService.execute(OtelInstrumentedExecutorService.java:156)
	at org.apache.solr.core.CoreContainer.loadInternal(CoreContainer.java:985)
	at org.apache.solr.core.CoreContainer.load(CoreContainer.java:754)
	at org.apache.solr.util.TestHarness.<init>(TestHarness.java:171)
	at org.apache.solr.util.TestHarness.<init>(TestHarness.java:139)
	at org.apache.solr.util.TestHarness.<init>(TestHarness.java:147)
	at org.apache.solr.util.TestHarness.<init>(TestHarness.java:91)
	at org.apache.solr.SolrTestCaseJ4.createCore(SolrTestCaseJ4.java:706)
	at org.apache.solr.SolrTestCaseJ4.initCore(SolrTestCaseJ4.java:696)
	at org.apache.solr.SolrTestCaseJ4.initCore(SolrTestCaseJ4.java:559)
	at org.apache.solr.SolrTestCaseJ4.initCore(SolrTestCaseJ4.java:546)
	at org.apache.solr.update.SolrIndexFingerprintTest.beforeTests(SolrIndexFingerprintTest.java:32)
	at java.base/jdk.internal.reflect.DirectMethodHandleAccessor.invoke(DirectMethodHandleAccessor.java:103)
	at java.base/java.lang.reflect.Method.invoke(Method.java:580)
	at com.carrotsearch.randomizedtesting.RandomizedRunner.invoke(RandomizedRunner.java:1763)
	at com.carrotsearch.randomizedtesting.RandomizedRunner$6.evaluate(RandomizedRunner.java:886)
	at com.carrotsearch.randomizedtesting.RandomizedRunner$7.evaluate(RandomizedRunner.java:902)
	at com.carrotsearch.randomizedtesting.rules.StatementAdapter.evaluate(StatementAdapter.java:36)
	at com.carrotsearch.randomizedtesting.rules.StatementAdapter.evaluate(StatementAdapter.java:36)
	at org.apache.lucene.tests.util.AbstractBeforeAfterRule$1.evaluate(AbstractBeforeAfterRule.java:43)
	at com.carrotsearch.randomizedtesting.rules.SystemPropertiesRestoreRule$1.evaluate(SystemPropertiesRestoreRule.java:80)
	at org.junit.rules.RunRules.evaluate(RunRules.java:20)
	at org.apache.lucene.tests.util.AbstractBeforeAfterRule$1.evaluate(AbstractBeforeAfterRule.java:43)
	at com.carrotsearch.randomizedtesting.rules.StatementAdapter.evaluate(StatementAdapter.java:36)
	at org.apache.lucene.tests.util.TestRuleStoreClassName$1.evaluate(TestRuleStoreClassName.java:38)
	at com.carrotsearch.randomizedtesting.rules.NoShadowingOrOverridesOnMethodsRule$1.evaluate(NoShadowingOrOverridesOnMethodsRule.java:40)
	at com.carrotsearch.randomizedtesting.rules.NoShadowingOrOverridesOnMethodsRule$1.evaluate(NoShadowingOrOverridesOnMethodsRule.java:40)
	at com.carrotsearch.randomizedtesting.rules.StatementAdapter.evaluate(StatementAdapter.java:36)
	at com.carrotsearch.randomizedtesting.rules.StatementAdapter.evaluate(StatementAdapter.java:36)
	at org.apache.lucene.tests.util.TestRuleAssertionsRequired$1.evaluate(TestRuleAssertionsRequired.java:53)
	at org.apache.lucene.tests.util.AbstractBeforeAfterRule$1.evaluate(AbstractBeforeAfterRule.java:43)
	at org.apache.lucene.tests.util.TestRuleMarkFailure$1.evaluate(TestRuleMarkFailure.java:44)
	at org.apache.lucene.tests.util.TestRuleIgnoreAfterMaxFailures$1.evaluate(TestRuleIgnoreAfterMaxFailures.java:60)
	at org.apache.lucene.tests.util.TestRuleIgnoreTestSuites$1.evaluate(TestRuleIgnoreTestSuites.java:47)
	at org.junit.rules.RunRules.evaluate(RunRules.java:20)
	at com.carrotsearch.randomizedtesting.rules.StatementAdapter.evaluate(StatementAdapter.java:36)
	at com.carrotsearch.randomizedtesting.ThreadLeakControl$StatementRunner.run(ThreadLeakControl.java:390)
	at com.carrotsearch.randomizedtesting.ThreadLeakControl.lambda$forkTimeoutingTask$0(ThreadLeakControl.java:850)
	... 1 more

>

Stack Trace:
java.lang.AssertionError: ObjectTracker found 1 object(s) that were not released!!! [MockDirectoryWrapper]
org.apache.lucene.tests.store.MockDirectoryWrapper:org.apache.solr.common.util.ObjectReleaseTracker$ObjectTrackerException: org.apache.lucene.tests.store.MockDirectoryWrapper@2006458046
	at org.apache.solr.common.util.ObjectReleaseTracker.track(ObjectReleaseTracker.java:57)
	at org.apache.solr.core.CachingDirectoryFactory.get(CachingDirectoryFactory.java:405)
	at org.apache.solr.update.SolrIndexWriter.create(SolrIndexWriter.java:115)
	at org.apache.solr.core.SolrCore.initIndex(SolrCore.java:914)
	at org.apache.solr.core.SolrCore.<init>(SolrCore.java:1136)
	at org.apache.solr.core.SolrCore.<init>(SolrCore.java:1064)
	at org.apache.solr.core.CoreContainer.createFromDescriptor(CoreContainer.java:1679)
	at org.apache.solr.core.CoreContainer.lambda$loadInternal$6(CoreContainer.java:996)
	at org.apache.solr.util.stats.OtelInstrumentedExecutorService$InstrumentedRunnable.run(OtelInstrumentedExecutorService.java:256)
	at org.apache.solr.common.util.ExecutorUtil$MDCAwareThreadPoolExecutor.lambda$execute$0(ExecutorUtil.java:381)
	at java.base/java.util.concurrent.ThreadPoolExecutor.runWorker(ThreadPoolExecutor.java:1144)
	at java.base/java.util.concurrent.ThreadPoolExecutor$Worker.run(ThreadPoolExecutor.java:642)
	at java.base/java.lang.Thread.run(Thread.java:1570)
Caused by: java.lang.Exception: Submitter stack trace
	at org.apache.solr.common.util.ExecutorUtil$MDCAwareThreadPoolExecutor.execute(ExecutorUtil.java:348)
	at org.apache.solr.util.stats.OtelInstrumentedExecutorService.execute(OtelInstrumentedExecutorService.java:156)
	at org.apache.solr.core.CoreContainer.loadInternal(CoreContainer.java:985)
	at org.apache.solr.core.CoreContainer.load(CoreContainer.java:754)
	at org.apache.solr.util.TestHarness.<init>(TestHarness.java:171)
	at org.apache.solr.util.TestHarness.<init>(TestHarness.java:139)
	at org.apache.solr.util.TestHarness.<init>(TestHarness.java:147)
	at org.apache.solr.util.TestHarness.<init>(TestHarness.java:91)
	at org.apache.solr.SolrTestCaseJ4.createCore(SolrTestCaseJ4.java:706)
	at org.apache.solr.SolrTestCaseJ4.initCore(SolrTestCaseJ4.java:696)
	at org.apache.solr.SolrTestCaseJ4.initCore(SolrTestCaseJ4.java:559)
	at org.apache.solr.SolrTestCaseJ4.initCore(SolrTestCaseJ4.java:546)
	at org.apache.solr.update.SolrIndexFingerprintTest.beforeTests(SolrIndexFingerprintTest.java:32)
	at java.base/jdk.internal.reflect.DirectMethodHandleAccessor.invoke(DirectMethodHandleAccessor.java:103)
	at java.base/java.lang.reflect.Method.invoke(Method.java:580)
	at com.carrotsearch.randomizedtesting.RandomizedRunner.invoke(RandomizedRunner.java:1763)
	at com.carrotsearch.randomizedtesting.RandomizedRunner$6.evaluate(RandomizedRunner.java:886)
	at com.carrotsearch.randomizedtesting.RandomizedRunner$7.evaluate(RandomizedRunner.java:902)
	at com.carrotsearch.randomizedtesting.rules.StatementAdapter.evaluate(StatementAdapter.java:36)
	at com.carrotsearch.randomizedtesting.rules.StatementAdapter.evaluate(StatementAdapter.java:36)
	at org.apache.lucene.tests.util.AbstractBeforeAfterRule$1.evaluate(AbstractBeforeAfterRule.java:43)
	at com.carrotsearch.randomizedtesting.rules.SystemPropertiesRestoreRule$1.evaluate(SystemPropertiesRestoreRule.java:80)
	at org.junit.rules.RunRules.evaluate(RunRules.java:20)
	at org.apache.lucene.tests.util.AbstractBeforeAfterRule$1.evaluate(AbstractBeforeAfterRule.java:43)
	at com.carrotsearch.randomizedtesting.rules.StatementAdapter.evaluate(StatementAdapter.java:36)
	at org.apache.lucene.tests.util.TestRuleStoreClassName$1.evaluate(TestRuleStoreClassName.java:38)
	at com.carrotsearch.randomizedtesting.rules.NoShadowingOrOverridesOnMethodsRule$1.evaluate(NoShadowingOrOverridesOnMethodsRule.java:40)
	at com.carrotsearch.randomizedtesting.rules.NoShadowingOrOverridesOnMethodsRule$1.evaluate(NoShadowingOrOverridesOnMethodsRule.java:40)
	at com.carrotsearch.randomizedtesting.rules.StatementAdapter.evaluate(StatementAdapter.java:36)
	at com.carrotsearch.randomizedtesting.rules.StatementAdapter.evaluate(StatementAdapter.java:36)
	at org.apache.lucene.tests.util.TestRuleAssertionsRequired$1.evaluate(TestRuleAssertionsRequired.java:53)
	at org.apache.lucene.tests.util.AbstractBeforeAfterRule$1.evaluate(AbstractBeforeAfterRule.java:43)
	at org.apache.lucene.tests.util.TestRuleMarkFailure$1.evaluate(TestRuleMarkFailure.java:44)
	at org.apache.lucene.tests.util.TestRuleIgnoreAfterMaxFailures$1.evaluate(TestRuleIgnoreAfterMaxFailures.java:60)
	at org.apache.lucene.tests.util.TestRuleIgnoreTestSuites$1.evaluate(TestRuleIgnoreTestSuites.java:47)
	at org.junit.rules.RunRules.evaluate(RunRules.java:20)
	at com.carrotsearch.randomizedtesting.rules.StatementAdapter.evaluate(StatementAdapter.java:36)
	at com.carrotsearch.randomizedtesting.ThreadLeakControl$StatementRunner.run(ThreadLeakControl.java:390)
	at com.carrotsearch.randomizedtesting.ThreadLeakControl.lambda$forkTimeoutingTask$0(ThreadLeakControl.java:850)
	... 1 more

 expected null, but was:<ObjectTracker found 1 object(s) that were not released!!! [MockDirectoryWrapper]
org.apache.lucene.tests.store.MockDirectoryWrapper:org.apache.solr.common.util.ObjectReleaseTracker$ObjectTrackerException: org.apache.lucene.tests.store.MockDirectoryWrapper@2006458046
	at org.apache.solr.common.util.ObjectReleaseTracker.track(ObjectReleaseTracker.java:57)
	at org.apache.solr.core.CachingDirectoryFactory.get(CachingDirectoryFactory.java:405)
	at org.apache.solr.update.SolrIndexWriter.create(SolrIndexWriter.java:115)
	at org.apache.solr.core.SolrCore.initIndex(SolrCore.java:914)
	at org.apache.solr.core.SolrCore.<init>(SolrCore.java:1136)
	at org.apache.solr.core.SolrCore.<init>(SolrCore.java:1064)
	at org.apache.solr.core.CoreContainer.createFromDescriptor(CoreContainer.java:1679)
	at org.apache.solr.core.CoreContainer.lambda$loadInternal$6(CoreContainer.java:996)
	at org.apache.solr.util.stats.OtelInstrumentedExecutorService$InstrumentedRunnable.run(OtelInstrumentedExecutorService.java:256)
	at org.apache.solr.common.util.ExecutorUtil$MDCAwareThreadPoolExecutor.lambda$execute$0(ExecutorUtil.java:381)
	at java.base/java.util.concurrent.ThreadPoolExecutor.runWorker(ThreadPoolExecutor.java:1144)
	at java.base/java.util.concurrent.ThreadPoolExecutor$Worker.run(ThreadPoolExecutor.java:642)
	at java.base/java.lang.Thread.run(Thread.java:1570)
Caused by: java.lang.Exception: Submitter stack trace
	at org.apache.solr.common.util.ExecutorUtil$MDCAwareThreadPoolExecutor.execute(ExecutorUtil.java:348)
	at org.apache.solr.util.stats.OtelInstrumentedExecutorService.execute(OtelInstrumentedExecutorService.java:156)
	at org.apache.solr.core.CoreContainer.loadInternal(CoreContainer.java:985)
	at org.apache.solr.core.CoreContainer.load(CoreContainer.java:754)
	at org.apache.solr.util.TestHarness.<init>(TestHarness.java:171)
	at org.apache.solr.util.TestHarness.<init>(TestHarness.java:139)
	at org.apache.solr.util.TestHarness.<init>(TestHarness.java:147)
	at org.apache.solr.util.TestHarness.<init>(TestHarness.java:91)
	at org.apache.solr.SolrTestCaseJ4.createCore(SolrTestCaseJ4.java:706)
	at org.apache.solr.SolrTestCaseJ4.initCore(SolrTestCaseJ4.java:696)
	at org.apache.solr.SolrTestCaseJ4.initCore(SolrTestCaseJ4.java:559)
	at org.apache.solr.SolrTestCaseJ4.initCore(SolrTestCaseJ4.java:546)
	at org.apache.solr.update.SolrIndexFingerprintTest.beforeTests(SolrIndexFingerprintTest.java:32)
	at java.base/jdk.internal.reflect.DirectMethodHandleAccessor.invoke(DirectMethodHandleAccessor.java:103)
	at java.base/java.lang.reflect.Method.invoke(Method.java:580)
	at com.carrotsearch.randomizedtesting.RandomizedRunner.invoke(RandomizedRunner.java:1763)
	at com.carrotsearch.randomizedtesting.RandomizedRunner$6.evaluate(RandomizedRunner.java:886)
	at com.carrotsearch.randomizedtesting.RandomizedRunner$7.evaluate(RandomizedRunner.java:902)
	at com.carrotsearch.randomizedtesting.rules.StatementAdapter.evaluate(StatementAdapter.java:36)
	at com.carrotsearch.randomizedtesting.rules.StatementAdapter.evaluate(StatementAdapter.java:36)
	at org.apache.lucene.tests.util.AbstractBeforeAfterRule$1.evaluate(AbstractBeforeAfterRule.java:43)
	at com.carrotsearch.randomizedtesting.rules.SystemPropertiesRestoreRule$1.evaluate(SystemPropertiesRestoreRule.java:80)
	at org.junit.rules.RunRules.evaluate(RunRules.java:20)
	at org.apache.lucene.tests.util.AbstractBeforeAfterRule$1.evaluate(AbstractBeforeAfterRule.java:43)
	at com.carrotsearch.randomizedtesting.rules.StatementAdapter.evaluate(StatementAdapter.java:36)
	at org.apache.lucene.tests.util.TestRuleStoreClassName$1.evaluate(TestRuleStoreClassName.java:38)
	at com.carrotsearch.randomizedtesting.rules.NoShadowingOrOverridesOnMethodsRule$1.evaluate(NoShadowingOrOverridesOnMethodsRule.java:40)
	at com.carrotsearch.randomizedtesting.rules.NoShadowingOrOverridesOnMethodsRule$1.evaluate(NoShadowingOrOverridesOnMethodsRule.java:40)
	at com.carrotsearch.randomizedtesting.rules.StatementAdapter.evaluate(StatementAdapter.java:36)
	at com.carrotsearch.randomizedtesting.rules.StatementAdapter.evaluate(StatementAdapter.java:36)
	at org.apache.lucene.tests.util.TestRuleAssertionsRequired$1.evaluate(TestRuleAssertionsRequired.java:53)
	at org.apache.lucene.tests.util.AbstractBeforeAfterRule$1.evaluate(AbstractBeforeAfterRule.java:43)
	at org.apache.lucene.tests.util.TestRuleMarkFailure$1.evaluate(TestRuleMarkFailure.java:44)
	at org.apache.lucene.tests.util.TestRuleIgnoreAfterMaxFailures$1.evaluate(TestRuleIgnoreAfterMaxFailures.java:60)
	at org.apache.lucene.tests.util.TestRuleIgnoreTestSuites$1.evaluate(TestRuleIgnoreTestSuites.java:47)
	at org.junit.rules.RunRules.evaluate(RunRules.java:20)
	at com.carrotsearch.randomizedtesting.rules.StatementAdapter.evaluate(StatementAdapter.java:36)
	at com.carrotsearch.randomizedtesting.ThreadLeakControl$StatementRunner.run(ThreadLeakControl.java:390)
	at com.carrotsearch.randomizedtesting.ThreadLeakControl.lambda$forkTimeoutingTask$0(ThreadLeakControl.java:850)
	... 1 more

>
	at org.junit.Assert.fail(Assert.java:89)
	at org.junit.Assert.failNotNull(Assert.java:756)
	at org.junit.Assert.assertNull(Assert.java:738)
	at org.apache.solr.SolrTestCase$1.afterIfSuccessful(SolrTestCase.java:101)
	at com.carrotsearch.randomizedtesting.rules.TestRuleAdapter$1.afterIfSuccessful(TestRuleAdapter.java:36)
	at com.carrotsearch.randomizedtesting.rules.StatementAdapter.evaluate(StatementAdapter.java:37)
	at com.carrotsearch.randomizedtesting.rules.StatementAdapter.evaluate(StatementAdapter.java:36)
	at org.apache.lucene.tests.util.AbstractBeforeAfterRule$1.evaluate(AbstractBeforeAfterRule.java:43)
	at com.carrotsearch.randomizedtesting.rules.SystemPropertiesRestoreRule$1.evaluate(SystemPropertiesRestoreRule.java:80)
	at org.junit.rules.RunRules.evaluate(RunRules.java:20)
	at org.apache.lucene.tests.util.AbstractBeforeAfterRule$1.evaluate(AbstractBeforeAfterRule.java:43)
	at com.carrotsearch.randomizedtesting.rules.StatementAdapter.evaluate(StatementAdapter.java:36)
	at org.apache.lucene.tests.util.TestRuleStoreClassName$1.evaluate(TestRuleStoreClassName.java:38)
	at com.carrotsearch.randomizedtesting.rules.NoShadowingOrOverridesOnMethodsRule$1.evaluate(NoShadowingOrOverridesOnMethodsRule.java:40)
	at com.carrotsearch.randomizedtesting.rules.NoShadowingOrOverridesOnMethodsRule$1.evaluate(NoShadowingOrOverridesOnMethodsRule.java:40)
	at com.carrotsearch.randomizedtesting.rules.StatementAdapter.evaluate(StatementAdapter.java:36)
	at com.carrotsearch.randomizedtesting.rules.StatementAdapter.evaluate(StatementAdapter.java:36)
	at org.apache.lucene.tests.util.TestRuleAssertionsRequired$1.evaluate(TestRuleAssertionsRequired.java:53)
	at org.apache.lucene.tests.util.AbstractBeforeAfterRule$1.evaluate(AbstractBeforeAfterRule.java:43)
	at org.apache.lucene.tests.util.TestRuleMarkFailure$1.evaluate(TestRuleMarkFailure.java:44)
	at org.apache.lucene.tests.util.TestRuleIgnoreAfterMaxFailures$1.evaluate(TestRuleIgnoreAfterMaxFailures.java:60)
	at org.apache.lucene.tests.util.TestRuleIgnoreTestSuites$1.evaluate(TestRuleIgnoreTestSuites.java:47)
	at org.junit.rules.RunRules.evaluate(RunRules.java:20)
	at com.carrotsearch.randomizedtesting.rules.StatementAdapter.evaluate(StatementAdapter.java:36)
	at com.carrotsearch.randomizedtesting.ThreadLeakControl$StatementRunner.run(ThreadLeakControl.java:390)
	at com.carrotsearch.randomizedtesting.ThreadLeakControl.lambda$forkTimeoutingTask$0(ThreadLeakControl.java:850)
	at java.base/java.lang.Thread.run(Thread.java:1570)


FAILED:  org.apache.solr.update.SolrIndexFingerprintTest.classMethod

Error Message:
java.lang.AssertionError: ObjectTracker found 1 object(s) that were not released!!! [MockDirectoryWrapper]
org.apache.lucene.tests.store.MockDirectoryWrapper:org.apache.solr.common.util.ObjectReleaseTracker$ObjectTrackerException: org.apache.lucene.tests.store.MockDirectoryWrapper@702652681
	at org.apache.solr.common.util.ObjectReleaseTracker.track(ObjectReleaseTracker.java:57)
	at org.apache.solr.core.CachingDirectoryFactory.get(CachingDirectoryFactory.java:405)
	at org.apache.solr.update.SolrIndexWriter.create(SolrIndexWriter.java:115)
	at org.apache.solr.core.SolrCore.initIndex(SolrCore.java:914)
	at org.apache.solr.core.SolrCore.<init>(SolrCore.java:1136)
	at org.apache.solr.core.SolrCore.<init>(SolrCore.java:1064)
	at org.apache.solr.core.CoreContainer.createFromDescriptor(CoreContainer.java:1679)
	at org.apache.solr.core.CoreContainer.lambda$loadInternal$6(CoreContainer.java:996)
	at org.apache.solr.util.stats.OtelInstrumentedExecutorService$InstrumentedRunnable.run(OtelInstrumentedExecutorService.java:256)
	at org.apache.solr.common.util.ExecutorUtil$MDCAwareThreadPoolExecutor.lambda$execute$0(ExecutorUtil.java:381)
	at java.base/java.util.concurrent.ThreadPoolExecutor.runWorker(ThreadPoolExecutor.java:1144)
	at java.base/java.util.concurrent.ThreadPoolExecutor$Worker.run(ThreadPoolExecutor.java:642)
	at java.base/java.lang.Thread.run(Thread.java:1570)
Caused by: java.lang.Exception: Submitter stack trace
	at org.apache.solr.common.util.ExecutorUtil$MDCAwareThreadPoolExecutor.execute(ExecutorUtil.java:348)
	at org.apache.solr.util.stats.OtelInstrumentedExecutorService.execute(OtelInstrumentedExecutorService.java:156)
	at org.apache.solr.core.CoreContainer.loadInternal(CoreContainer.java:985)
	at org.apache.solr.core.CoreContainer.load(CoreContainer.java:754)
	at org.apache.solr.util.TestHarness.<init>(TestHarness.java:171)
	at org.apache.solr.util.TestHarness.<init>(TestHarness.java:139)
	at org.apache.solr.util.TestHarness.<init>(TestHarness.java:147)
	at org.apache.solr.util.TestHarness.<init>(TestHarness.java:91)
	at org.apache.solr.SolrTestCaseJ4.createCore(SolrTestCaseJ4.java:706)
	at org.apache.solr.SolrTestCaseJ4.initCore(SolrTestCaseJ4.java:696)
	at org.apache.solr.SolrTestCaseJ4.initCore(SolrTestCaseJ4.java:559)
	at org.apache.solr.SolrTestCaseJ4.initCore(SolrTestCaseJ4.java:546)
	at org.apache.solr.update.SolrIndexFingerprintTest.beforeTests(SolrIndexFingerprintTest.java:32)
	at java.base/jdk.internal.reflect.DirectMethodHandleAccessor.invoke(DirectMethodHandleAccessor.java:103)
	at java.base/java.lang.reflect.Method.invoke(Method.java:580)
	at com.carrotsearch.randomizedtesting.RandomizedRunner.invoke(RandomizedRunner.java:1763)
	at com.carrotsearch.randomizedtesting.RandomizedRunner$6.evaluate(RandomizedRunner.java:886)
	at com.carrotsearch.randomizedtesting.RandomizedRunner$7.evaluate(RandomizedRunner.java:902)
	at com.carrotsearch.randomizedtesting.rules.StatementAdapter.evaluate(StatementAdapter.java:36)
	at com.carrotsearch.randomizedtesting.rules.StatementAdapter.evaluate(StatementAdapter.java:36)
	at org.apache.lucene.tests.util.AbstractBeforeAfterRule$1.evaluate(AbstractBeforeAfterRule.java:43)
	at com.carrotsearch.randomizedtesting.rules.SystemPropertiesRestoreRule$1.evaluate(SystemPropertiesRestoreRule.java:80)
	at org.junit.rules.RunRules.evaluate(RunRules.java:20)
	at org.apache.lucene.tests.util.AbstractBeforeAfterRule$1.evaluate(AbstractBeforeAfterRule.java:43)
	at com.carrotsearch.randomizedtesting.rules.StatementAdapter.evaluate(StatementAdapter.java:36)
	at org.apache.lucene.tests.util.TestRuleStoreClassName$1.evaluate(TestRuleStoreClassName.java:38)
	at com.carrotsearch.randomizedtesting.rules.NoShadowingOrOverridesOnMethodsRule$1.evaluate(NoShadowingOrOverridesOnMethodsRule.java:40)
	at com.carrotsearch.randomizedtesting.rules.NoShadowingOrOverridesOnMethodsRule$1.evaluate(NoShadowingOrOverridesOnMethodsRule.java:40)
	at com.carrotsearch.randomizedtesting.rules.StatementAdapter.evaluate(StatementAdapter.java:36)
	at com.carrotsearch.randomizedtesting.rules.StatementAdapter.evaluate(StatementAdapter.java:36)
	at org.apache.lucene.tests.util.TestRuleAssertionsRequired$1.evaluate(TestRuleAssertionsRequired.java:53)
	at org.apache.lucene.tests.util.AbstractBeforeAfterRule$1.evaluate(AbstractBeforeAfterRule.java:43)
	at org.apache.lucene.tests.util.TestRuleMarkFailure$1.evaluate(TestRuleMarkFailure.java:44)
	at org.apache.lucene.tests.util.TestRuleIgnoreAfterMaxFailures$1.evaluate(TestRuleIgnoreAfterMaxFailures.java:60)
	at org.apache.lucene.tests.util.TestRuleIgnoreTestSuites$1.evaluate(TestRuleIgnoreTestSuites.java:47)
	at org.junit.rules.RunRules.evaluate(RunRules.java:20)
	at com.carrotsearch.randomizedtesting.rules.StatementAdapter.evaluate(StatementAdapter.java:36)
	at com.carrotsearch.randomizedtesting.ThreadLeakControl$StatementRunner.run(ThreadLeakControl.java:390)
	at com.carrotsearch.randomizedtesting.ThreadLeakControl.lambda$forkTimeoutingTask$0(ThreadLeakControl.java:850)
	... 1 more

 expected null, but was:<ObjectTracker found 1 object(s) that were not released!!! [MockDirectoryWrapper]
org.apache.lucene.tests.store.MockDirectoryWrapper:org.apache.solr.common.util.ObjectReleaseTracker$ObjectTrackerException: org.apache.lucene.tests.store.MockDirectoryWrapper@702652681
	at org.apache.solr.common.util.ObjectReleaseTracker.track(ObjectReleaseTracker.java:57)
	at org.apache.solr.core.CachingDirectoryFactory.get(CachingDirectoryFactory.java:405)
	at org.apache.solr.update.SolrIndexWriter.create(SolrIndexWriter.java:115)
	at org.apache.solr.core.SolrCore.initIndex(SolrCore.java:914)
	at org.apache.solr.core.SolrCore.<init>(SolrCore.java:1136)
	at org.apache.solr.core.SolrCore.<init>(SolrCore.java:1064)
	at org.apache.solr.core.CoreContainer.createFromDescriptor(CoreContainer.java:1679)
	at org.apache.solr.core.CoreContainer.lambda$loadInternal$6(CoreContainer.java:996)
	at org.apache.solr.util.stats.OtelInstrumentedExecutorService$InstrumentedRunnable.run(OtelInstrumentedExecutorService.java:256)
	at org.apache.solr.common.util.ExecutorUtil$MDCAwareThreadPoolExecutor.lambda$execute$0(ExecutorUtil.java:381)
	at java.base/java.util.concurrent.ThreadPoolExecutor.runWorker(ThreadPoolExecutor.java:1144)
	at java.base/java.util.concurrent.ThreadPoolExecutor$Worker.run(ThreadPoolExecutor.java:642)
	at java.base/java.lang.Thread.run(Thread.java:1570)
Caused by: java.lang.Exception: Submitter stack trace
	at org.apache.solr.common.util.ExecutorUtil$MDCAwareThreadPoolExecutor.execute(ExecutorUtil.java:348)
	at org.apache.solr.util.stats.OtelInstrumentedExecutorService.execute(OtelInstrumentedExecutorService.java:156)
	at org.apache.solr.core.CoreContainer.loadInternal(CoreContainer.java:985)
	at org.apache.solr.core.CoreContainer.load(CoreContainer.java:754)
	at org.apache.solr.util.TestHarness.<init>(TestHarness.java:171)
	at org.apache.solr.util.TestHarness.<init>(TestHarness.java:139)
	at org.apache.solr.util.TestHarness.<init>(TestHarness.java:147)
	at org.apache.solr.util.TestHarness.<init>(TestHarness.java:91)
	at org.apache.solr.SolrTestCaseJ4.createCore(SolrTestCaseJ4.java:706)
	at org.apache.solr.SolrTestCaseJ4.initCore(SolrTestCaseJ4.java:696)
	at org.apache.solr.SolrTestCaseJ4.initCore(SolrTestCaseJ4.java:559)
	at org.apache.solr.SolrTestCaseJ4.initCore(SolrTestCaseJ4.java:546)
	at org.apache.solr.update.SolrIndexFingerprintTest.beforeTests(SolrIndexFingerprintTest.java:32)
	at java.base/jdk.internal.reflect.DirectMethodHandleAccessor.invoke(DirectMethodHandleAccessor.java:103)
	at java.base/java.lang.reflect.Method.invoke(Method.java:580)
	at com.carrotsearch.randomizedtesting.RandomizedRunner.invoke(RandomizedRunner.java:1763)
	at com.carrotsearch.randomizedtesting.RandomizedRunner$6.evaluate(RandomizedRunner.java:886)
	at com.carrotsearch.randomizedtesting.RandomizedRunner$7.evaluate(RandomizedRunner.java:902)
	at com.carrotsearch.randomizedtesting.rules.StatementAdapter.evaluate(StatementAdapter.java:36)
	at com.carrotsearch.randomizedtesting.rules.StatementAdapter.evaluate(StatementAdapter.java:36)
	at org.apache.lucene.tests.util.AbstractBeforeAfterRule$1.evaluate(AbstractBeforeAfterRule.java:43)
	at com.carrotsearch.randomizedtesting.rules.SystemPropertiesRestoreRule$1.evaluate(SystemPropertiesRestoreRule.java:80)
	at org.junit.rules.RunRules.evaluate(RunRules.java:20)
	at org.apache.lucene.tests.util.AbstractBeforeAfterRule$1.evaluate(AbstractBeforeAfterRule.java:43)
	at com.carrotsearch.randomizedtesting.rules.StatementAdapter.evaluate(StatementAdapter.java:36)
	at org.apache.lucene.tests.util.TestRuleStoreClassName$1.evaluate(TestRuleStoreClassName.java:38)
	at com.carrotsearch.randomizedtesting.rules.NoShadowingOrOverridesOnMethodsRule$1.evaluate(NoShadowingOrOverridesOnMethodsRule.java:40)
	at com.carrotsearch.randomizedtesting.rules.NoShadowingOrOverridesOnMethodsRule$1.evaluate(NoShadowingOrOverridesOnMethodsRule.java:40)
	at com.carrotsearch.randomizedtesting.rules.StatementAdapter.evaluate(StatementAdapter.java:36)
	at com.carrotsearch.randomizedtesting.rules.StatementAdapter.evaluate(StatementAdapter.java:36)
	at org.apache.lucene.tests.util.TestRuleAssertionsRequired$1.evaluate(TestRuleAssertionsRequired.java:53)
	at org.apache.lucene.tests.util.AbstractBeforeAfterRule$1.evaluate(AbstractBeforeAfterRule.java:43)
	at org.apache.lucene.tests.util.TestRuleMarkFailure$1.evaluate(TestRuleMarkFailure.java:44)
	at org.apache.lucene.tests.util.TestRuleIgnoreAfterMaxFailures$1.evaluate(TestRuleIgnoreAfterMaxFailures.java:60)
	at org.apache.lucene.tests.util.TestRuleIgnoreTestSuites$1.evaluate(TestRuleIgnoreTestSuites.java:47)
	at org.junit.rules.RunRules.evaluate(RunRules.java:20)
	at com.carrotsearch.randomizedtesting.rules.StatementAdapter.evaluate(StatementAdapter.java:36)
	at com.carrotsearch.randomizedtesting.ThreadLeakControl$StatementRunner.run(ThreadLeakControl.java:390)
	at com.carrotsearch.randomizedtesting.ThreadLeakControl.lambda$forkTimeoutingTask$0(ThreadLeakControl.java:850)
	... 1 more

>

Stack Trace:
java.lang.AssertionError: ObjectTracker found 1 object(s) that were not released!!! [MockDirectoryWrapper]
org.apache.lucene.tests.store.MockDirectoryWrapper:org.apache.solr.common.util.ObjectReleaseTracker$ObjectTrackerException: org.apache.lucene.tests.store.MockDirectoryWrapper@702652681
	at org.apache.solr.common.util.ObjectReleaseTracker.track(ObjectReleaseTracker.java:57)
	at org.apache.solr.core.CachingDirectoryFactory.get(CachingDirectoryFactory.java:405)
	at org.apache.solr.update.SolrIndexWriter.create(SolrIndexWriter.java:115)
	at org.apache.solr.core.SolrCore.initIndex(SolrCore.java:914)
	at org.apache.solr.core.SolrCore.<init>(SolrCore.java:1136)
	at org.apache.solr.core.SolrCore.<init>(SolrCore.java:1064)
	at org.apache.solr.core.CoreContainer.createFromDescriptor(CoreContainer.java:1679)
	at org.apache.solr.core.CoreContainer.lambda$loadInternal$6(CoreContainer.java:996)
	at org.apache.solr.util.stats.OtelInstrumentedExecutorService$InstrumentedRunnable.run(OtelInstrumentedExecutorService.java:256)
	at org.apache.solr.common.util.ExecutorUtil$MDCAwareThreadPoolExecutor.lambda$execute$0(ExecutorUtil.java:381)
	at java.base/java.util.concurrent.ThreadPoolExecutor.runWorker(ThreadPoolExecutor.java:1144)
	at java.base/java.util.concurrent.ThreadPoolExecutor$Worker.run(ThreadPoolExecutor.java:642)
	at java.base/java.lang.Thread.run(Thread.java:1570)
Caused by: java.lang.Exception: Submitter stack trace
	at org.apache.solr.common.util.ExecutorUtil$MDCAwareThreadPoolExecutor.execute(ExecutorUtil.java:348)
	at org.apache.solr.util.stats.OtelInstrumentedExecutorService.execute(OtelInstrumentedExecutorService.java:156)
	at org.apache.solr.core.CoreContainer.loadInternal(CoreContainer.java:985)
	at org.apache.solr.core.CoreContainer.load(CoreContainer.java:754)
	at org.apache.solr.util.TestHarness.<init>(TestHarness.java:171)
	at org.apache.solr.util.TestHarness.<init>(TestHarness.java:139)
	at org.apache.solr.util.TestHarness.<init>(TestHarness.java:147)
	at org.apache.solr.util.TestHarness.<init>(TestHarness.java:91)
	at org.apache.solr.SolrTestCaseJ4.createCore(SolrTestCaseJ4.java:706)
	at org.apache.solr.SolrTestCaseJ4.initCore(SolrTestCaseJ4.java:696)
	at org.apache.solr.SolrTestCaseJ4.initCore(SolrTestCaseJ4.java:559)
	at org.apache.solr.SolrTestCaseJ4.initCore(SolrTestCaseJ4.java:546)
	at org.apache.solr.update.SolrIndexFingerprintTest.beforeTests(SolrIndexFingerprintTest.java:32)
	at java.base/jdk.internal.reflect.DirectMethodHandleAccessor.invoke(DirectMethodHandleAccessor.java:103)
	at java.base/java.lang.reflect.Method.invoke(Method.java:580)
	at com.carrotsearch.randomizedtesting.RandomizedRunner.invoke(RandomizedRunner.java:1763)
	at com.carrotsearch.randomizedtesting.RandomizedRunner$6.evaluate(RandomizedRunner.java:886)
	at com.carrotsearch.randomizedtesting.RandomizedRunner$7.evaluate(RandomizedRunner.java:902)
	at com.carrotsearch.randomizedtesting.rules.StatementAdapter.evaluate(StatementAdapter.java:36)
	at com.carrotsearch.randomizedtesting.rules.StatementAdapter.evaluate(StatementAdapter.java:36)
	at org.apache.lucene.tests.util.AbstractBeforeAfterRule$1.evaluate(AbstractBeforeAfterRule.java:43)
	at com.carrotsearch.randomizedtesting.rules.SystemPropertiesRestoreRule$1.evaluate(SystemPropertiesRestoreRule.java:80)
	at org.junit.rules.RunRules.evaluate(RunRules.java:20)
	at org.apache.lucene.tests.util.AbstractBeforeAfterRule$1.evaluate(AbstractBeforeAfterRule.java:43)
	at com.carrotsearch.randomizedtesting.rules.StatementAdapter.evaluate(StatementAdapter.java:36)
	at org.apache.lucene.tests.util.TestRuleStoreClassName$1.evaluate(TestRuleStoreClassName.java:38)
	at com.carrotsearch.randomizedtesting.rules.NoShadowingOrOverridesOnMethodsRule$1.evaluate(NoShadowingOrOverridesOnMethodsRule.java:40)
	at com.carrotsearch.randomizedtesting.rules.NoShadowingOrOverridesOnMethodsRule$1.evaluate(NoShadowingOrOverridesOnMethodsRule.java:40)
	at com.carrotsearch.randomizedtesting.rules.StatementAdapter.evaluate(StatementAdapter.java:36)
	at com.carrotsearch.randomizedtesting.rules.StatementAdapter.evaluate(StatementAdapter.java:36)
	at org.apache.lucene.tests.util.TestRuleAssertionsRequired$1.evaluate(TestRuleAssertionsRequired.java:53)
	at org.apache.lucene.tests.util.AbstractBeforeAfterRule$1.evaluate(AbstractBeforeAfterRule.java:43)
	at org.apache.lucene.tests.util.TestRuleMarkFailure$1.evaluate(TestRuleMarkFailure.java:44)
	at org.apache.lucene.tests.util.TestRuleIgnoreAfterMaxFailures$1.evaluate(TestRuleIgnoreAfterMaxFailures.java:60)
	at org.apache.lucene.tests.util.TestRuleIgnoreTestSuites$1.evaluate(TestRuleIgnoreTestSuites.java:47)
	at org.junit.rules.RunRules.evaluate(RunRules.java:20)
	at com.carrotsearch.randomizedtesting.rules.StatementAdapter.evaluate(StatementAdapter.java:36)
	at com.carrotsearch.randomizedtesting.ThreadLeakControl$StatementRunner.run(ThreadLeakControl.java:390)
	at com.carrotsearch.randomizedtesting.ThreadLeakControl.lambda$forkTimeoutingTask$0(ThreadLeakControl.java:850)
	... 1 more

 expected null, but was:<ObjectTracker found 1 object(s) that were not released!!! [MockDirectoryWrapper]
org.apache.lucene.tests.store.MockDirectoryWrapper:org.apache.solr.common.util.ObjectReleaseTracker$ObjectTrackerException: org.apache.lucene.tests.store.MockDirectoryWrapper@702652681
	at org.apache.solr.common.util.ObjectReleaseTracker.track(ObjectReleaseTracker.java:57)
	at org.apache.solr.core.CachingDirectoryFactory.get(CachingDirectoryFactory.java:405)
	at org.apache.solr.update.SolrIndexWriter.create(SolrIndexWriter.java:115)
	at org.apache.solr.core.SolrCore.initIndex(SolrCore.java:914)
	at org.apache.solr.core.SolrCore.<init>(SolrCore.java:1136)
	at org.apache.solr.core.SolrCore.<init>(SolrCore.java:1064)
	at org.apache.solr.core.CoreContainer.createFromDescriptor(CoreContainer.java:1679)
	at org.apache.solr.core.CoreContainer.lambda$loadInternal$6(CoreContainer.java:996)
	at org.apache.solr.util.stats.OtelInstrumentedExecutorService$InstrumentedRunnable.run(OtelInstrumentedExecutorService.java:256)
	at org.apache.solr.common.util.ExecutorUtil$MDCAwareThreadPoolExecutor.lambda$execute$0(ExecutorUtil.java:381)
	at java.base/java.util.concurrent.ThreadPoolExecutor.runWorker(ThreadPoolExecutor.java:1144)
	at java.base/java.util.concurrent.ThreadPoolExecutor$Worker.run(ThreadPoolExecutor.java:642)
	at java.base/java.lang.Thread.run(Thread.java:1570)
Caused by: java.lang.Exception: Submitter stack trace
	at org.apache.solr.common.util.ExecutorUtil$MDCAwareThreadPoolExecutor.execute(ExecutorUtil.java:348)
	at org.apache.solr.util.stats.OtelInstrumentedExecutorService.execute(OtelInstrumentedExecutorService.java:156)
	at org.apache.solr.core.CoreContainer.loadInternal(CoreContainer.java:985)
	at org.apache.solr.core.CoreContainer.load(CoreContainer.java:754)
	at org.apache.solr.util.TestHarness.<init>(TestHarness.java:171)
	at org.apache.solr.util.TestHarness.<init>(TestHarness.java:139)
	at org.apache.solr.util.TestHarness.<init>(TestHarness.java:147)
	at org.apache.solr.util.TestHarness.<init>(TestHarness.java:91)
	at org.apache.solr.SolrTestCaseJ4.createCore(SolrTestCaseJ4.java:706)
	at org.apache.solr.SolrTestCaseJ4.initCore(SolrTestCaseJ4.java:696)
	at org.apache.solr.SolrTestCaseJ4.initCore(SolrTestCaseJ4.java:559)
	at org.apache.solr.SolrTestCaseJ4.initCore(SolrTestCaseJ4.java:546)
	at org.apache.solr.update.SolrIndexFingerprintTest.beforeTests(SolrIndexFingerprintTest.java:32)
	at java.base/jdk.internal.reflect.DirectMethodHandleAccessor.invoke(DirectMethodHandleAccessor.java:103)
	at java.base/java.lang.reflect.Method.invoke(Method.java:580)
	at com.carrotsearch.randomizedtesting.RandomizedRunner.invoke(RandomizedRunner.java:1763)
	at com.carrotsearch.randomizedtesting.RandomizedRunner$6.evaluate(RandomizedRunner.java:886)
	at com.carrotsearch.randomizedtesting.RandomizedRunner$7.evaluate(RandomizedRunner.java:902)
	at com.carrotsearch.randomizedtesting.rules.StatementAdapter.evaluate(StatementAdapter.java:36)
	at com.carrotsearch.randomizedtesting.rules.StatementAdapter.evaluate(StatementAdapter.java:36)
	at org.apache.lucene.tests.util.AbstractBeforeAfterRule$1.evaluate(AbstractBeforeAfterRule.java:43)
	at com.carrotsearch.randomizedtesting.rules.SystemPropertiesRestoreRule$1.evaluate(SystemPropertiesRestoreRule.java:80)
	at org.junit.rules.RunRules.evaluate(RunRules.java:20)
	at org.apache.lucene.tests.util.AbstractBeforeAfterRule$1.evaluate(AbstractBeforeAfterRule.java:43)
	at com.carrotsearch.randomizedtesting.rules.StatementAdapter.evaluate(StatementAdapter.java:36)
	at org.apache.lucene.tests.util.TestRuleStoreClassName$1.evaluate(TestRuleStoreClassName.java:38)
	at com.carrotsearch.randomizedtesting.rules.NoShadowingOrOverridesOnMethodsRule$1.evaluate(NoShadowingOrOverridesOnMethodsRule.java:40)
	at com.carrotsearch.randomizedtesting.rules.NoShadowingOrOverridesOnMethodsRule$1.evaluate(NoShadowingOrOverridesOnMethodsRule.java:40)
	at com.carrotsearch.randomizedtesting.rules.StatementAdapter.evaluate(StatementAdapter.java:36)
	at com.carrotsearch.randomizedtesting.rules.StatementAdapter.evaluate(StatementAdapter.java:36)
	at org.apache.lucene.tests.util.TestRuleAssertionsRequired$1.evaluate(TestRuleAssertionsRequired.java:53)
	at org.apache.lucene.tests.util.AbstractBeforeAfterRule$1.evaluate(AbstractBeforeAfterRule.java:43)
	at org.apache.lucene.tests.util.TestRuleMarkFailure$1.evaluate(TestRuleMarkFailure.java:44)
	at org.apache.lucene.tests.util.TestRuleIgnoreAfterMaxFailures$1.evaluate(TestRuleIgnoreAfterMaxFailures.java:60)
	at org.apache.lucene.tests.util.TestRuleIgnoreTestSuites$1.evaluate(TestRuleIgnoreTestSuites.java:47)
	at org.junit.rules.RunRules.evaluate(RunRules.java:20)
	at com.carrotsearch.randomizedtesting.rules.StatementAdapter.evaluate(StatementAdapter.java:36)
	at com.carrotsearch.randomizedtesting.ThreadLeakControl$StatementRunner.run(ThreadLeakControl.java:390)
	at com.carrotsearch.randomizedtesting.ThreadLeakControl.lambda$forkTimeoutingTask$0(ThreadLeakControl.java:850)
	... 1 more

>
	at __randomizedtesting.SeedInfo.seed([D6A4D0A0AC73169F]:0)
	at org.junit.Assert.fail(Assert.java:89)
	at org.junit.Assert.failNotNull(Assert.java:756)
	at org.junit.Assert.assertNull(Assert.java:738)
	at org.apache.solr.SolrTestCase$1.afterIfSuccessful(SolrTestCase.java:101)
	at com.carrotsearch.randomizedtesting.rules.TestRuleAdapter$1.afterIfSuccessful(TestRuleAdapter.java:36)
	at com.carrotsearch.randomizedtesting.rules.StatementAdapter.evaluate(StatementAdapter.java:37)
	at com.carrotsearch.randomizedtesting.rules.StatementAdapter.evaluate(StatementAdapter.java:36)
	at org.apache.lucene.tests.util.AbstractBeforeAfterRule$1.evaluate(AbstractBeforeAfterRule.java:43)
	at com.carrotsearch.randomizedtesting.rules.SystemPropertiesRestoreRule$1.evaluate(SystemPropertiesRestoreRule.java:80)
	at org.junit.rules.RunRules.evaluate(RunRules.java:20)
	at org.apache.lucene.tests.util.AbstractBeforeAfterRule$1.evaluate(AbstractBeforeAfterRule.java:43)
	at com.carrotsearch.randomizedtesting.rules.StatementAdapter.evaluate(StatementAdapter.java:36)
	at org.apache.lucene.tests.util.TestRuleStoreClassName$1.evaluate(TestRuleStoreClassName.java:38)
	at com.carrotsearch.randomizedtesting.rules.NoShadowingOrOverridesOnMethodsRule$1.evaluate(NoShadowingOrOverridesOnMethodsRule.java:40)
	at com.carrotsearch.randomizedtesting.rules.NoShadowingOrOverridesOnMethodsRule$1.evaluate(NoShadowingOrOverridesOnMethodsRule.java:40)
	at com.carrotsearch.randomizedtesting.rules.StatementAdapter.evaluate(StatementAdapter.java:36)
	at com.carrotsearch.randomizedtesting.rules.StatementAdapter.evaluate(StatementAdapter.java:36)
	at org.apache.lucene.tests.util.TestRuleAssertionsRequired$1.evaluate(TestRuleAssertionsRequired.java:53)
	at org.apache.lucene.tests.util.AbstractBeforeAfterRule$1.evaluate(AbstractBeforeAfterRule.java:43)
	at org.apache.lucene.tests.util.TestRuleMarkFailure$1.evaluate(TestRuleMarkFailure.java:44)
	at org.apache.lucene.tests.util.TestRuleIgnoreAfterMaxFailures$1.evaluate(TestRuleIgnoreAfterMaxFailures.java:60)
	at org.apache.lucene.tests.util.TestRuleIgnoreTestSuites$1.evaluate(TestRuleIgnoreTestSuites.java:47)
	at org.junit.rules.RunRules.evaluate(RunRules.java:20)
	at com.carrotsearch.randomizedtesting.rules.StatementAdapter.evaluate(StatementAdapter.java:36)
	at com.carrotsearch.randomizedtesting.ThreadLeakControl$StatementRunner.run(ThreadLeakControl.java:390)
	at com.carrotsearch.randomizedtesting.ThreadLeakControl.lambda$forkTimeoutingTask$0(ThreadLeakControl.java:850)
	at java.base/java.lang.Thread.run(Thread.java:1570)


FAILED:  org.apache.solr.update.SolrIndexFingerprintTest.classMethod

Error Message:
com.carrotsearch.randomizedtesting.UncaughtExceptionError: Captured an uncaught exception in thread: Thread[id=45, name=h2sc-8-thread-1, state=RUNNABLE, group=TGRP-SolrIndexFingerprintTest]

Stack Trace:
com.carrotsearch.randomizedtesting.UncaughtExceptionError: Captured an uncaught exception in thread: Thread[id=45, name=h2sc-8-thread-1, state=RUNNABLE, group=TGRP-SolrIndexFingerprintTest]
Caused by: java.lang.OutOfMemoryError: Java heap space


FAILED:  org.apache.solr.update.SolrIndexFingerprintTest.classMethod

Error Message:
java.lang.AssertionError: 1

Stack Trace:
java.lang.AssertionError: 1
	at __randomizedtesting.SeedInfo.seed([D6A4D0A0AC73169F]:0)
	at org.apache.solr.core.CachingDirectoryFactory.close(CachingDirectoryFactory.java:199)
	at org.apache.solr.core.SolrCore.doClose(SolrCore.java:1916)
	at org.apache.solr.core.SolrCore.close(SolrCore.java:1778)
	at org.apache.solr.core.SolrCores.lambda$close$0(SolrCores.java:119)
	at org.apache.solr.common.util.ExecutorUtil$MDCAwareThreadPoolExecutor.lambda$execute$0(ExecutorUtil.java:381)
	at java.base/java.util.concurrent.ThreadPoolExecutor.runWorker(ThreadPoolExecutor.java:1144)
	at java.base/java.util.concurrent.ThreadPoolExecutor$Worker.run(ThreadPoolExecutor.java:642)
	at java.base/java.lang.Thread.run(Thread.java:1570)


FAILED:  org.apache.solr.update.SolrIndexFingerprintTest.classMethod

Error Message:
java.lang.OutOfMemoryError: Java heap space

Stack Trace:
java.lang.OutOfMemoryError: Java heap space
	at java.base/java.util.Arrays.copyOf(Arrays.java:3540)
	at java.base/java.lang.AbstractStringBuilder.ensureCapacityInternal(AbstractStringBuilder.java:245)
	at java.base/java.lang.AbstractStringBuilder.append(AbstractStringBuilder.java:590)
	at java.base/java.lang.StringBuffer.append(StringBuffer.java:313)
	at java.base/java.io.StringWriter.write(StringWriter.java:106)
	at java.base/java.io.PrintWriter.implNewLine(PrintWriter.java:657)
	at java.base/java.io.PrintWriter.newLine(PrintWriter.java:649)
	at java.base/java.io.PrintWriter.println(PrintWriter.java:808)
	at java.base/java.io.PrintWriter.println(PrintWriter.java:1034)
	at java.base/java.lang.Throwable$WrappedPrintWriter.println(Throwable.java:823)
	at java.base/java.lang.Throwable.lockedPrintStackTrace(Throwable.java:706)
	at java.base/java.lang.Throwable.printStackTrace(Throwable.java:695)
	at java.base/java.lang.Throwable.printStackTrace(Throwable.java:771)
	at org.apache.solr.common.util.ObjectReleaseTracker.checkEmpty(ObjectReleaseTracker.java:103)
	at org.apache.solr.common.util.ObjectReleaseTracker.clearObjectTrackerAndCheckEmpty(ObjectReleaseTracker.java:150)
	at org.apache.solr.SolrTestCase$1.afterIfSuccessful(SolrTestCase.java:100)
	at com.carrotsearch.randomizedtesting.rules.TestRuleAdapter$1.afterIfSuccessful(TestRuleAdapter.java:36)
	at com.carrotsearch.randomizedtesting.rules.StatementAdapter.evaluate(StatementAdapter.java:37)
	at com.carrotsearch.randomizedtesting.rules.StatementAdapter.evaluate(StatementAdapter.java:36)
	at org.apache.lucene.tests.util.AbstractBeforeAfterRule$1.evaluate(AbstractBeforeAfterRule.java:43)
	at com.carrotsearch.randomizedtesting.rules.SystemPropertiesRestoreRule$1.evaluate(SystemPropertiesRestoreRule.java:80)
	at org.junit.rules.RunRules.evaluate(RunRules.java:20)
	at org.apache.lucene.tests.util.AbstractBeforeAfterRule$1.evaluate(AbstractBeforeAfterRule.java:43)
	at com.carrotsearch.randomizedtesting.rules.StatementAdapter.evaluate(StatementAdapter.java:36)
	at org.apache.lucene.tests.util.TestRuleStoreClassName$1.evaluate(TestRuleStoreClassName.java:38)
	at com.carrotsearch.randomizedtesting.rules.NoShadowingOrOverridesOnMethodsRule$1.evaluate(NoShadowingOrOverridesOnMethodsRule.java:40)
	at com.carrotsearch.randomizedtesting.rules.NoShadowingOrOverridesOnMethodsRule$1.evaluate(NoShadowingOrOverridesOnMethodsRule.java:40)
	at com.carrotsearch.randomizedtesting.rules.StatementAdapter.evaluate(StatementAdapter.java:36)
	at com.carrotsearch.randomizedtesting.rules.StatementAdapter.evaluate(StatementAdapter.java:36)
	at org.apache.lucene.tests.util.TestRuleAssertionsRequired$1.evaluate(TestRuleAssertionsRequired.java:53)
	at org.apache.lucene.tests.util.AbstractBeforeAfterRule$1.evaluate(AbstractBeforeAfterRule.java:43)
	at org.apache.lucene.tests.util.TestRuleMarkFailure$1.evaluate(TestRuleMarkFailure.java:44)


FAILED:  org.apache.solr.update.SolrIndexFingerprintTest.testSequentialVsParallelFingerprint

Error Message:
java.lang.OutOfMemoryError: Java heap space

Stack Trace:
java.lang.OutOfMemoryError: Java heap space
	at __randomizedtesting.SeedInfo.seed([D6A4D0A0AC73169F:B6D1F324FAC1E482]:0)
	at java.base/java.util.HashMap.resize(HashMap.java:710)
	at java.base/java.util.HashMap.putVal(HashMap.java:669)
	at java.base/java.util.HashMap.put(HashMap.java:618)
	at java.base/java.util.HashSet.add(HashSet.java:229)
	at org.apache.lucene.index.ReaderPool.noDups(ReaderPool.java:450)
	at org.apache.lucene.index.ReaderPool.get(ReaderPool.java:427)
	at org.apache.lucene.index.IndexWriter.getPooledInstance(IndexWriter.java:6203)
	at org.apache.lucene.index.IndexWriter.openSegmentStates(IndexWriter.java:6510)
	at org.apache.lucene.index.IndexWriter.forceApply(IndexWriter.java:6284)
	at org.apache.lucene.index.IndexWriter.tryApply(IndexWriter.java:6218)
	at org.apache.lucene.index.IndexWriter.lambda$publishFrozenUpdates$12(IndexWriter.java:2839)
	at org.apache.lucene.index.IndexWriter$$Lambda/0x00007d2f5b7678d8.process(Unknown Source)
	at org.apache.lucene.index.IndexWriter$EventQueue.processEventsInternal(IndexWriter.java:339)
	at org.apache.lucene.index.IndexWriter$EventQueue.processEvents(IndexWriter.java:328)
	at org.apache.lucene.index.IndexWriter.processEvents(IndexWriter.java:6061)
	at org.apache.lucene.index.IndexWriter.prepareCommitInternal(IndexWriter.java:3724)
	at org.apache.lucene.index.IndexWriter.commitInternal(IndexWriter.java:4160)
	at org.apache.lucene.index.IndexWriter.commit(IndexWriter.java:4122)
	at org.apache.solr.update.DirectUpdateHandler2.commit(DirectUpdateHandler2.java:871)
	at org.apache.solr.update.processor.RunUpdateProcessorFactory$RunUpdateProcessor.processCommit(RunUpdateProcessorFactory.java:100)
	at org.apache.solr.update.processor.UpdateRequestProcessor.processCommit(UpdateRequestProcessor.java:66)
	at org.apache.solr.update.processor.UpdateRequestProcessor.processCommit(UpdateRequestProcessor.java:66)
	at org.apache.solr.update.processor.DistributedUpdateProcessor.doLocalCommit(DistributedUpdateProcessor.java:1174)
	at org.apache.solr.update.processor.DistributedUpdateProcessor.processCommit(DistributedUpdateProcessor.java:1160)
	at org.apache.solr.update.processor.LogUpdateProcessorFactory$LogUpdateProcessor.processCommit(LogUpdateProcessorFactory.java:173)
	at org.apache.solr.handler.loader.XMLLoader.processUpdate(XMLLoader.java:214)
	at org.apache.solr.handler.loader.XMLLoader.load(XMLLoader.java:120)
	at org.apache.solr.handler.UpdateRequestHandler$1.load(UpdateRequestHandler.java:101)
	at org.apache.solr.handler.ContentStreamHandlerBase.handleRequestBody(ContentStreamHandlerBase.java:99)
	at org.apache.solr.handler.RequestHandlerBase.handleRequest(RequestHandlerBase.java:251)
	at org.apache.solr.core.SolrCore.execute(SolrCore.java:2932)
	at org.apache.solr.client.solrj.embedded.EmbeddedSolrServer.request(EmbeddedSolrServer.java:228)


FAILED:  org.apache.solr.update.SolrIndexFingerprintTest.testSequentialVsParallelFingerprint

Error Message:
java.lang.OutOfMemoryError: Java heap space

Stack Trace:
java.lang.OutOfMemoryError: Java heap space
	at __randomizedtesting.SeedInfo.seed([D6A4D0A0AC73169F:B6D1F324FAC1E482]:0)
	at java.base/java.util.HashMap.newNode(HashMap.java:1909)
	at java.base/java.util.HashMap.putVal(HashMap.java:648)
	at java.base/java.util.HashMap.put(HashMap.java:618)
	at java.base/java.util.HashSet.add(HashSet.java:229)
	at org.apache.lucene.index.ReaderPool.noDups(ReaderPool.java:450)
	at org.apache.lucene.index.ReaderPool.get(ReaderPool.java:427)
	at org.apache.lucene.index.IndexWriter.getPooledInstance(IndexWriter.java:6203)
	at org.apache.lucene.index.IndexWriter.openSegmentStates(IndexWriter.java:6510)
	at org.apache.lucene.index.IndexWriter.forceApply(IndexWriter.java:6284)
	at org.apache.lucene.index.IndexWriter.tryApply(IndexWriter.java:6218)
	at org.apache.lucene.index.IndexWriter.lambda$publishFrozenUpdates$12(IndexWriter.java:2839)
	at org.apache.lucene.index.IndexWriter$$Lambda/0x0000751a777678d8.process(Unknown Source)
	at org.apache.lucene.index.IndexWriter$EventQueue.processEventsInternal(IndexWriter.java:339)
	at org.apache.lucene.index.IndexWriter$EventQueue.processEvents(IndexWriter.java:328)
	at org.apache.lucene.index.IndexWriter.processEvents(IndexWriter.java:6061)
	at org.apache.lucene.index.IndexWriter.prepareCommitInternal(IndexWriter.java:3724)
	at org.apache.lucene.index.IndexWriter.commitInternal(IndexWriter.java:4160)
	at org.apache.lucene.index.IndexWriter.commit(IndexWriter.java:4122)
	at org.apache.solr.update.DirectUpdateHandler2.commit(DirectUpdateHandler2.java:871)
	at org.apache.solr.update.processor.RunUpdateProcessorFactory$RunUpdateProcessor.processCommit(RunUpdateProcessorFactory.java:100)
	at org.apache.solr.update.processor.UpdateRequestProcessor.processCommit(UpdateRequestProcessor.java:66)
	at org.apache.solr.update.processor.UpdateRequestProcessor.processCommit(UpdateRequestProcessor.java:66)
	at org.apache.solr.update.processor.DistributedUpdateProcessor.doLocalCommit(DistributedUpdateProcessor.java:1174)
	at org.apache.solr.update.processor.DistributedUpdateProcessor.processCommit(DistributedUpdateProcessor.java:1160)
	at org.apache.solr.update.processor.LogUpdateProcessorFactory$LogUpdateProcessor.processCommit(LogUpdateProcessorFactory.java:173)
	at org.apache.solr.handler.loader.XMLLoader.processUpdate(XMLLoader.java:214)
	at org.apache.solr.handler.loader.XMLLoader.load(XMLLoader.java:120)
	at org.apache.solr.handler.UpdateRequestHandler$1.load(UpdateRequestHandler.java:101)
	at org.apache.solr.handler.ContentStreamHandlerBase.handleRequestBody(ContentStreamHandlerBase.java:99)
	at org.apache.solr.handler.RequestHandlerBase.handleRequest(RequestHandlerBase.java:251)
	at org.apache.solr.core.SolrCore.execute(SolrCore.java:2932)
	at org.apache.solr.client.solrj.embedded.EmbeddedSolrServer.request(EmbeddedSolrServer.java:228)


FAILED:  org.apache.solr.update.SolrIndexFingerprintTest.testSequentialVsParallelFingerprint

Error Message:
java.lang.OutOfMemoryError: Java heap space

Stack Trace:
java.lang.OutOfMemoryError: Java heap space
	at __randomizedtesting.SeedInfo.seed([D6A4D0A0AC73169F:B6D1F324FAC1E482]:0)
	at java.base/java.util.Collections$UnmodifiableMap$UnmodifiableEntrySet$1.next(Collections.java:1865)
	at java.base/java.util.Collections$UnmodifiableMap$UnmodifiableEntrySet$1.next(Collections.java:1858)
	at java.base/java.util.HashMap.putMapEntries(HashMap.java:519)
	at java.base/java.util.HashMap.<init>(HashMap.java:492)
	at org.apache.lucene.index.FieldInfo.putAttribute(FieldInfo.java:674)
	at org.apache.lucene.index.FieldInfos$Builder.lambda$add$0(FieldInfos.java:777)
	at org.apache.lucene.index.FieldInfos$Builder$$Lambda/0x0000746fdb795d40.accept(Unknown Source)
	at java.base/java.util.TreeMap.forEach(TreeMap.java:1319)
	at java.base/java.util.Collections$UnmodifiableMap.forEach(Collections.java:1708)
	at org.apache.lucene.index.FieldInfos$Builder.add(FieldInfos.java:777)
	at org.apache.lucene.index.FieldInfos$Builder.add(FieldInfos.java:747)
	at org.apache.lucene.index.FieldInfos.getMergedFieldInfos(FieldInfos.java:214)
	at org.apache.solr.index.SlowCompositeReaderWrapper.<init>(SlowCompositeReaderWrapper.java:120)
	at org.apache.solr.index.SlowCompositeReaderWrapper.wrap(SlowCompositeReaderWrapper.java:89)
	at org.apache.solr.search.SolrIndexSearcher.<init>(SolrIndexSearcher.java:399)
	at org.apache.solr.core.SolrCore.openNewSearcher(SolrCore.java:2417)
	at org.apache.solr.core.SolrCore.getSearcher(SolrCore.java:2626)
	at org.apache.solr.core.SolrCore.getSearcher(SolrCore.java:2315)
	at org.apache.solr.update.DirectUpdateHandler2.commit(DirectUpdateHandler2.java:900)
	at org.apache.solr.update.processor.RunUpdateProcessorFactory$RunUpdateProcessor.processCommit(RunUpdateProcessorFactory.java:100)
	at org.apache.solr.update.processor.UpdateRequestProcessor.processCommit(UpdateRequestProcessor.java:66)
	at org.apache.solr.update.processor.UpdateRequestProcessor.processCommit(UpdateRequestProcessor.java:66)
	at org.apache.solr.update.processor.DistributedUpdateProcessor.doLocalCommit(DistributedUpdateProcessor.java:1174)
	at org.apache.solr.update.processor.DistributedUpdateProcessor.processCommit(DistributedUpdateProcessor.java:1160)
	at org.apache.solr.update.processor.LogUpdateProcessorFactory$LogUpdateProcessor.processCommit(LogUpdateProcessorFactory.java:173)
	at org.apache.solr.handler.loader.XMLLoader.processUpdate(XMLLoader.java:214)
	at org.apache.solr.handler.loader.XMLLoader.load(XMLLoader.java:120)
	at org.apache.solr.handler.UpdateRequestHandler$1.load(UpdateRequestHandler.java:101)
	at org.apache.solr.handler.ContentStreamHandlerBase.handleRequestBody(ContentStreamHandlerBase.java:99)
	at org.apache.solr.handler.RequestHandlerBase.handleRequest(RequestHandlerBase.java:251)
	at org.apache.solr.core.SolrCore.execute(SolrCore.java:2932)
	at org.apache.solr.client.solrj.embedded.EmbeddedSolrServer.request(EmbeddedSolrServer.java:228)


FAILED:  org.apache.solr.update.SolrIndexFingerprintTest.testSequentialVsParallelFingerprint

Error Message:
java.lang.OutOfMemoryError: Java heap space

Stack Trace:
java.lang.OutOfMemoryError: Java heap space
	at __randomizedtesting.SeedInfo.seed([D6A4D0A0AC73169F:B6D1F324FAC1E482]:0)
	at java.base/java.util.HashMap.newNode(HashMap.java:1909)
	at java.base/java.util.HashMap.putVal(HashMap.java:637)
	at java.base/java.util.HashMap.put(HashMap.java:618)
	at java.base/java.util.HashSet.add(HashSet.java:229)
	at java.base/java.util.AbstractCollection.addAll(AbstractCollection.java:338)
	at java.base/java.util.HashSet.<init>(HashSet.java:121)
	at org.apache.lucene.index.SegmentCommitInfo.files(SegmentCommitInfo.java:241)
	at org.apache.lucene.index.IndexWriter.forceApply(IndexWriter.java:6279)
	at org.apache.lucene.index.IndexWriter.tryApply(IndexWriter.java:6218)
	at org.apache.lucene.index.IndexWriter.lambda$publishFrozenUpdates$12(IndexWriter.java:2839)
	at org.apache.lucene.index.IndexWriter$$Lambda/0x00007ced2f7ad618.process(Unknown Source)
	at org.apache.lucene.index.IndexWriter$EventQueue.processEventsInternal(IndexWriter.java:339)
	at org.apache.lucene.index.IndexWriter$EventQueue.processEvents(IndexWriter.java:328)
	at org.apache.lucene.index.IndexWriter.processEvents(IndexWriter.java:6061)
	at org.apache.lucene.index.IndexWriter.prepareCommitInternal(IndexWriter.java:3724)
	at org.apache.lucene.index.IndexWriter.commitInternal(IndexWriter.java:4160)
	at org.apache.lucene.index.IndexWriter.commit(IndexWriter.java:4122)
	at org.apache.solr.update.DirectUpdateHandler2.commit(DirectUpdateHandler2.java:871)
	at org.apache.solr.update.processor.RunUpdateProcessorFactory$RunUpdateProcessor.processCommit(RunUpdateProcessorFactory.java:100)
	at org.apache.solr.update.processor.UpdateRequestProcessor.processCommit(UpdateRequestProcessor.java:66)
	at org.apache.solr.update.processor.UpdateRequestProcessor.processCommit(UpdateRequestProcessor.java:66)
	at org.apache.solr.update.processor.DistributedUpdateProcessor.doLocalCommit(DistributedUpdateProcessor.java:1174)
	at org.apache.solr.update.processor.DistributedUpdateProcessor.processCommit(DistributedUpdateProcessor.java:1160)
	at org.apache.solr.update.processor.LogUpdateProcessorFactory$LogUpdateProcessor.processCommit(LogUpdateProcessorFactory.java:173)
	at org.apache.solr.handler.loader.XMLLoader.processUpdate(XMLLoader.java:214)
	at org.apache.solr.handler.loader.XMLLoader.load(XMLLoader.java:120)
	at org.apache.solr.handler.UpdateRequestHandler$1.load(UpdateRequestHandler.java:101)
	at org.apache.solr.handler.ContentStreamHandlerBase.handleRequestBody(ContentStreamHandlerBase.java:99)
	at org.apache.solr.handler.RequestHandlerBase.handleRequest(RequestHandlerBase.java:251)
	at org.apache.solr.core.SolrCore.execute(SolrCore.java:2932)
	at org.apache.solr.client.solrj.embedded.EmbeddedSolrServer.request(EmbeddedSolrServer.java:228)
	at org.apache.solr.client.solrj.SolrClient.request(SolrClient.java:1195)


FAILED:  org.apache.solr.update.TestInPlaceUpdatesDistrib.classMethod

Error Message:
com.carrotsearch.randomizedtesting.ThreadLeakError: There are still zombie threads that couldn't be terminated:
   1) Thread[id=21517, name=httpShardExecutor-13848-thread-2, state=TIMED_WAITING, group=TGRP-TestInPlaceUpdatesDistrib]
        at java.base/jdk.internal.misc.Unsafe.park(Native Method)
        at java.base/java.util.concurrent.locks.LockSupport.parkNanos(LockSupport.java:410)
        at java.base/java.util.concurrent.LinkedTransferQueue$DualNode.await(LinkedTransferQueue.java:452)
        at java.base/java.util.concurrent.SynchronousQueue$Transferer.xferLifo(SynchronousQueue.java:194)
        at java.base/java.util.concurrent.SynchronousQueue.xfer(SynchronousQueue.java:233)
        at java.base/java.util.concurrent.SynchronousQueue.poll(SynchronousQueue.java:336)
        at java.base/java.util.concurrent.ThreadPoolExecutor.getTask(ThreadPoolExecutor.java:1069)
        at java.base/java.util.concurrent.ThreadPoolExecutor.runWorker(ThreadPoolExecutor.java:1130)
        at java.base/java.util.concurrent.ThreadPoolExecutor$Worker.run(ThreadPoolExecutor.java:642)
        at java.base/java.lang.Thread.run(Thread.java:1570)
   2) Thread[id=21516, name=httpShardExecutor-13848-thread-1, state=TIMED_WAITING, group=TGRP-TestInPlaceUpdatesDistrib]
        at java.base/jdk.internal.misc.Unsafe.park(Native Method)
        at java.base/java.util.concurrent.locks.LockSupport.parkNanos(LockSupport.java:410)
        at java.base/java.util.concurrent.LinkedTransferQueue$DualNode.await(LinkedTransferQueue.java:452)
        at java.base/java.util.concurrent.SynchronousQueue$Transferer.xferLifo(SynchronousQueue.java:194)
        at java.base/java.util.concurrent.SynchronousQueue.xfer(SynchronousQueue.java:233)
        at java.base/java.util.concurrent.SynchronousQueue.poll(SynchronousQueue.java:336)
        at java.base/java.util.concurrent.ThreadPoolExecutor.getTask(ThreadPoolExecutor.java:1069)
        at java.base/java.util.concurrent.ThreadPoolExecutor.runWorker(ThreadPoolExecutor.java:1130)
        at java.base/java.util.concurrent.ThreadPoolExecutor$Worker.run(ThreadPoolExecutor.java:642)
        at java.base/java.lang.Thread.run(Thread.java:1570)

Stack Trace:
com.carrotsearch.randomizedtesting.ThreadLeakError: There are still zombie threads that couldn't be terminated:
   1) Thread[id=21517, name=httpShardExecutor-13848-thread-2, state=TIMED_WAITING, group=TGRP-TestInPlaceUpdatesDistrib]
        at java.base/jdk.internal.misc.Unsafe.park(Native Method)
        at java.base/java.util.concurrent.locks.LockSupport.parkNanos(LockSupport.java:410)
        at java.base/java.util.concurrent.LinkedTransferQueue$DualNode.await(LinkedTransferQueue.java:452)
        at java.base/java.util.concurrent.SynchronousQueue$Transferer.xferLifo(SynchronousQueue.java:194)
        at java.base/java.util.concurrent.SynchronousQueue.xfer(SynchronousQueue.java:233)
        at java.base/java.util.concurrent.SynchronousQueue.poll(SynchronousQueue.java:336)
        at java.base/java.util.concurrent.ThreadPoolExecutor.getTask(ThreadPoolExecutor.java:1069)
        at java.base/java.util.concurrent.ThreadPoolExecutor.runWorker(ThreadPoolExecutor.java:1130)
        at java.base/java.util.concurrent.ThreadPoolExecutor$Worker.run(ThreadPoolExecutor.java:642)
        at java.base/java.lang.Thread.run(Thread.java:1570)
   2) Thread[id=21516, name=httpShardExecutor-13848-thread-1, state=TIMED_WAITING, group=TGRP-TestInPlaceUpdatesDistrib]
        at java.base/jdk.internal.misc.Unsafe.park(Native Method)
        at java.base/java.util.concurrent.locks.LockSupport.parkNanos(LockSupport.java:410)
        at java.base/java.util.concurrent.LinkedTransferQueue$DualNode.await(LinkedTransferQueue.java:452)
        at java.base/java.util.concurrent.SynchronousQueue$Transferer.xferLifo(SynchronousQueue.java:194)
        at java.base/java.util.concurrent.SynchronousQueue.xfer(SynchronousQueue.java:233)
        at java.base/java.util.concurrent.SynchronousQueue.poll(SynchronousQueue.java:336)
        at java.base/java.util.concurrent.ThreadPoolExecutor.getTask(ThreadPoolExecutor.java:1069)
        at java.base/java.util.concurrent.ThreadPoolExecutor.runWorker(ThreadPoolExecutor.java:1130)
        at java.base/java.util.concurrent.ThreadPoolExecutor$Worker.run(ThreadPoolExecutor.java:642)
        at java.base/java.lang.Thread.run(Thread.java:1570)
	at __randomizedtesting.SeedInfo.seed([D6A4D0A0AC73169F]:0)


FAILED:  org.apache.solr.update.TestInPlaceUpdatesDistrib.classMethod

Error Message:
com.carrotsearch.randomizedtesting.ThreadLeakError: 2 threads leaked from SUITE scope at org.apache.solr.update.TestInPlaceUpdatesDistrib: 
   1) Thread[id=21517, name=httpShardExecutor-13848-thread-2, state=TIMED_WAITING, group=TGRP-TestInPlaceUpdatesDistrib]
        at java.base/jdk.internal.misc.Unsafe.park(Native Method)
        at java.base/java.util.concurrent.locks.LockSupport.parkNanos(LockSupport.java:410)
        at java.base/java.util.concurrent.LinkedTransferQueue$DualNode.await(LinkedTransferQueue.java:452)
        at java.base/java.util.concurrent.SynchronousQueue$Transferer.xferLifo(SynchronousQueue.java:194)
        at java.base/java.util.concurrent.SynchronousQueue.xfer(SynchronousQueue.java:233)
        at java.base/java.util.concurrent.SynchronousQueue.poll(SynchronousQueue.java:336)
        at java.base/java.util.concurrent.ThreadPoolExecutor.getTask(ThreadPoolExecutor.java:1069)
        at java.base/java.util.concurrent.ThreadPoolExecutor.runWorker(ThreadPoolExecutor.java:1130)
        at java.base/java.util.concurrent.ThreadPoolExecutor$Worker.run(ThreadPoolExecutor.java:642)
        at java.base/java.lang.Thread.run(Thread.java:1570)
   2) Thread[id=21516, name=httpShardExecutor-13848-thread-1, state=TIMED_WAITING, group=TGRP-TestInPlaceUpdatesDistrib]
        at java.base/jdk.internal.misc.Unsafe.park(Native Method)
        at java.base/java.util.concurrent.locks.LockSupport.parkNanos(LockSupport.java:410)
        at java.base/java.util.concurrent.LinkedTransferQueue$DualNode.await(LinkedTransferQueue.java:452)
        at java.base/java.util.concurrent.SynchronousQueue$Transferer.xferLifo(SynchronousQueue.java:194)
        at java.base/java.util.concurrent.SynchronousQueue.xfer(SynchronousQueue.java:233)
        at java.base/java.util.concurrent.SynchronousQueue.poll(SynchronousQueue.java:336)
        at java.base/java.util.concurrent.ThreadPoolExecutor.getTask(ThreadPoolExecutor.java:1069)
        at java.base/java.util.concurrent.ThreadPoolExecutor.runWorker(ThreadPoolExecutor.java:1130)
        at java.base/java.util.concurrent.ThreadPoolExecutor$Worker.run(ThreadPoolExecutor.java:642)
        at java.base/java.lang.Thread.run(Thread.java:1570)

Stack Trace:
com.carrotsearch.randomizedtesting.ThreadLeakError: 2 threads leaked from SUITE scope at org.apache.solr.update.TestInPlaceUpdatesDistrib: 
   1) Thread[id=21517, name=httpShardExecutor-13848-thread-2, state=TIMED_WAITING, group=TGRP-TestInPlaceUpdatesDistrib]
        at java.base/jdk.internal.misc.Unsafe.park(Native Method)
        at java.base/java.util.concurrent.locks.LockSupport.parkNanos(LockSupport.java:410)
        at java.base/java.util.concurrent.LinkedTransferQueue$DualNode.await(LinkedTransferQueue.java:452)
        at java.base/java.util.concurrent.SynchronousQueue$Transferer.xferLifo(SynchronousQueue.java:194)
        at java.base/java.util.concurrent.SynchronousQueue.xfer(SynchronousQueue.java:233)
        at java.base/java.util.concurrent.SynchronousQueue.poll(SynchronousQueue.java:336)
        at java.base/java.util.concurrent.ThreadPoolExecutor.getTask(ThreadPoolExecutor.java:1069)
        at java.base/java.util.concurrent.ThreadPoolExecutor.runWorker(ThreadPoolExecutor.java:1130)
        at java.base/java.util.concurrent.ThreadPoolExecutor$Worker.run(ThreadPoolExecutor.java:642)
        at java.base/java.lang.Thread.run(Thread.java:1570)
   2) Thread[id=21516, name=httpShardExecutor-13848-thread-1, state=TIMED_WAITING, group=TGRP-TestInPlaceUpdatesDistrib]
        at java.base/jdk.internal.misc.Unsafe.park(Native Method)
        at java.base/java.util.concurrent.locks.LockSupport.parkNanos(LockSupport.java:410)
        at java.base/java.util.concurrent.LinkedTransferQueue$DualNode.await(LinkedTransferQueue.java:452)
        at java.base/java.util.concurrent.SynchronousQueue$Transferer.xferLifo(SynchronousQueue.java:194)
        at java.base/java.util.concurrent.SynchronousQueue.xfer(SynchronousQueue.java:233)
        at java.base/java.util.concurrent.SynchronousQueue.poll(SynchronousQueue.java:336)
        at java.base/java.util.concurrent.ThreadPoolExecutor.getTask(ThreadPoolExecutor.java:1069)
        at java.base/java.util.concurrent.ThreadPoolExecutor.runWorker(ThreadPoolExecutor.java:1130)
        at java.base/java.util.concurrent.ThreadPoolExecutor$Worker.run(ThreadPoolExecutor.java:642)
        at java.base/java.lang.Thread.run(Thread.java:1570)
	at __randomizedtesting.SeedInfo.seed([D6A4D0A0AC73169F]:0)


FAILED:  org.apache.solr.update.TestInPlaceUpdatesDistrib.classMethod

Error Message:
java.lang.OutOfMemoryError: Java heap space

Stack Trace:
java.lang.OutOfMemoryError: Java heap space


FAILED:  org.apache.solr.update.TestInPlaceUpdatesDistrib.test

Error Message:
java.lang.OutOfMemoryError: Java heap space

Stack Trace:
java.lang.OutOfMemoryError: Java heap space