You are viewing a plain text version of this content. The canonical link for it is here.
Posted to builds@beam.apache.org by Apache Jenkins Server <je...@builds.apache.org> on 2023/11/11 14:32:48 UTC

Build failed in Jenkins: beam_PostCommit_Java_Nexmark_Dataflow_V2 #3559

See <https://ci-beam.apache.org/job/beam_PostCommit_Java_Nexmark_Dataflow_V2/3559/display/redirect>

Changes:


------------------------------------------
Started by timer
Running as SYSTEM
[EnvInject] - Loading node environment variables.
Building remotely on apache-beam-jenkins-11 (beam) in workspace <https://ci-beam.apache.org/job/beam_PostCommit_Java_Nexmark_Dataflow_V2/ws/>
The recommended git tool is: NONE
No credentials specified
Wiping out workspace first.
Cloning the remote Git repository
Using shallow clone with depth 1
Avoid fetching tags
Cloning repository https://github.com/apache/beam.git
 > git init <https://ci-beam.apache.org/job/beam_PostCommit_Java_Nexmark_Dataflow_V2/ws/src> # timeout=10
Fetching upstream changes from https://github.com/apache/beam.git
 > git --version # timeout=10
 > git --version # 'git version 2.25.1'
 > git fetch --no-tags --force --progress --depth=1 -- https://github.com/apache/beam.git +refs/heads/*:refs/remotes/origin/* # timeout=10
 > git config remote.origin.url https://github.com/apache/beam.git # timeout=10
 > git config --add remote.origin.fetch +refs/heads/*:refs/remotes/origin/* # timeout=10
 > git config remote.origin.url https://github.com/apache/beam.git # timeout=10
Using shallow fetch with depth 1
Fetching upstream changes from https://github.com/apache/beam.git
 > git fetch --no-tags --force --progress --depth=1 -- https://github.com/apache/beam.git +refs/heads/*:refs/remotes/origin/* +refs/pull/${ghprbPullId}/*:refs/remotes/origin/pr/${ghprbPullId}/* # timeout=10
 > git rev-parse origin/master^{commit} # timeout=10
Checking out Revision 39986e60ea367566da1f4a49d34a53f7ba75cf98 (origin/master)
 > git config core.sparsecheckout # timeout=10
 > git checkout -f 39986e60ea367566da1f4a49d34a53f7ba75cf98 # timeout=10
Commit message: "Update image tag pattern for RCs in release docs (#29406)"
 > git rev-list --no-walk 1e1c2a319f6e873070a2e848341555700706cc2a # timeout=10
First time build. Skipping changelog.
No emails were triggered.
[EnvInject] - Executing scripts and injecting environment variables after the SCM step.
[EnvInject] - Injecting as environment variables the properties content 
SETUPTOOLS_USE_DISTUTILS=stdlib
SPARK_LOCAL_IP=127.0.0.1

[EnvInject] - Variables injected successfully.
[beam_PostCommit_Java_Nexmark_Dataflow_V2] $ /bin/bash -xe /tmp/jenkins548357111145494607.sh
+ echo '*** RUN NEXMARK IN BATCH MODE USING DATAFLOW RUNNER with Java 8 ***'
*** RUN NEXMARK IN BATCH MODE USING DATAFLOW RUNNER with Java 8 ***
[Gradle] - Launching build.
[src] $ <https://ci-beam.apache.org/job/beam_PostCommit_Java_Nexmark_Dataflow_V2/ws/src/gradlew> --continue --max-****s=8 -Dorg.gradle.jvmargs=-Xms2g -Dorg.gradle.jvmargs=-Xmx6g -Dorg.gradle.vfs.watch=false -Pdocker-pull-licenses -Pnexmark.runner=:runners:google-cloud-dataflow-java '-Pnexmark.args=--manageResources=false --monitorJobs=true --bigQueryTable=nexmark --bigQueryDataset=nexmark --project=apache-beam-testing --resourceNameMode=QUERY_RUNNER_AND_MODE --exportSummaryToBigQuery=false --tempLocation=gs://temp-storage-for-perf-tests/nexmark --influxDatabase=beam_test_metrics --influxHost=http://10.128.0.96:8086 --baseInfluxMeasurement=nexmark --exportSummaryToInfluxDB=true --influxRetentionPolicy=forever --influxTags={"runnerVersion":"V2","javaVersion":"8"} --region=us-central1 --suite=STRESS --numWorkers=4 --maxNumWorkers=4 --autoscalingAlgorithm=NONE --nexmarkParallel=16 --enforceEncodability=true --enforceImmutability=true --runner=DataflowRunner --streaming=false' -Pnexmark.runner.version=V2 :sdks:java:testing:nexmark:run
To honour the JVM settings for this build a single-use Daemon process will be forked. For more on this, please refer to https://docs.gradle.org/8.4/userguide/gradle_daemon.html#sec:disabling_the_daemon in the Gradle documentation.
Daemon will be stopped at the end of the build 
Configuration on demand is an incubating feature.
Gradle Enterprise plugins resolution: https://plugins.gradle.org/m2
Enforcing Gradle Enterprise: https://ge.apache.org, allowUntrustedServer: false
> Task :buildSrc:compileJava NO-SOURCE
> Task :buildSrc:compileGroovy FROM-CACHE
> Task :buildSrc:pluginDescriptors
> Task :buildSrc:processResources
> Task :buildSrc:classes
> Task :buildSrc:jar

> Configure project :sdks:java:container:java8
docker-pull-licenses set, creating go-licenses

> Configure project :sdks:java:container:java11
docker-pull-licenses set, creating go-licenses
System Go installation: /snap/bin/go is go version go1.16.15 linux/amd64; Preparing to use /home/jenkins/go/bin/go1.21.4
/home/jenkins/go/pkg/mod/golang.org/dl@v0.0.0-20231107201224-8165dcd93058/go1.21.4/main.go:20:8: //go:build comment without // +build comment

FAILURE: Build failed with an exception.

* What went wrong:
Could not determine the dependencies of task ':sdks:java:container:goBuild'.
> Could not create task ':sdks:java:container:goPrepare'.
   > Process 'command 'sh'' finished with non-zero exit value 1

* Try:
> Run with --stacktrace option to get the stack trace.
> Run with --info or --debug option to get more log output.
> Get more help at https://help.gradle.org.

Deprecated Gradle features were used in this build, making it incompatible with Gradle 9.0.

You can use '--warning-mode all' to show the individual deprecation warnings and determine if they come from your own scripts or plugins.

For more on this, please refer to https://docs.gradle.org/8.4/userguide/command_line_interface.html#sec:command_line_warnings in the Gradle documentation.

BUILD FAILED in 22s
4 actionable tasks: 3 executed, 1 from cache

Publishing build scan...
https://ge.apache.org/s/ex62hzusc5hzu

Build step 'Invoke Gradle script' changed build result to FAILURE
Build step 'Invoke Gradle script' marked build as failure

---------------------------------------------------------------------
To unsubscribe, e-mail: builds-unsubscribe@beam.apache.org
For additional commands, e-mail: builds-help@beam.apache.org


Jenkins build is back to normal : beam_PostCommit_Java_Nexmark_Dataflow_V2 #3568

Posted by Apache Jenkins Server <je...@builds.apache.org>.
See <https://ci-beam.apache.org/job/beam_PostCommit_Java_Nexmark_Dataflow_V2/3568/display/redirect>


---------------------------------------------------------------------
To unsubscribe, e-mail: builds-unsubscribe@beam.apache.org
For additional commands, e-mail: builds-help@beam.apache.org


Build failed in Jenkins: beam_PostCommit_Java_Nexmark_Dataflow_V2 #3567

Posted by Apache Jenkins Server <je...@builds.apache.org>.
See <https://ci-beam.apache.org/job/beam_PostCommit_Java_Nexmark_Dataflow_V2/3567/display/redirect>

Changes:


------------------------------------------
Started by timer
Running as SYSTEM
[EnvInject] - Loading node environment variables.
Building remotely on apache-beam-jenkins-11 (beam) in workspace <https://ci-beam.apache.org/job/beam_PostCommit_Java_Nexmark_Dataflow_V2/ws/>
The recommended git tool is: NONE
No credentials specified
Wiping out workspace first.
Cloning the remote Git repository
Using shallow clone with depth 1
Avoid fetching tags
Cloning repository https://github.com/apache/beam.git
 > git init <https://ci-beam.apache.org/job/beam_PostCommit_Java_Nexmark_Dataflow_V2/ws/src> # timeout=10
Fetching upstream changes from https://github.com/apache/beam.git
 > git --version # timeout=10
 > git --version # 'git version 2.25.1'
 > git fetch --no-tags --force --progress --depth=1 -- https://github.com/apache/beam.git +refs/heads/*:refs/remotes/origin/* # timeout=10
 > git config remote.origin.url https://github.com/apache/beam.git # timeout=10
 > git config --add remote.origin.fetch +refs/heads/*:refs/remotes/origin/* # timeout=10
 > git config remote.origin.url https://github.com/apache/beam.git # timeout=10
Using shallow fetch with depth 1
Fetching upstream changes from https://github.com/apache/beam.git
 > git fetch --no-tags --force --progress --depth=1 -- https://github.com/apache/beam.git +refs/heads/*:refs/remotes/origin/* +refs/pull/${ghprbPullId}/*:refs/remotes/origin/pr/${ghprbPullId}/* # timeout=10
 > git rev-parse origin/master^{commit} # timeout=10
Checking out Revision 8fa5b19f5468c716e16c688994b538cc2abd3811 (origin/master)
 > git config core.sparsecheckout # timeout=10
 > git checkout -f 8fa5b19f5468c716e16c688994b538cc2abd3811 # timeout=10
Commit message: "Add getters to CheckResult in IT framework (#29411)"
 > git rev-list --no-walk 8fa5b19f5468c716e16c688994b538cc2abd3811 # timeout=10
No emails were triggered.
[EnvInject] - Executing scripts and injecting environment variables after the SCM step.
[EnvInject] - Injecting as environment variables the properties content 
SETUPTOOLS_USE_DISTUTILS=stdlib
SPARK_LOCAL_IP=127.0.0.1

[EnvInject] - Variables injected successfully.
[beam_PostCommit_Java_Nexmark_Dataflow_V2] $ /bin/bash -xe /tmp/jenkins16750217152880551623.sh
+ echo '*** RUN NEXMARK IN BATCH MODE USING DATAFLOW RUNNER with Java 8 ***'
*** RUN NEXMARK IN BATCH MODE USING DATAFLOW RUNNER with Java 8 ***
[Gradle] - Launching build.
[src] $ <https://ci-beam.apache.org/job/beam_PostCommit_Java_Nexmark_Dataflow_V2/ws/src/gradlew> --continue --max-****s=8 -Dorg.gradle.jvmargs=-Xms2g -Dorg.gradle.jvmargs=-Xmx6g -Dorg.gradle.vfs.watch=false -Pdocker-pull-licenses -Pnexmark.runner=:runners:google-cloud-dataflow-java '-Pnexmark.args=--manageResources=false --monitorJobs=true --bigQueryTable=nexmark --bigQueryDataset=nexmark --project=apache-beam-testing --resourceNameMode=QUERY_RUNNER_AND_MODE --exportSummaryToBigQuery=false --tempLocation=gs://temp-storage-for-perf-tests/nexmark --influxDatabase=beam_test_metrics --influxHost=http://10.128.0.96:8086 --baseInfluxMeasurement=nexmark --exportSummaryToInfluxDB=true --influxRetentionPolicy=forever --influxTags={"runnerVersion":"V2","javaVersion":"8"} --region=us-central1 --suite=STRESS --numWorkers=4 --maxNumWorkers=4 --autoscalingAlgorithm=NONE --nexmarkParallel=16 --enforceEncodability=true --enforceImmutability=true --runner=DataflowRunner --streaming=false' -Pnexmark.runner.version=V2 :sdks:java:testing:nexmark:run
To honour the JVM settings for this build a single-use Daemon process will be forked. For more on this, please refer to https://docs.gradle.org/8.4/userguide/gradle_daemon.html#sec:disabling_the_daemon in the Gradle documentation.
Daemon will be stopped at the end of the build 
Configuration on demand is an incubating feature.
Gradle Enterprise plugins resolution: https://plugins.gradle.org/m2
Enforcing Gradle Enterprise: https://ge.apache.org, allowUntrustedServer: false
> Task :buildSrc:compileJava NO-SOURCE
> Task :buildSrc:compileGroovy FROM-CACHE
> Task :buildSrc:pluginDescriptors
> Task :buildSrc:processResources
> Task :buildSrc:classes
> Task :buildSrc:jar

> Configure project :sdks:java:container:java8
docker-pull-licenses set, creating go-licenses

> Configure project :sdks:java:container:java11
docker-pull-licenses set, creating go-licenses
System Go installation: /snap/bin/go is go version go1.16.15 linux/amd64; Preparing to use /home/jenkins/go/bin/go1.21.4
/home/jenkins/go/pkg/mod/golang.org/dl@v0.0.0-20231107201224-8165dcd93058/go1.21.4/main.go:20:8: //go:build comment without // +build comment

FAILURE: Build failed with an exception.

* What went wrong:
Could not determine the dependencies of task ':sdks:java:container:goBuild'.
> Could not create task ':sdks:java:container:goPrepare'.
   > Process 'command 'sh'' finished with non-zero exit value 1

* Try:
> Run with --stacktrace option to get the stack trace.
> Run with --info or --debug option to get more log output.
> Get more help at https://help.gradle.org.

Deprecated Gradle features were used in this build, making it incompatible with Gradle 9.0.

You can use '--warning-mode all' to show the individual deprecation warnings and determine if they come from your own scripts or plugins.

For more on this, please refer to https://docs.gradle.org/8.4/userguide/command_line_interface.html#sec:command_line_warnings in the Gradle documentation.

BUILD FAILED in 20s
4 actionable tasks: 3 executed, 1 from cache

Publishing build scan...
https://ge.apache.org/s/b3twnr2pk6ie6

Build step 'Invoke Gradle script' changed build result to FAILURE
Build step 'Invoke Gradle script' marked build as failure

---------------------------------------------------------------------
To unsubscribe, e-mail: builds-unsubscribe@beam.apache.org
For additional commands, e-mail: builds-help@beam.apache.org


Build failed in Jenkins: beam_PostCommit_Java_Nexmark_Dataflow_V2 #3566

Posted by Apache Jenkins Server <je...@builds.apache.org>.
See <https://ci-beam.apache.org/job/beam_PostCommit_Java_Nexmark_Dataflow_V2/3566/display/redirect?page=changes>

Changes:

[noreply] Add getters to CheckResult in IT framework (#29411)


------------------------------------------
Started by timer
Running as SYSTEM
[EnvInject] - Loading node environment variables.
Building remotely on apache-beam-jenkins-11 (beam) in workspace <https://ci-beam.apache.org/job/beam_PostCommit_Java_Nexmark_Dataflow_V2/ws/>
The recommended git tool is: NONE
No credentials specified
Wiping out workspace first.
Cloning the remote Git repository
Using shallow clone with depth 1
Avoid fetching tags
Cloning repository https://github.com/apache/beam.git
 > git init <https://ci-beam.apache.org/job/beam_PostCommit_Java_Nexmark_Dataflow_V2/ws/src> # timeout=10
Fetching upstream changes from https://github.com/apache/beam.git
 > git --version # timeout=10
 > git --version # 'git version 2.25.1'
 > git fetch --no-tags --force --progress --depth=1 -- https://github.com/apache/beam.git +refs/heads/*:refs/remotes/origin/* # timeout=10
 > git config remote.origin.url https://github.com/apache/beam.git # timeout=10
 > git config --add remote.origin.fetch +refs/heads/*:refs/remotes/origin/* # timeout=10
 > git config remote.origin.url https://github.com/apache/beam.git # timeout=10
Using shallow fetch with depth 1
Fetching upstream changes from https://github.com/apache/beam.git
 > git fetch --no-tags --force --progress --depth=1 -- https://github.com/apache/beam.git +refs/heads/*:refs/remotes/origin/* +refs/pull/${ghprbPullId}/*:refs/remotes/origin/pr/${ghprbPullId}/* # timeout=10
 > git rev-parse origin/master^{commit} # timeout=10
Checking out Revision 8fa5b19f5468c716e16c688994b538cc2abd3811 (origin/master)
 > git config core.sparsecheckout # timeout=10
 > git checkout -f 8fa5b19f5468c716e16c688994b538cc2abd3811 # timeout=10
Commit message: "Add getters to CheckResult in IT framework (#29411)"
 > git rev-list --no-walk 2ad459113134dfffd3caeeb15e821bb644e08663 # timeout=10
No emails were triggered.
[EnvInject] - Executing scripts and injecting environment variables after the SCM step.
[EnvInject] - Injecting as environment variables the properties content 
SETUPTOOLS_USE_DISTUTILS=stdlib
SPARK_LOCAL_IP=127.0.0.1

[EnvInject] - Variables injected successfully.
[beam_PostCommit_Java_Nexmark_Dataflow_V2] $ /bin/bash -xe /tmp/jenkins18403229914300247272.sh
+ echo '*** RUN NEXMARK IN BATCH MODE USING DATAFLOW RUNNER with Java 8 ***'
*** RUN NEXMARK IN BATCH MODE USING DATAFLOW RUNNER with Java 8 ***
[Gradle] - Launching build.
[src] $ <https://ci-beam.apache.org/job/beam_PostCommit_Java_Nexmark_Dataflow_V2/ws/src/gradlew> --continue --max-****s=8 -Dorg.gradle.jvmargs=-Xms2g -Dorg.gradle.jvmargs=-Xmx6g -Dorg.gradle.vfs.watch=false -Pdocker-pull-licenses -Pnexmark.runner=:runners:google-cloud-dataflow-java '-Pnexmark.args=--manageResources=false --monitorJobs=true --bigQueryTable=nexmark --bigQueryDataset=nexmark --project=apache-beam-testing --resourceNameMode=QUERY_RUNNER_AND_MODE --exportSummaryToBigQuery=false --tempLocation=gs://temp-storage-for-perf-tests/nexmark --influxDatabase=beam_test_metrics --influxHost=http://10.128.0.96:8086 --baseInfluxMeasurement=nexmark --exportSummaryToInfluxDB=true --influxRetentionPolicy=forever --influxTags={"runnerVersion":"V2","javaVersion":"8"} --region=us-central1 --suite=STRESS --numWorkers=4 --maxNumWorkers=4 --autoscalingAlgorithm=NONE --nexmarkParallel=16 --enforceEncodability=true --enforceImmutability=true --runner=DataflowRunner --streaming=false' -Pnexmark.runner.version=V2 :sdks:java:testing:nexmark:run
To honour the JVM settings for this build a single-use Daemon process will be forked. For more on this, please refer to https://docs.gradle.org/8.4/userguide/gradle_daemon.html#sec:disabling_the_daemon in the Gradle documentation.
Daemon will be stopped at the end of the build 
Configuration on demand is an incubating feature.
Gradle Enterprise plugins resolution: https://plugins.gradle.org/m2
Enforcing Gradle Enterprise: https://ge.apache.org, allowUntrustedServer: false
> Task :buildSrc:compileJava NO-SOURCE
> Task :buildSrc:compileGroovy FROM-CACHE
> Task :buildSrc:pluginDescriptors
> Task :buildSrc:processResources
> Task :buildSrc:classes
> Task :buildSrc:jar

> Configure project :sdks:java:container:java8
docker-pull-licenses set, creating go-licenses

> Configure project :sdks:java:container:java11
docker-pull-licenses set, creating go-licenses
System Go installation: /snap/bin/go is go version go1.16.15 linux/amd64; Preparing to use /home/jenkins/go/bin/go1.21.4
/home/jenkins/go/pkg/mod/golang.org/dl@v0.0.0-20231107201224-8165dcd93058/go1.21.4/main.go:20:8: //go:build comment without // +build comment

FAILURE: Build failed with an exception.

* What went wrong:
Could not determine the dependencies of task ':sdks:java:container:goBuild'.
> Could not create task ':sdks:java:container:goPrepare'.
   > Process 'command 'sh'' finished with non-zero exit value 1

* Try:
> Run with --stacktrace option to get the stack trace.
> Run with --info or --debug option to get more log output.
> Get more help at https://help.gradle.org.

Deprecated Gradle features were used in this build, making it incompatible with Gradle 9.0.

You can use '--warning-mode all' to show the individual deprecation warnings and determine if they come from your own scripts or plugins.

For more on this, please refer to https://docs.gradle.org/8.4/userguide/command_line_interface.html#sec:command_line_warnings in the Gradle documentation.

BUILD FAILED in 21s
4 actionable tasks: 3 executed, 1 from cache

Publishing build scan...
https://ge.apache.org/s/e2mbsbdo64csk

Build step 'Invoke Gradle script' changed build result to FAILURE
Build step 'Invoke Gradle script' marked build as failure

---------------------------------------------------------------------
To unsubscribe, e-mail: builds-unsubscribe@beam.apache.org
For additional commands, e-mail: builds-help@beam.apache.org


Build failed in Jenkins: beam_PostCommit_Java_Nexmark_Dataflow_V2 #3565

Posted by Apache Jenkins Server <je...@builds.apache.org>.
See <https://ci-beam.apache.org/job/beam_PostCommit_Java_Nexmark_Dataflow_V2/3565/display/redirect>

Changes:


------------------------------------------
Started by timer
Running as SYSTEM
[EnvInject] - Loading node environment variables.
Building remotely on apache-beam-jenkins-11 (beam) in workspace <https://ci-beam.apache.org/job/beam_PostCommit_Java_Nexmark_Dataflow_V2/ws/>
The recommended git tool is: NONE
No credentials specified
Wiping out workspace first.
Cloning the remote Git repository
Using shallow clone with depth 1
Avoid fetching tags
Cloning repository https://github.com/apache/beam.git
 > git init <https://ci-beam.apache.org/job/beam_PostCommit_Java_Nexmark_Dataflow_V2/ws/src> # timeout=10
Fetching upstream changes from https://github.com/apache/beam.git
 > git --version # timeout=10
 > git --version # 'git version 2.25.1'
 > git fetch --no-tags --force --progress --depth=1 -- https://github.com/apache/beam.git +refs/heads/*:refs/remotes/origin/* # timeout=10
 > git config remote.origin.url https://github.com/apache/beam.git # timeout=10
 > git config --add remote.origin.fetch +refs/heads/*:refs/remotes/origin/* # timeout=10
 > git config remote.origin.url https://github.com/apache/beam.git # timeout=10
Using shallow fetch with depth 1
Fetching upstream changes from https://github.com/apache/beam.git
 > git fetch --no-tags --force --progress --depth=1 -- https://github.com/apache/beam.git +refs/heads/*:refs/remotes/origin/* +refs/pull/${ghprbPullId}/*:refs/remotes/origin/pr/${ghprbPullId}/* # timeout=10
 > git rev-parse origin/master^{commit} # timeout=10
Checking out Revision 2ad459113134dfffd3caeeb15e821bb644e08663 (origin/master)
 > git config core.sparsecheckout # timeout=10
 > git checkout -f 2ad459113134dfffd3caeeb15e821bb644e08663 # timeout=10
Commit message: "[YAML] - Kafka Read and Write proto (#29368)"
 > git rev-list --no-walk 2ad459113134dfffd3caeeb15e821bb644e08663 # timeout=10
No emails were triggered.
[EnvInject] - Executing scripts and injecting environment variables after the SCM step.
[EnvInject] - Injecting as environment variables the properties content 
SETUPTOOLS_USE_DISTUTILS=stdlib
SPARK_LOCAL_IP=127.0.0.1

[EnvInject] - Variables injected successfully.
[beam_PostCommit_Java_Nexmark_Dataflow_V2] $ /bin/bash -xe /tmp/jenkins5075961456909481734.sh
+ echo '*** RUN NEXMARK IN BATCH MODE USING DATAFLOW RUNNER with Java 8 ***'
*** RUN NEXMARK IN BATCH MODE USING DATAFLOW RUNNER with Java 8 ***
[Gradle] - Launching build.
[src] $ <https://ci-beam.apache.org/job/beam_PostCommit_Java_Nexmark_Dataflow_V2/ws/src/gradlew> --continue --max-****s=8 -Dorg.gradle.jvmargs=-Xms2g -Dorg.gradle.jvmargs=-Xmx6g -Dorg.gradle.vfs.watch=false -Pdocker-pull-licenses -Pnexmark.runner=:runners:google-cloud-dataflow-java '-Pnexmark.args=--manageResources=false --monitorJobs=true --bigQueryTable=nexmark --bigQueryDataset=nexmark --project=apache-beam-testing --resourceNameMode=QUERY_RUNNER_AND_MODE --exportSummaryToBigQuery=false --tempLocation=gs://temp-storage-for-perf-tests/nexmark --influxDatabase=beam_test_metrics --influxHost=http://10.128.0.96:8086 --baseInfluxMeasurement=nexmark --exportSummaryToInfluxDB=true --influxRetentionPolicy=forever --influxTags={"runnerVersion":"V2","javaVersion":"8"} --region=us-central1 --suite=STRESS --numWorkers=4 --maxNumWorkers=4 --autoscalingAlgorithm=NONE --nexmarkParallel=16 --enforceEncodability=true --enforceImmutability=true --runner=DataflowRunner --streaming=false' -Pnexmark.runner.version=V2 :sdks:java:testing:nexmark:run
To honour the JVM settings for this build a single-use Daemon process will be forked. For more on this, please refer to https://docs.gradle.org/8.4/userguide/gradle_daemon.html#sec:disabling_the_daemon in the Gradle documentation.
Daemon will be stopped at the end of the build 
Configuration on demand is an incubating feature.
Gradle Enterprise plugins resolution: https://plugins.gradle.org/m2
Enforcing Gradle Enterprise: https://ge.apache.org, allowUntrustedServer: false
> Task :buildSrc:compileJava NO-SOURCE
> Task :buildSrc:compileGroovy FROM-CACHE
> Task :buildSrc:pluginDescriptors
> Task :buildSrc:processResources
> Task :buildSrc:classes
> Task :buildSrc:jar

> Configure project :sdks:java:container:java8
docker-pull-licenses set, creating go-licenses

> Configure project :sdks:java:container:java11
docker-pull-licenses set, creating go-licenses
System Go installation: /snap/bin/go is go version go1.16.15 linux/amd64; Preparing to use /home/jenkins/go/bin/go1.21.4
/home/jenkins/go/pkg/mod/golang.org/dl@v0.0.0-20231107201224-8165dcd93058/go1.21.4/main.go:20:8: //go:build comment without // +build comment

FAILURE: Build failed with an exception.

* What went wrong:
Could not determine the dependencies of task ':sdks:java:container:goBuild'.
> Could not create task ':sdks:java:container:goPrepare'.
   > Process 'command 'sh'' finished with non-zero exit value 1

* Try:
> Run with --stacktrace option to get the stack trace.
> Run with --info or --debug option to get more log output.
> Get more help at https://help.gradle.org.

Deprecated Gradle features were used in this build, making it incompatible with Gradle 9.0.

You can use '--warning-mode all' to show the individual deprecation warnings and determine if they come from your own scripts or plugins.

For more on this, please refer to https://docs.gradle.org/8.4/userguide/command_line_interface.html#sec:command_line_warnings in the Gradle documentation.

BUILD FAILED in 20s
4 actionable tasks: 3 executed, 1 from cache

Publishing build scan...
https://ge.apache.org/s/rgydd6whcwcau

Build step 'Invoke Gradle script' changed build result to FAILURE
Build step 'Invoke Gradle script' marked build as failure

---------------------------------------------------------------------
To unsubscribe, e-mail: builds-unsubscribe@beam.apache.org
For additional commands, e-mail: builds-help@beam.apache.org


Build failed in Jenkins: beam_PostCommit_Java_Nexmark_Dataflow_V2 #3564

Posted by Apache Jenkins Server <je...@builds.apache.org>.
See <https://ci-beam.apache.org/job/beam_PostCommit_Java_Nexmark_Dataflow_V2/3564/display/redirect>

Changes:


------------------------------------------
Started by timer
Running as SYSTEM
[EnvInject] - Loading node environment variables.
Building remotely on apache-beam-jenkins-11 (beam) in workspace <https://ci-beam.apache.org/job/beam_PostCommit_Java_Nexmark_Dataflow_V2/ws/>
The recommended git tool is: NONE
No credentials specified
Wiping out workspace first.
Cloning the remote Git repository
Using shallow clone with depth 1
Avoid fetching tags
Cloning repository https://github.com/apache/beam.git
 > git init <https://ci-beam.apache.org/job/beam_PostCommit_Java_Nexmark_Dataflow_V2/ws/src> # timeout=10
Fetching upstream changes from https://github.com/apache/beam.git
 > git --version # timeout=10
 > git --version # 'git version 2.25.1'
 > git fetch --no-tags --force --progress --depth=1 -- https://github.com/apache/beam.git +refs/heads/*:refs/remotes/origin/* # timeout=10
 > git config remote.origin.url https://github.com/apache/beam.git # timeout=10
 > git config --add remote.origin.fetch +refs/heads/*:refs/remotes/origin/* # timeout=10
 > git config remote.origin.url https://github.com/apache/beam.git # timeout=10
Using shallow fetch with depth 1
Fetching upstream changes from https://github.com/apache/beam.git
 > git fetch --no-tags --force --progress --depth=1 -- https://github.com/apache/beam.git +refs/heads/*:refs/remotes/origin/* +refs/pull/${ghprbPullId}/*:refs/remotes/origin/pr/${ghprbPullId}/* # timeout=10
 > git rev-parse origin/master^{commit} # timeout=10
Checking out Revision 2ad459113134dfffd3caeeb15e821bb644e08663 (origin/master)
 > git config core.sparsecheckout # timeout=10
 > git checkout -f 2ad459113134dfffd3caeeb15e821bb644e08663 # timeout=10
Commit message: "[YAML] - Kafka Read and Write proto (#29368)"
 > git rev-list --no-walk 2ad459113134dfffd3caeeb15e821bb644e08663 # timeout=10
No emails were triggered.
[EnvInject] - Executing scripts and injecting environment variables after the SCM step.
[EnvInject] - Injecting as environment variables the properties content 
SETUPTOOLS_USE_DISTUTILS=stdlib
SPARK_LOCAL_IP=127.0.0.1

[EnvInject] - Variables injected successfully.
[beam_PostCommit_Java_Nexmark_Dataflow_V2] $ /bin/bash -xe /tmp/jenkins5862302317358771782.sh
+ echo '*** RUN NEXMARK IN BATCH MODE USING DATAFLOW RUNNER with Java 8 ***'
*** RUN NEXMARK IN BATCH MODE USING DATAFLOW RUNNER with Java 8 ***
[Gradle] - Launching build.
[src] $ <https://ci-beam.apache.org/job/beam_PostCommit_Java_Nexmark_Dataflow_V2/ws/src/gradlew> --continue --max-****s=8 -Dorg.gradle.jvmargs=-Xms2g -Dorg.gradle.jvmargs=-Xmx6g -Dorg.gradle.vfs.watch=false -Pdocker-pull-licenses -Pnexmark.runner=:runners:google-cloud-dataflow-java '-Pnexmark.args=--manageResources=false --monitorJobs=true --bigQueryTable=nexmark --bigQueryDataset=nexmark --project=apache-beam-testing --resourceNameMode=QUERY_RUNNER_AND_MODE --exportSummaryToBigQuery=false --tempLocation=gs://temp-storage-for-perf-tests/nexmark --influxDatabase=beam_test_metrics --influxHost=http://10.128.0.96:8086 --baseInfluxMeasurement=nexmark --exportSummaryToInfluxDB=true --influxRetentionPolicy=forever --influxTags={"runnerVersion":"V2","javaVersion":"8"} --region=us-central1 --suite=STRESS --numWorkers=4 --maxNumWorkers=4 --autoscalingAlgorithm=NONE --nexmarkParallel=16 --enforceEncodability=true --enforceImmutability=true --runner=DataflowRunner --streaming=false' -Pnexmark.runner.version=V2 :sdks:java:testing:nexmark:run
To honour the JVM settings for this build a single-use Daemon process will be forked. For more on this, please refer to https://docs.gradle.org/8.4/userguide/gradle_daemon.html#sec:disabling_the_daemon in the Gradle documentation.
Daemon will be stopped at the end of the build 
Configuration on demand is an incubating feature.
Gradle Enterprise plugins resolution: https://plugins.gradle.org/m2
Enforcing Gradle Enterprise: https://ge.apache.org, allowUntrustedServer: false
> Task :buildSrc:compileJava NO-SOURCE
> Task :buildSrc:compileGroovy FROM-CACHE
> Task :buildSrc:pluginDescriptors
> Task :buildSrc:processResources
> Task :buildSrc:classes
> Task :buildSrc:jar

> Configure project :sdks:java:container:java8
docker-pull-licenses set, creating go-licenses

> Configure project :sdks:java:container:java11
docker-pull-licenses set, creating go-licenses
System Go installation: /snap/bin/go is go version go1.16.15 linux/amd64; Preparing to use /home/jenkins/go/bin/go1.21.4
/home/jenkins/go/pkg/mod/golang.org/dl@v0.0.0-20231107201224-8165dcd93058/go1.21.4/main.go:20:8: //go:build comment without // +build comment

FAILURE: Build failed with an exception.

* What went wrong:
Could not determine the dependencies of task ':sdks:java:container:goBuild'.
> Could not create task ':sdks:java:container:goPrepare'.
   > Process 'command 'sh'' finished with non-zero exit value 1

* Try:
> Run with --stacktrace option to get the stack trace.
> Run with --info or --debug option to get more log output.
> Get more help at https://help.gradle.org.

Deprecated Gradle features were used in this build, making it incompatible with Gradle 9.0.

You can use '--warning-mode all' to show the individual deprecation warnings and determine if they come from your own scripts or plugins.

For more on this, please refer to https://docs.gradle.org/8.4/userguide/command_line_interface.html#sec:command_line_warnings in the Gradle documentation.

BUILD FAILED in 19s
4 actionable tasks: 3 executed, 1 from cache

Publishing build scan...
https://ge.apache.org/s/sqiy5c2tl7roc

Build step 'Invoke Gradle script' changed build result to FAILURE
Build step 'Invoke Gradle script' marked build as failure

---------------------------------------------------------------------
To unsubscribe, e-mail: builds-unsubscribe@beam.apache.org
For additional commands, e-mail: builds-help@beam.apache.org


Build failed in Jenkins: beam_PostCommit_Java_Nexmark_Dataflow_V2 #3563

Posted by Apache Jenkins Server <je...@builds.apache.org>.
See <https://ci-beam.apache.org/job/beam_PostCommit_Java_Nexmark_Dataflow_V2/3563/display/redirect>

Changes:


------------------------------------------
Started by timer
Running as SYSTEM
[EnvInject] - Loading node environment variables.
Building remotely on apache-beam-jenkins-11 (beam) in workspace <https://ci-beam.apache.org/job/beam_PostCommit_Java_Nexmark_Dataflow_V2/ws/>
The recommended git tool is: NONE
No credentials specified
Wiping out workspace first.
Cloning the remote Git repository
Using shallow clone with depth 1
Avoid fetching tags
Cloning repository https://github.com/apache/beam.git
 > git init <https://ci-beam.apache.org/job/beam_PostCommit_Java_Nexmark_Dataflow_V2/ws/src> # timeout=10
Fetching upstream changes from https://github.com/apache/beam.git
 > git --version # timeout=10
 > git --version # 'git version 2.25.1'
 > git fetch --no-tags --force --progress --depth=1 -- https://github.com/apache/beam.git +refs/heads/*:refs/remotes/origin/* # timeout=10
 > git config remote.origin.url https://github.com/apache/beam.git # timeout=10
 > git config --add remote.origin.fetch +refs/heads/*:refs/remotes/origin/* # timeout=10
 > git config remote.origin.url https://github.com/apache/beam.git # timeout=10
Using shallow fetch with depth 1
Fetching upstream changes from https://github.com/apache/beam.git
 > git fetch --no-tags --force --progress --depth=1 -- https://github.com/apache/beam.git +refs/heads/*:refs/remotes/origin/* +refs/pull/${ghprbPullId}/*:refs/remotes/origin/pr/${ghprbPullId}/* # timeout=10
 > git rev-parse origin/master^{commit} # timeout=10
Checking out Revision 2ad459113134dfffd3caeeb15e821bb644e08663 (origin/master)
 > git config core.sparsecheckout # timeout=10
 > git checkout -f 2ad459113134dfffd3caeeb15e821bb644e08663 # timeout=10
Commit message: "[YAML] - Kafka Read and Write proto (#29368)"
 > git rev-list --no-walk 2ad459113134dfffd3caeeb15e821bb644e08663 # timeout=10
No emails were triggered.
[EnvInject] - Executing scripts and injecting environment variables after the SCM step.
[EnvInject] - Injecting as environment variables the properties content 
SETUPTOOLS_USE_DISTUTILS=stdlib
SPARK_LOCAL_IP=127.0.0.1

[EnvInject] - Variables injected successfully.
[beam_PostCommit_Java_Nexmark_Dataflow_V2] $ /bin/bash -xe /tmp/jenkins389503359184335168.sh
+ echo '*** RUN NEXMARK IN BATCH MODE USING DATAFLOW RUNNER with Java 8 ***'
*** RUN NEXMARK IN BATCH MODE USING DATAFLOW RUNNER with Java 8 ***
[Gradle] - Launching build.
[src] $ <https://ci-beam.apache.org/job/beam_PostCommit_Java_Nexmark_Dataflow_V2/ws/src/gradlew> --continue --max-****s=8 -Dorg.gradle.jvmargs=-Xms2g -Dorg.gradle.jvmargs=-Xmx6g -Dorg.gradle.vfs.watch=false -Pdocker-pull-licenses -Pnexmark.runner=:runners:google-cloud-dataflow-java '-Pnexmark.args=--manageResources=false --monitorJobs=true --bigQueryTable=nexmark --bigQueryDataset=nexmark --project=apache-beam-testing --resourceNameMode=QUERY_RUNNER_AND_MODE --exportSummaryToBigQuery=false --tempLocation=gs://temp-storage-for-perf-tests/nexmark --influxDatabase=beam_test_metrics --influxHost=http://10.128.0.96:8086 --baseInfluxMeasurement=nexmark --exportSummaryToInfluxDB=true --influxRetentionPolicy=forever --influxTags={"runnerVersion":"V2","javaVersion":"8"} --region=us-central1 --suite=STRESS --numWorkers=4 --maxNumWorkers=4 --autoscalingAlgorithm=NONE --nexmarkParallel=16 --enforceEncodability=true --enforceImmutability=true --runner=DataflowRunner --streaming=false' -Pnexmark.runner.version=V2 :sdks:java:testing:nexmark:run
To honour the JVM settings for this build a single-use Daemon process will be forked. For more on this, please refer to https://docs.gradle.org/8.4/userguide/gradle_daemon.html#sec:disabling_the_daemon in the Gradle documentation.
Daemon will be stopped at the end of the build 
Configuration on demand is an incubating feature.
Gradle Enterprise plugins resolution: https://plugins.gradle.org/m2
Enforcing Gradle Enterprise: https://ge.apache.org, allowUntrustedServer: false
> Task :buildSrc:compileJava NO-SOURCE
> Task :buildSrc:compileGroovy FROM-CACHE
> Task :buildSrc:pluginDescriptors
> Task :buildSrc:processResources
> Task :buildSrc:classes
> Task :buildSrc:jar

> Configure project :sdks:java:container:java8
docker-pull-licenses set, creating go-licenses

> Configure project :sdks:java:container:java11
docker-pull-licenses set, creating go-licenses
System Go installation: /snap/bin/go is go version go1.16.15 linux/amd64; Preparing to use /home/jenkins/go/bin/go1.21.4
/home/jenkins/go/pkg/mod/golang.org/dl@v0.0.0-20231107201224-8165dcd93058/go1.21.4/main.go:20:8: //go:build comment without // +build comment

FAILURE: Build failed with an exception.

* What went wrong:
Could not determine the dependencies of task ':sdks:java:container:goBuild'.
> Could not create task ':sdks:java:container:goPrepare'.
   > Process 'command 'sh'' finished with non-zero exit value 1

* Try:
> Run with --stacktrace option to get the stack trace.
> Run with --info or --debug option to get more log output.
> Get more help at https://help.gradle.org.

Deprecated Gradle features were used in this build, making it incompatible with Gradle 9.0.

You can use '--warning-mode all' to show the individual deprecation warnings and determine if they come from your own scripts or plugins.

For more on this, please refer to https://docs.gradle.org/8.4/userguide/command_line_interface.html#sec:command_line_warnings in the Gradle documentation.

BUILD FAILED in 22s
4 actionable tasks: 3 executed, 1 from cache

Publishing build scan...
https://ge.apache.org/s/pubt5ic4hzrf6

Build step 'Invoke Gradle script' changed build result to FAILURE
Build step 'Invoke Gradle script' marked build as failure

---------------------------------------------------------------------
To unsubscribe, e-mail: builds-unsubscribe@beam.apache.org
For additional commands, e-mail: builds-help@beam.apache.org


Build failed in Jenkins: beam_PostCommit_Java_Nexmark_Dataflow_V2 #3562

Posted by Apache Jenkins Server <je...@builds.apache.org>.
See <https://ci-beam.apache.org/job/beam_PostCommit_Java_Nexmark_Dataflow_V2/3562/display/redirect>

Changes:


------------------------------------------
Started by timer
Running as SYSTEM
[EnvInject] - Loading node environment variables.
Building remotely on apache-beam-jenkins-11 (beam) in workspace <https://ci-beam.apache.org/job/beam_PostCommit_Java_Nexmark_Dataflow_V2/ws/>
The recommended git tool is: NONE
No credentials specified
Wiping out workspace first.
Cloning the remote Git repository
Using shallow clone with depth 1
Avoid fetching tags
Cloning repository https://github.com/apache/beam.git
 > git init <https://ci-beam.apache.org/job/beam_PostCommit_Java_Nexmark_Dataflow_V2/ws/src> # timeout=10
Fetching upstream changes from https://github.com/apache/beam.git
 > git --version # timeout=10
 > git --version # 'git version 2.25.1'
 > git fetch --no-tags --force --progress --depth=1 -- https://github.com/apache/beam.git +refs/heads/*:refs/remotes/origin/* # timeout=10
 > git config remote.origin.url https://github.com/apache/beam.git # timeout=10
 > git config --add remote.origin.fetch +refs/heads/*:refs/remotes/origin/* # timeout=10
 > git config remote.origin.url https://github.com/apache/beam.git # timeout=10
Using shallow fetch with depth 1
Fetching upstream changes from https://github.com/apache/beam.git
 > git fetch --no-tags --force --progress --depth=1 -- https://github.com/apache/beam.git +refs/heads/*:refs/remotes/origin/* +refs/pull/${ghprbPullId}/*:refs/remotes/origin/pr/${ghprbPullId}/* # timeout=10
 > git rev-parse origin/master^{commit} # timeout=10
Checking out Revision 2ad459113134dfffd3caeeb15e821bb644e08663 (origin/master)
 > git config core.sparsecheckout # timeout=10
 > git checkout -f 2ad459113134dfffd3caeeb15e821bb644e08663 # timeout=10
Commit message: "[YAML] - Kafka Read and Write proto (#29368)"
 > git rev-list --no-walk 2ad459113134dfffd3caeeb15e821bb644e08663 # timeout=10
No emails were triggered.
[EnvInject] - Executing scripts and injecting environment variables after the SCM step.
[EnvInject] - Injecting as environment variables the properties content 
SETUPTOOLS_USE_DISTUTILS=stdlib
SPARK_LOCAL_IP=127.0.0.1

[EnvInject] - Variables injected successfully.
[beam_PostCommit_Java_Nexmark_Dataflow_V2] $ /bin/bash -xe /tmp/jenkins3868299414110720152.sh
+ echo '*** RUN NEXMARK IN BATCH MODE USING DATAFLOW RUNNER with Java 8 ***'
*** RUN NEXMARK IN BATCH MODE USING DATAFLOW RUNNER with Java 8 ***
[Gradle] - Launching build.
[src] $ <https://ci-beam.apache.org/job/beam_PostCommit_Java_Nexmark_Dataflow_V2/ws/src/gradlew> --continue --max-****s=8 -Dorg.gradle.jvmargs=-Xms2g -Dorg.gradle.jvmargs=-Xmx6g -Dorg.gradle.vfs.watch=false -Pdocker-pull-licenses -Pnexmark.runner=:runners:google-cloud-dataflow-java '-Pnexmark.args=--manageResources=false --monitorJobs=true --bigQueryTable=nexmark --bigQueryDataset=nexmark --project=apache-beam-testing --resourceNameMode=QUERY_RUNNER_AND_MODE --exportSummaryToBigQuery=false --tempLocation=gs://temp-storage-for-perf-tests/nexmark --influxDatabase=beam_test_metrics --influxHost=http://10.128.0.96:8086 --baseInfluxMeasurement=nexmark --exportSummaryToInfluxDB=true --influxRetentionPolicy=forever --influxTags={"runnerVersion":"V2","javaVersion":"8"} --region=us-central1 --suite=STRESS --numWorkers=4 --maxNumWorkers=4 --autoscalingAlgorithm=NONE --nexmarkParallel=16 --enforceEncodability=true --enforceImmutability=true --runner=DataflowRunner --streaming=false' -Pnexmark.runner.version=V2 :sdks:java:testing:nexmark:run
To honour the JVM settings for this build a single-use Daemon process will be forked. For more on this, please refer to https://docs.gradle.org/8.4/userguide/gradle_daemon.html#sec:disabling_the_daemon in the Gradle documentation.
Daemon will be stopped at the end of the build 
Configuration on demand is an incubating feature.
Gradle Enterprise plugins resolution: https://plugins.gradle.org/m2
Enforcing Gradle Enterprise: https://ge.apache.org, allowUntrustedServer: false
> Task :buildSrc:compileJava NO-SOURCE
> Task :buildSrc:compileGroovy FROM-CACHE
> Task :buildSrc:pluginDescriptors
> Task :buildSrc:processResources
> Task :buildSrc:classes
> Task :buildSrc:jar

> Configure project :sdks:java:container:java8
docker-pull-licenses set, creating go-licenses

> Configure project :sdks:java:container:java11
docker-pull-licenses set, creating go-licenses
System Go installation: /snap/bin/go is go version go1.16.15 linux/amd64; Preparing to use /home/jenkins/go/bin/go1.21.4
/home/jenkins/go/pkg/mod/golang.org/dl@v0.0.0-20231107201224-8165dcd93058/go1.21.4/main.go:20:8: //go:build comment without // +build comment

FAILURE: Build failed with an exception.

* What went wrong:
Could not determine the dependencies of task ':sdks:java:container:goBuild'.
> Could not create task ':sdks:java:container:goPrepare'.
   > Process 'command 'sh'' finished with non-zero exit value 1

* Try:
> Run with --stacktrace option to get the stack trace.
> Run with --info or --debug option to get more log output.
> Get more help at https://help.gradle.org.

Deprecated Gradle features were used in this build, making it incompatible with Gradle 9.0.

You can use '--warning-mode all' to show the individual deprecation warnings and determine if they come from your own scripts or plugins.

For more on this, please refer to https://docs.gradle.org/8.4/userguide/command_line_interface.html#sec:command_line_warnings in the Gradle documentation.

BUILD FAILED in 23s
4 actionable tasks: 3 executed, 1 from cache

Publishing build scan...
https://ge.apache.org/s/tbsjhhgrabcfo

Build step 'Invoke Gradle script' changed build result to FAILURE
Build step 'Invoke Gradle script' marked build as failure

---------------------------------------------------------------------
To unsubscribe, e-mail: builds-unsubscribe@beam.apache.org
For additional commands, e-mail: builds-help@beam.apache.org


Build failed in Jenkins: beam_PostCommit_Java_Nexmark_Dataflow_V2 #3561

Posted by Apache Jenkins Server <je...@builds.apache.org>.
See <https://ci-beam.apache.org/job/beam_PostCommit_Java_Nexmark_Dataflow_V2/3561/display/redirect>

Changes:


------------------------------------------
Started by timer
Running as SYSTEM
[EnvInject] - Loading node environment variables.
Building remotely on apache-beam-jenkins-11 (beam) in workspace <https://ci-beam.apache.org/job/beam_PostCommit_Java_Nexmark_Dataflow_V2/ws/>
The recommended git tool is: NONE
No credentials specified
Wiping out workspace first.
Cloning the remote Git repository
Using shallow clone with depth 1
Avoid fetching tags
Cloning repository https://github.com/apache/beam.git
 > git init <https://ci-beam.apache.org/job/beam_PostCommit_Java_Nexmark_Dataflow_V2/ws/src> # timeout=10
Fetching upstream changes from https://github.com/apache/beam.git
 > git --version # timeout=10
 > git --version # 'git version 2.25.1'
 > git fetch --no-tags --force --progress --depth=1 -- https://github.com/apache/beam.git +refs/heads/*:refs/remotes/origin/* # timeout=10
 > git config remote.origin.url https://github.com/apache/beam.git # timeout=10
 > git config --add remote.origin.fetch +refs/heads/*:refs/remotes/origin/* # timeout=10
 > git config remote.origin.url https://github.com/apache/beam.git # timeout=10
Using shallow fetch with depth 1
Fetching upstream changes from https://github.com/apache/beam.git
 > git fetch --no-tags --force --progress --depth=1 -- https://github.com/apache/beam.git +refs/heads/*:refs/remotes/origin/* +refs/pull/${ghprbPullId}/*:refs/remotes/origin/pr/${ghprbPullId}/* # timeout=10
 > git rev-parse origin/master^{commit} # timeout=10
Checking out Revision 2ad459113134dfffd3caeeb15e821bb644e08663 (origin/master)
 > git config core.sparsecheckout # timeout=10
 > git checkout -f 2ad459113134dfffd3caeeb15e821bb644e08663 # timeout=10
Commit message: "[YAML] - Kafka Read and Write proto (#29368)"
 > git rev-list --no-walk 39986e60ea367566da1f4a49d34a53f7ba75cf98 # timeout=10
First time build. Skipping changelog.
No emails were triggered.
[EnvInject] - Executing scripts and injecting environment variables after the SCM step.
[EnvInject] - Injecting as environment variables the properties content 
SETUPTOOLS_USE_DISTUTILS=stdlib
SPARK_LOCAL_IP=127.0.0.1

[EnvInject] - Variables injected successfully.
[beam_PostCommit_Java_Nexmark_Dataflow_V2] $ /bin/bash -xe /tmp/jenkins17528102023929780879.sh
+ echo '*** RUN NEXMARK IN BATCH MODE USING DATAFLOW RUNNER with Java 8 ***'
*** RUN NEXMARK IN BATCH MODE USING DATAFLOW RUNNER with Java 8 ***
[Gradle] - Launching build.
[src] $ <https://ci-beam.apache.org/job/beam_PostCommit_Java_Nexmark_Dataflow_V2/ws/src/gradlew> --continue --max-****s=8 -Dorg.gradle.jvmargs=-Xms2g -Dorg.gradle.jvmargs=-Xmx6g -Dorg.gradle.vfs.watch=false -Pdocker-pull-licenses -Pnexmark.runner=:runners:google-cloud-dataflow-java '-Pnexmark.args=--manageResources=false --monitorJobs=true --bigQueryTable=nexmark --bigQueryDataset=nexmark --project=apache-beam-testing --resourceNameMode=QUERY_RUNNER_AND_MODE --exportSummaryToBigQuery=false --tempLocation=gs://temp-storage-for-perf-tests/nexmark --influxDatabase=beam_test_metrics --influxHost=http://10.128.0.96:8086 --baseInfluxMeasurement=nexmark --exportSummaryToInfluxDB=true --influxRetentionPolicy=forever --influxTags={"runnerVersion":"V2","javaVersion":"8"} --region=us-central1 --suite=STRESS --numWorkers=4 --maxNumWorkers=4 --autoscalingAlgorithm=NONE --nexmarkParallel=16 --enforceEncodability=true --enforceImmutability=true --runner=DataflowRunner --streaming=false' -Pnexmark.runner.version=V2 :sdks:java:testing:nexmark:run
To honour the JVM settings for this build a single-use Daemon process will be forked. For more on this, please refer to https://docs.gradle.org/8.4/userguide/gradle_daemon.html#sec:disabling_the_daemon in the Gradle documentation.
Daemon will be stopped at the end of the build 
Configuration on demand is an incubating feature.
Gradle Enterprise plugins resolution: https://plugins.gradle.org/m2
Enforcing Gradle Enterprise: https://ge.apache.org, allowUntrustedServer: false
> Task :buildSrc:compileJava NO-SOURCE
> Task :buildSrc:compileGroovy FROM-CACHE
> Task :buildSrc:pluginDescriptors
> Task :buildSrc:processResources
> Task :buildSrc:classes
> Task :buildSrc:jar

> Configure project :sdks:java:container:java8
docker-pull-licenses set, creating go-licenses

> Configure project :sdks:java:container:java11
docker-pull-licenses set, creating go-licenses
System Go installation: /snap/bin/go is go version go1.16.15 linux/amd64; Preparing to use /home/jenkins/go/bin/go1.21.4
/home/jenkins/go/pkg/mod/golang.org/dl@v0.0.0-20231107201224-8165dcd93058/go1.21.4/main.go:20:8: //go:build comment without // +build comment

FAILURE: Build failed with an exception.

* What went wrong:
Could not determine the dependencies of task ':sdks:java:container:goBuild'.
> Could not create task ':sdks:java:container:goPrepare'.
   > Process 'command 'sh'' finished with non-zero exit value 1

* Try:
> Run with --stacktrace option to get the stack trace.
> Run with --info or --debug option to get more log output.
> Get more help at https://help.gradle.org.

Deprecated Gradle features were used in this build, making it incompatible with Gradle 9.0.

You can use '--warning-mode all' to show the individual deprecation warnings and determine if they come from your own scripts or plugins.

For more on this, please refer to https://docs.gradle.org/8.4/userguide/command_line_interface.html#sec:command_line_warnings in the Gradle documentation.

BUILD FAILED in 25s
4 actionable tasks: 3 executed, 1 from cache

Publishing build scan...
https://ge.apache.org/s/5l5v2yjrycbbg

Build step 'Invoke Gradle script' changed build result to FAILURE
Build step 'Invoke Gradle script' marked build as failure

---------------------------------------------------------------------
To unsubscribe, e-mail: builds-unsubscribe@beam.apache.org
For additional commands, e-mail: builds-help@beam.apache.org


Build failed in Jenkins: beam_PostCommit_Java_Nexmark_Dataflow_V2 #3560

Posted by Apache Jenkins Server <je...@builds.apache.org>.
See <https://ci-beam.apache.org/job/beam_PostCommit_Java_Nexmark_Dataflow_V2/3560/display/redirect>

Changes:


------------------------------------------
Started by timer
Running as SYSTEM
[EnvInject] - Loading node environment variables.
Building remotely on apache-beam-jenkins-11 (beam) in workspace <https://ci-beam.apache.org/job/beam_PostCommit_Java_Nexmark_Dataflow_V2/ws/>
The recommended git tool is: NONE
No credentials specified
Wiping out workspace first.
Cloning the remote Git repository
Using shallow clone with depth 1
Avoid fetching tags
Cloning repository https://github.com/apache/beam.git
 > git init <https://ci-beam.apache.org/job/beam_PostCommit_Java_Nexmark_Dataflow_V2/ws/src> # timeout=10
Fetching upstream changes from https://github.com/apache/beam.git
 > git --version # timeout=10
 > git --version # 'git version 2.25.1'
 > git fetch --no-tags --force --progress --depth=1 -- https://github.com/apache/beam.git +refs/heads/*:refs/remotes/origin/* # timeout=10
 > git config remote.origin.url https://github.com/apache/beam.git # timeout=10
 > git config --add remote.origin.fetch +refs/heads/*:refs/remotes/origin/* # timeout=10
 > git config remote.origin.url https://github.com/apache/beam.git # timeout=10
Using shallow fetch with depth 1
Fetching upstream changes from https://github.com/apache/beam.git
 > git fetch --no-tags --force --progress --depth=1 -- https://github.com/apache/beam.git +refs/heads/*:refs/remotes/origin/* +refs/pull/${ghprbPullId}/*:refs/remotes/origin/pr/${ghprbPullId}/* # timeout=10
 > git rev-parse origin/master^{commit} # timeout=10
Checking out Revision 39986e60ea367566da1f4a49d34a53f7ba75cf98 (origin/master)
 > git config core.sparsecheckout # timeout=10
 > git checkout -f 39986e60ea367566da1f4a49d34a53f7ba75cf98 # timeout=10
Commit message: "Update image tag pattern for RCs in release docs (#29406)"
 > git rev-list --no-walk 39986e60ea367566da1f4a49d34a53f7ba75cf98 # timeout=10
No emails were triggered.
[EnvInject] - Executing scripts and injecting environment variables after the SCM step.
[EnvInject] - Injecting as environment variables the properties content 
SETUPTOOLS_USE_DISTUTILS=stdlib
SPARK_LOCAL_IP=127.0.0.1

[EnvInject] - Variables injected successfully.
[beam_PostCommit_Java_Nexmark_Dataflow_V2] $ /bin/bash -xe /tmp/jenkins4201133612777908744.sh
+ echo '*** RUN NEXMARK IN BATCH MODE USING DATAFLOW RUNNER with Java 8 ***'
*** RUN NEXMARK IN BATCH MODE USING DATAFLOW RUNNER with Java 8 ***
[Gradle] - Launching build.
[src] $ <https://ci-beam.apache.org/job/beam_PostCommit_Java_Nexmark_Dataflow_V2/ws/src/gradlew> --continue --max-****s=8 -Dorg.gradle.jvmargs=-Xms2g -Dorg.gradle.jvmargs=-Xmx6g -Dorg.gradle.vfs.watch=false -Pdocker-pull-licenses -Pnexmark.runner=:runners:google-cloud-dataflow-java '-Pnexmark.args=--manageResources=false --monitorJobs=true --bigQueryTable=nexmark --bigQueryDataset=nexmark --project=apache-beam-testing --resourceNameMode=QUERY_RUNNER_AND_MODE --exportSummaryToBigQuery=false --tempLocation=gs://temp-storage-for-perf-tests/nexmark --influxDatabase=beam_test_metrics --influxHost=http://10.128.0.96:8086 --baseInfluxMeasurement=nexmark --exportSummaryToInfluxDB=true --influxRetentionPolicy=forever --influxTags={"runnerVersion":"V2","javaVersion":"8"} --region=us-central1 --suite=STRESS --numWorkers=4 --maxNumWorkers=4 --autoscalingAlgorithm=NONE --nexmarkParallel=16 --enforceEncodability=true --enforceImmutability=true --runner=DataflowRunner --streaming=false' -Pnexmark.runner.version=V2 :sdks:java:testing:nexmark:run
To honour the JVM settings for this build a single-use Daemon process will be forked. For more on this, please refer to https://docs.gradle.org/8.4/userguide/gradle_daemon.html#sec:disabling_the_daemon in the Gradle documentation.
Daemon will be stopped at the end of the build 
Configuration on demand is an incubating feature.
Gradle Enterprise plugins resolution: https://plugins.gradle.org/m2
Enforcing Gradle Enterprise: https://ge.apache.org, allowUntrustedServer: false
> Task :buildSrc:compileJava NO-SOURCE
> Task :buildSrc:compileGroovy FROM-CACHE
> Task :buildSrc:pluginDescriptors
> Task :buildSrc:processResources
> Task :buildSrc:classes
> Task :buildSrc:jar

> Configure project :sdks:java:container:java8
docker-pull-licenses set, creating go-licenses

> Configure project :sdks:java:container:java11
docker-pull-licenses set, creating go-licenses
System Go installation: /snap/bin/go is go version go1.16.15 linux/amd64; Preparing to use /home/jenkins/go/bin/go1.21.4
/home/jenkins/go/pkg/mod/golang.org/dl@v0.0.0-20231107201224-8165dcd93058/go1.21.4/main.go:20:8: //go:build comment without // +build comment

FAILURE: Build failed with an exception.

* What went wrong:
Could not determine the dependencies of task ':sdks:java:container:goBuild'.
> Could not create task ':sdks:java:container:goPrepare'.
   > Process 'command 'sh'' finished with non-zero exit value 1

* Try:
> Run with --stacktrace option to get the stack trace.
> Run with --info or --debug option to get more log output.
> Get more help at https://help.gradle.org.

Deprecated Gradle features were used in this build, making it incompatible with Gradle 9.0.

You can use '--warning-mode all' to show the individual deprecation warnings and determine if they come from your own scripts or plugins.

For more on this, please refer to https://docs.gradle.org/8.4/userguide/command_line_interface.html#sec:command_line_warnings in the Gradle documentation.

BUILD FAILED in 21s
4 actionable tasks: 3 executed, 1 from cache

Publishing build scan...
https://ge.apache.org/s/onj2wvjrxmke2

Build step 'Invoke Gradle script' changed build result to FAILURE
Build step 'Invoke Gradle script' marked build as failure

---------------------------------------------------------------------
To unsubscribe, e-mail: builds-unsubscribe@beam.apache.org
For additional commands, e-mail: builds-help@beam.apache.org