You are viewing a plain text version of this content. The canonical link for it is here.
Posted to builds@cassandra.apache.org by Apache Jenkins Server <je...@builds.apache.org> on 2023/06/02 05:29:12 UTC

Build complete: Cassandra-4.0 #595 [UNSTABLE] eb6a45fe6d34f9dd35462eec6eba3e5904562f96

-------------------------------------------------------------------------------
Build Cassandra-4.0 #595 Still Unstable
URL: https://ci-cassandra.apache.org/job/Cassandra-4.0/595/
-------------------------------------------------------------------------------
Changes:
[Brandon Williams] remove dh_python use from Debian packaging


-------------------------------------------------------------------------------
Failed Tests:
10 tests failed.
FAILED:  dtest-novnode.cqlsh_tests.test_cqlsh_copy.TestCqlshCopy.test_bulk_round_trip_blogposts
FAILED:  dtest-novnode.cqlsh_tests.test_cqlsh_copy.TestCqlshCopy.test_bulk_round_trip_with_backoff
FAILED:  dtest.materialized_views_test.TestMaterializedViewsConsistency.test_multi_partition_consistent_reads_after_write
FAILED:  dtest.replace_address_test.TestReplaceAddress.test_fail_when_seed
FAILED:  org.apache.cassandra.distributed.upgrade.MixedModeAvailabilityV22Test.testAvailabilityV22ToV3X
FAILED:  org.apache.cassandra.distributed.upgrade.MixedModeReadTest.mixedModeReadColumnSubsetDigestCheck
FAILED:  org.apache.cassandra.db.compaction.CompactionsCQLTest.testIndexedReaderRT-compression
FAILED:  org.apache.cassandra.net.ProxyHandlerConnectionsTest.testExpireSome
FAILED:  org.apache.cassandra.distributed.test.FailingRepairTest.testFailingMessage[VALIDATION_REQ/parallel/true]
FAILED:  org.apache.cassandra.distributed.test.FailingRepairTest.testFailingMessage[VALIDATION_REQ/parallel/true]

-------------------------------------------------------------------------------
For complete test report and logs see https://nightlies.apache.org/cassandra/Cassandra-4.0/595/