You are viewing a plain text version of this content. The canonical link for it is here.
Posted to issues@bookkeeper.apache.org by Apache Jenkins Server <je...@builds.apache.org> on 2018/11/07 14:50:35 UTC
Jenkins build became unstable: bookkeeper_release_branch_48_java9
#84
See <https://builds.apache.org/job/bookkeeper_release_branch_48_java9/84/display/redirect>
Jenkins build is back to normal :
bookkeeper_release_branch_48_java9 #96
Posted by Apache Jenkins Server <je...@builds.apache.org>.
See <https://builds.apache.org/job/bookkeeper_release_branch_48_java9/96/display/redirect>
Build failed in Jenkins: bookkeeper_release_branch_48_java9 #95
Posted by Apache Jenkins Server <je...@builds.apache.org>.
See <https://builds.apache.org/job/bookkeeper_release_branch_48_java9/95/display/redirect>
------------------------------------------
[...truncated 691.32 KB...]
2018-11-18T14:13:15.064 [INFO] Downloading: http://maven.twttr.com/com/twitter/common/stats-provider/0.0.33/stats-provider-0.0.33.pom
2018-11-18T14:13:15.494 [INFO] Downloaded: http://maven.twttr.com/com/twitter/common/stats-provider/0.0.33/stats-provider-0.0.33.pom (1.3 kB at 2.9 kB/s)
2018-11-18T14:13:15.497 [INFO] Downloading: http://maven.twttr.com/com/twitter/common/stat/0.0.10/stat-0.0.10.pom
2018-11-18T14:13:15.932 [INFO] Downloaded: http://maven.twttr.com/com/twitter/common/stat/0.0.10/stat-0.0.10.pom (688 B at 1.6 kB/s)
2018-11-18T14:13:15.935 [INFO] Downloading: http://maven.twttr.com/com/twitter/common/application-action/0.0.40/application-action-0.0.40.pom
2018-11-18T14:13:16.426 [INFO] Downloaded: http://maven.twttr.com/com/twitter/common/application-action/0.0.40/application-action-0.0.40.pom (1.8 kB at 3.6 kB/s)
2018-11-18T14:13:16.428 [INFO] Downloading: http://maven.twttr.com/com/twitter/common/base/0.0.52/base-0.0.52.pom
2018-11-18T14:13:16.972 [INFO] Downloaded: http://maven.twttr.com/com/twitter/common/base/0.0.52/base-0.0.52.pom (1.6 kB at 3.0 kB/s)
2018-11-18T14:13:16.975 [INFO] Downloading: http://maven.twttr.com/com/twitter/common/quantity/0.0.40/quantity-0.0.40.pom
2018-11-18T14:13:17.470 [INFO] Downloaded: http://maven.twttr.com/com/twitter/common/quantity/0.0.40/quantity-0.0.40.pom (1.3 kB at 2.5 kB/s)
2018-11-18T14:13:17.473 [INFO] Downloading: http://maven.twttr.com/com/twitter/common/collections/0.0.44/collections-0.0.44.pom
2018-11-18T14:13:18.028 [INFO] Downloaded: http://maven.twttr.com/com/twitter/common/collections/0.0.44/collections-0.0.44.pom (1.4 kB at 2.6 kB/s)
2018-11-18T14:13:18.031 [INFO] Downloading: http://maven.twttr.com/com/twitter/common/util-system-mocks/0.0.40/util-system-mocks-0.0.40.pom
2018-11-18T14:13:18.523 [INFO] Downloaded: http://maven.twttr.com/com/twitter/common/util-system-mocks/0.0.40/util-system-mocks-0.0.40.pom (1.1 kB at 2.2 kB/s)
2018-11-18T14:13:18.526 [INFO] Downloading: http://maven.twttr.com/com/twitter/common/net-util/0.0.44/net-util-0.0.44.pom
2018-11-18T14:13:19.018 [INFO] Downloaded: http://maven.twttr.com/com/twitter/common/net-util/0.0.44/net-util-0.0.44.pom (1.8 kB at 3.6 kB/s)
2018-11-18T14:13:19.020 [INFO] Downloading: http://maven.twttr.com/com/twitter/common/util-sampler/0.0.31/util-sampler-0.0.31.pom
2018-11-18T14:13:19.508 [INFO] Downloaded: http://maven.twttr.com/com/twitter/common/util-sampler/0.0.31/util-sampler-0.0.31.pom (1.3 kB at 2.6 kB/s)
2018-11-18T14:13:19.511 [INFO] Downloading: http://maven.twttr.com/com/twitter/common/stats-jvm/0.0.33/stats-jvm-0.0.33.pom
2018-11-18T14:13:19.943 [INFO] Downloaded: http://maven.twttr.com/com/twitter/common/stats-jvm/0.0.33/stats-jvm-0.0.33.pom (1.1 kB at 2.5 kB/s)
2018-11-18T14:13:19.946 [INFO] Downloading: http://maven.twttr.com/com/twitter/common/stats/0.0.57/stats-0.0.57.pom
2018-11-18T14:13:20.492 [INFO] Downloaded: http://maven.twttr.com/com/twitter/common/stats/0.0.57/stats-0.0.57.pom (2.5 kB at 4.6 kB/s)
2018-11-18T14:13:20.494 [INFO] Downloading: http://maven.twttr.com/com/twitter/common/stat-registry/0.0.8/stat-registry-0.0.8.pom
2018-11-18T14:13:21.047 [INFO] Downloaded: http://maven.twttr.com/com/twitter/common/stat-registry/0.0.8/stat-registry-0.0.8.pom (906 B at 1.6 kB/s)
2018-11-18T14:13:21.050 [INFO] Downloading: http://maven.twttr.com/com/twitter/common/stat/0.0.8/stat-0.0.8.pom
2018-11-18T14:13:21.551 [INFO] Downloaded: http://maven.twttr.com/com/twitter/common/stat/0.0.8/stat-0.0.8.pom (687 B at 1.4 kB/s)
2018-11-18T14:13:21.554 [INFO] Downloading: http://maven.twttr.com/com/twitter/common/stats-provider/0.0.31/stats-provider-0.0.31.pom
2018-11-18T14:13:21.983 [INFO] Downloaded: http://maven.twttr.com/com/twitter/common/stats-provider/0.0.31/stats-provider-0.0.31.pom (1.3 kB at 2.9 kB/s)
2018-11-18T14:13:21.986 [INFO] Downloading: http://maven.twttr.com/com/twitter/common/application-action/0.0.39/application-action-0.0.39.pom
2018-11-18T14:13:22.198 [INFO] Downloading: https://repo.maven.apache.org/maven2/com/twitter/common/application-action/0.0.39/application-action-0.0.39.pom
2018-11-18T14:13:22.208 [INFO] Downloading: http://maven.twttr.com/com/twitter/common/base/0.0.51/base-0.0.51.pom
2018-11-18T14:13:22.544 [INFO] Downloaded: http://maven.twttr.com/com/twitter/common/base/0.0.51/base-0.0.51.pom (1.6 kB at 4.8 kB/s)
2018-11-18T14:13:22.548 [INFO] Downloading: http://maven.twttr.com/com/twitter/common/quantity/0.0.39/quantity-0.0.39.pom
2018-11-18T14:13:22.765 [INFO] Downloaded: http://maven.twttr.com/com/twitter/common/quantity/0.0.39/quantity-0.0.39.pom (1.3 kB at 5.8 kB/s)
2018-11-18T14:13:22.768 [INFO] Downloading: http://maven.twttr.com/com/twitter/common/collections/0.0.43/collections-0.0.43.pom
2018-11-18T14:13:22.987 [INFO] Downloaded: http://maven.twttr.com/com/twitter/common/collections/0.0.43/collections-0.0.43.pom (1.4 kB at 6.5 kB/s)
2018-11-18T14:13:22.989 [INFO] Downloading: http://maven.twttr.com/com/twitter/common/util-system-mocks/0.0.39/util-system-mocks-0.0.39.pom
2018-11-18T14:13:23.134 [INFO] Downloaded: http://maven.twttr.com/com/twitter/common/util-system-mocks/0.0.39/util-system-mocks-0.0.39.pom (1.1 kB at 7.5 kB/s)
2018-11-18T14:13:23.137 [INFO] Downloading: http://maven.twttr.com/com/twitter/common/util-sampler/0.0.30/util-sampler-0.0.30.pom
2018-11-18T14:13:23.417 [INFO] Downloaded: http://maven.twttr.com/com/twitter/common/util-sampler/0.0.30/util-sampler-0.0.30.pom (1.3 kB at 4.5 kB/s)
2018-11-18T14:13:23.486 [INFO] Downloading: http://maven.twttr.com/org/eclipse/jetty/jetty-server/9.4.5.v20170502/jetty-server-9.4.5.v20170502.pom
2018-11-18T14:13:23.587 [INFO] Downloading: https://repo.maven.apache.org/maven2/org/eclipse/jetty/jetty-server/9.4.5.v20170502/jetty-server-9.4.5.v20170502.pom
2018-11-18T14:13:23.606 [INFO] Downloaded: https://repo.maven.apache.org/maven2/org/eclipse/jetty/jetty-server/9.4.5.v20170502/jetty-server-9.4.5.v20170502.pom (2.6 kB at 135 kB/s)
2018-11-18T14:13:23.608 [INFO] Downloading: http://maven.twttr.com/org/eclipse/jetty/jetty-project/9.4.5.v20170502/jetty-project-9.4.5.v20170502.pom
2018-11-18T14:13:23.753 [INFO] Downloading: https://repo.maven.apache.org/maven2/org/eclipse/jetty/jetty-project/9.4.5.v20170502/jetty-project-9.4.5.v20170502.pom
2018-11-18T14:13:23.778 [INFO] Downloaded: https://repo.maven.apache.org/maven2/org/eclipse/jetty/jetty-project/9.4.5.v20170502/jetty-project-9.4.5.v20170502.pom (54 kB at 2.2 MB/s)
2018-11-18T14:13:23.814 [INFO] Downloading: http://maven.twttr.com/javax/servlet/javax.servlet-api/3.1.0/javax.servlet-api-3.1.0.pom
2018-11-18T14:13:24.023 [INFO] Downloading: https://repo.maven.apache.org/maven2/javax/servlet/javax.servlet-api/3.1.0/javax.servlet-api-3.1.0.pom
2018-11-18T14:13:24.036 [INFO] Downloaded: https://repo.maven.apache.org/maven2/javax/servlet/javax.servlet-api/3.1.0/javax.servlet-api-3.1.0.pom (14 kB at 1.0 MB/s)
2018-11-18T14:13:24.057 [INFO] Downloading: http://maven.twttr.com/net/java/jvnet-parent/3/jvnet-parent-3.pom
2018-11-18T14:13:24.204 [INFO] Downloading: https://repo.maven.apache.org/maven2/net/java/jvnet-parent/3/jvnet-parent-3.pom
2018-11-18T14:13:24.216 [INFO] Downloaded: https://repo.maven.apache.org/maven2/net/java/jvnet-parent/3/jvnet-parent-3.pom (4.8 kB at 399 kB/s)
2018-11-18T14:13:24.219 [INFO] Downloading: http://maven.twttr.com/org/eclipse/jetty/jetty-http/9.4.5.v20170502/jetty-http-9.4.5.v20170502.pom
2018-11-18T14:13:24.371 [INFO] Downloading: https://repo.maven.apache.org/maven2/org/eclipse/jetty/jetty-http/9.4.5.v20170502/jetty-http-9.4.5.v20170502.pom
2018-11-18T14:13:24.414 [INFO] Downloaded: https://repo.maven.apache.org/maven2/org/eclipse/jetty/jetty-http/9.4.5.v20170502/jetty-http-9.4.5.v20170502.pom (2.7 kB at 64 kB/s)
2018-11-18T14:13:24.424 [INFO] Downloading: http://maven.twttr.com/org/eclipse/jetty/jetty-util/9.4.5.v20170502/jetty-util-9.4.5.v20170502.pom
2018-11-18T14:13:24.571 [INFO] Downloading: https://repo.maven.apache.org/maven2/org/eclipse/jetty/jetty-util/9.4.5.v20170502/jetty-util-9.4.5.v20170502.pom
2018-11-18T14:13:24.583 [INFO] Downloaded: https://repo.maven.apache.org/maven2/org/eclipse/jetty/jetty-util/9.4.5.v20170502/jetty-util-9.4.5.v20170502.pom (2.1 kB at 173 kB/s)
2018-11-18T14:13:24.602 [INFO] Downloading: http://maven.twttr.com/org/eclipse/jetty/jetty-io/9.4.5.v20170502/jetty-io-9.4.5.v20170502.pom
2018-11-18T14:13:24.752 [INFO] Downloading: https://repo.maven.apache.org/maven2/org/eclipse/jetty/jetty-io/9.4.5.v20170502/jetty-io-9.4.5.v20170502.pom
2018-11-18T14:13:24.764 [INFO] Downloaded: https://repo.maven.apache.org/maven2/org/eclipse/jetty/jetty-io/9.4.5.v20170502/jetty-io-9.4.5.v20170502.pom (1.3 kB at 108 kB/s)
2018-11-18T14:13:24.782 [INFO] Downloading: http://maven.twttr.com/org/eclipse/jetty/jetty-servlet/9.4.5.v20170502/jetty-servlet-9.4.5.v20170502.pom
2018-11-18T14:13:24.930 [INFO] Downloading: https://repo.maven.apache.org/maven2/org/eclipse/jetty/jetty-servlet/9.4.5.v20170502/jetty-servlet-9.4.5.v20170502.pom
2018-11-18T14:13:24.942 [INFO] Downloaded: https://repo.maven.apache.org/maven2/org/eclipse/jetty/jetty-servlet/9.4.5.v20170502/jetty-servlet-9.4.5.v20170502.pom (2.1 kB at 177 kB/s)
2018-11-18T14:13:24.952 [INFO] Downloading: http://maven.twttr.com/org/eclipse/jetty/jetty-security/9.4.5.v20170502/jetty-security-9.4.5.v20170502.pom
2018-11-18T14:13:25.094 [INFO] Downloading: https://repo.maven.apache.org/maven2/org/eclipse/jetty/jetty-security/9.4.5.v20170502/jetty-security-9.4.5.v20170502.pom
2018-11-18T14:13:25.106 [INFO] Downloaded: https://repo.maven.apache.org/maven2/org/eclipse/jetty/jetty-security/9.4.5.v20170502/jetty-security-9.4.5.v20170502.pom (2.0 kB at 168 kB/s)
[JENKINS] Archiving disabled
[JENKINS] Archiving disabled
[JENKINS] Archiving disabled
[JENKINS] Archiving disabled
[JENKINS] Archiving disabled
[JENKINS] Archiving disabled
[JENKINS] Archiving disabled
[JENKINS] Archiving disabled
[JENKINS] Archiving disabled
[JENKINS] Archiving disabled
[JENKINS] Archiving disabled
[JENKINS] Archiving disabled
[JENKINS] Archiving disabled
[JENKINS] Archiving disabled
[JENKINS] Archiving disabled
[JENKINS] Archiving disabled
[JENKINS] Archiving disabled
[JENKINS] Archiving disabled
[JENKINS] Archiving disabled
[JENKINS] Archiving disabled
[JENKINS] Archiving disabled
[JENKINS] Archiving disabled
[JENKINS] Archiving disabled
[JENKINS] Archiving disabled
[JENKINS] Archiving disabled
[JENKINS] Archiving disabled
[JENKINS] Archiving disabled
[JENKINS] Archiving disabled
[JENKINS] Archiving disabled
[JENKINS] Archiving disabled
[JENKINS] Archiving disabled
[JENKINS] Archiving disabled
[JENKINS] Archiving disabled
[JENKINS] Archiving disabled
[JENKINS] Archiving disabled
[JENKINS] Archiving disabled
[JENKINS] Archiving disabled
[JENKINS] Archiving disabled
[JENKINS] Archiving disabled
[JENKINS] Archiving disabled
[JENKINS] Archiving disabled
[JENKINS] Archiving disabled
[JENKINS] Archiving disabled
[JENKINS] Archiving disabled
[JENKINS] Archiving disabled
[JENKINS] Archiving disabled
[JENKINS] Archiving disabled
[JENKINS] Archiving disabled
[JENKINS] Archiving disabled
[JENKINS] Archiving disabled
[JENKINS] Archiving disabled
[JENKINS] Archiving disabled
[JENKINS] Archiving disabled
[JENKINS] Archiving disabled
[JENKINS] Archiving disabled
[JENKINS] Archiving disabled
[JENKINS] Archiving disabled
[JENKINS] Archiving disabled
[JENKINS] Archiving disabled
[JENKINS] Archiving disabled
[JENKINS] Archiving disabled
[JENKINS] Archiving disabled
[JENKINS] Archiving disabled
[JENKINS] Archiving disabled
[JENKINS] Archiving disabled
[JENKINS] Archiving disabled
[JENKINS] Archiving disabled
[JENKINS] Archiving disabled
[JENKINS] Archiving disabled
[JENKINS] Archiving disabled
[JENKINS] Archiving disabled
[JENKINS] Archiving disabled
[JENKINS] Archiving disabled
[JENKINS] Archiving disabled
[JENKINS] Archiving disabled
[JENKINS] Archiving disabled
[JENKINS] Archiving disabled
[JENKINS] Archiving disabled
[JENKINS] Archiving disabled
[JENKINS] Archiving disabled
2018-11-18T14:14:21.189 [INFO] ------------------------------------------------------------------------
2018-11-18T14:14:21.189 [INFO] Reactor Summary:
2018-11-18T14:14:21.189 [INFO]
2018-11-18T14:14:21.189 [INFO] Apache BookKeeper :: Parent ........................ SUCCESS [ 18.917 s]
2018-11-18T14:14:21.189 [INFO] Apache BookKeeper :: Build Tools ................... SUCCESS [ 6.057 s]
2018-11-18T14:14:21.189 [INFO] Apache BookKeeper :: Circe Checksum Library ........ SUCCESS [01:47 min]
2018-11-18T14:14:21.189 [INFO] Apache BookKeeper :: Stats API ..................... SUCCESS [ 14.156 s]
2018-11-18T14:14:21.189 [INFO] Apache BookKeeper :: Common ........................ SUCCESS [ 36.995 s]
2018-11-18T14:14:21.189 [INFO] Apache BookKeeper :: Protocols ..................... SUCCESS [ 26.280 s]
2018-11-18T14:14:21.190 [INFO] Apache BookKeeper :: Tools :: Parent ............... SUCCESS [ 2.152 s]
2018-11-18T14:14:21.190 [INFO] Apache BookKeeper :: Tools :: Framework ............ SUCCESS [ 12.425 s]
2018-11-18T14:14:21.190 [INFO] Apache BookKeeper :: Http :: Http Server ........... SUCCESS [ 8.584 s]
2018-11-18T14:14:21.190 [INFO] Apache BookKeeper :: Server ........................ SUCCESS [ 01:50 h]
2018-11-18T14:14:21.190 [INFO] Apache BookKeeper :: Benchmark ..................... SUCCESS [01:55 min]
2018-11-18T14:14:21.190 [INFO] Apache BookKeeper :: Stats Providers :: Twitter Finagle Stats SUCCESS [ 10.136 s]
2018-11-18T14:14:21.190 [INFO] Apache BookKeeper :: Stats Providers :: Twitter Science Stats FAILURE [ 33.599 s]
2018-11-18T14:14:21.190 [INFO] Apache BookKeeper :: Stats Providers :: Twitter Ostrich Stats SKIPPED
2018-11-18T14:14:21.190 [INFO] Apache BookKeeper :: Stats Providers :: Codahale Metrics SKIPPED
2018-11-18T14:14:21.190 [INFO] Apache BookKeeper :: Stats Providers :: Prometheus . SKIPPED
2018-11-18T14:14:21.190 [INFO] Apache BookKeeper :: Stats Providers ............... SKIPPED
2018-11-18T14:14:21.190 [INFO] Apache BookKeeper :: Bookkeeper Http :: Twitter Http Server SKIPPED
2018-11-18T14:14:21.190 [INFO] Apache BookKeeper :: Bookkeeper Http :: Vertx Http Server SKIPPED
2018-11-18T14:14:21.190 [INFO] Apache BookKeeper :: Http .......................... SKIPPED
2018-11-18T14:14:21.190 [INFO] Apache BookKeeper :: Shaded :: Parent .............. SKIPPED
2018-11-18T14:14:21.190 [INFO] Apache BookKeeper :: Shaded :: bookkeeper-server-shaded SKIPPED
2018-11-18T14:14:21.190 [INFO] Apache BookKeeper :: Shaded :: bookkeeper-server-tests-shaded SKIPPED
2018-11-18T14:14:21.190 [INFO] Apache BookKeeper :: DistributedLog :: Parent ...... SKIPPED
2018-11-18T14:14:21.190 [INFO] Apache BookKeeper :: DistributedLog :: Common ...... SKIPPED
2018-11-18T14:14:21.190 [INFO] Apache BookKeeper :: DistributedLog :: Protocol .... SKIPPED
2018-11-18T14:14:21.190 [INFO] Apache BookKeeper :: DistributedLog :: Core Library SKIPPED
2018-11-18T14:14:21.190 [INFO] Apache BookKeeper :: Shaded :: distributedlog-core-shaded SKIPPED
2018-11-18T14:14:21.190 [INFO] Apache BookKeeper :: Tests ......................... SKIPPED
2018-11-18T14:14:21.190 [INFO] Apache BookKeeper :: Tests :: Test Shaded Jars ..... SKIPPED
2018-11-18T14:14:21.190 [INFO] Apache BookKeeper :: Tests :: bookkeeper-server-shaded test SKIPPED
2018-11-18T14:14:21.190 [INFO] Apache BookKeeper :: Tests :: bookkeeper-server-tests-shaded test SKIPPED
2018-11-18T14:14:21.191 [INFO] Apache BookKeeper :: Tests :: distributedlog-core-shaded test SKIPPED
2018-11-18T14:14:21.191 [INFO] Apache BookKeeper :: Tests :: Docker Images ........ SKIPPED
2018-11-18T14:14:21.191 [INFO] Apache BookKeeper :: Tests :: Docker Images :: All Released Versions SKIPPED
2018-11-18T14:14:21.191 [INFO] Apache BookKeeper :: Tools :: Ledger ............... SKIPPED
2018-11-18T14:14:21.191 [INFO] Apache BookKeeper :: Stream Storage :: Parent ...... SKIPPED
2018-11-18T14:14:21.191 [INFO] Apache BookKeeper :: Stream Storage :: Common Classes for Tests SKIPPED
2018-11-18T14:14:21.191 [INFO] Apache BookKeeper :: Stream Storage :: Common ...... SKIPPED
2018-11-18T14:14:21.191 [INFO] Apache BookKeeper :: Stream Storage :: API ......... SKIPPED
2018-11-18T14:14:21.191 [INFO] Apache BookKeeper :: Stream Storage :: Proto ....... SKIPPED
2018-11-18T14:14:21.191 [INFO] Apache BookKeeper :: Stream Storage :: Clients :: Parent SKIPPED
2018-11-18T14:14:21.191 [INFO] Apache BookKeeper :: Stream Storage :: Clients :: Java Client :: Parent SKIPPED
2018-11-18T14:14:21.191 [INFO] Apache BookKeeper :: Stream Storage :: Clients :: Java Client :: Base SKIPPED
2018-11-18T14:14:21.191 [INFO] Apache BookKeeper :: Stream Storage :: Clients :: Java Client :: KV SKIPPED
2018-11-18T14:14:21.191 [INFO] Apache BookKeeper :: Stream Storage :: Clients :: Java Client SKIPPED
2018-11-18T14:14:21.191 [INFO] Apache BookKeeper :: Stream Storage :: Storage :: Parent SKIPPED
2018-11-18T14:14:21.191 [INFO] Apache BookKeeper :: Stream Storage :: Storage :: Api SKIPPED
2018-11-18T14:14:21.191 [INFO] Apache BookKeeper :: Stream Storage :: State Library SKIPPED
2018-11-18T14:14:21.191 [INFO] Apache BookKeeper :: Stream Storage :: Storage :: Impl SKIPPED
2018-11-18T14:14:21.191 [INFO] Apache BookKeeper :: Tools :: Stream ............... SKIPPED
2018-11-18T14:14:21.191 [INFO] Apache BookKeeper :: Tools ......................... SKIPPED
2018-11-18T14:14:21.191 [INFO] Apache BookKeeper :: Stream Storage :: Server ...... SKIPPED
2018-11-18T14:14:21.191 [INFO] Apache BookKeeper :: Dist (Parent) ................. SKIPPED
2018-11-18T14:14:21.191 [INFO] Apache BookKeeper :: Dist (Server) ................. SKIPPED
2018-11-18T14:14:21.191 [INFO] Apache BookKeeper :: Tests :: Docker Images :: All Versions SKIPPED
2018-11-18T14:14:21.191 [INFO] Apache BookKeeper :: Tests :: Docker Images :: Current Version SKIPPED
2018-11-18T14:14:21.191 [INFO] Apache BookKeeper :: Tests :: Utility module for Arquillian based integration tests SKIPPED
2018-11-18T14:14:21.191 [INFO] Apache BookKeeper :: Tests :: Common topologies for Docker based integration tests SKIPPED
2018-11-18T14:14:21.191 [INFO] Apache BookKeeper :: Tests :: Base module for Arquillian based integration tests SKIPPED
2018-11-18T14:14:21.191 [INFO] Apache BookKeeper :: Tests :: Base module for Arquillian based integration tests using groovy SKIPPED
2018-11-18T14:14:21.191 [INFO] Apache BookKeeper :: Tests :: Backward Compatibility SKIPPED
2018-11-18T14:14:21.191 [INFO] Apache BookKeeper :: Tests :: Backward Compatibility :: Test upgrade between all released versions and current version SKIPPED
2018-11-18T14:14:21.191 [INFO] Apache BookKeeper :: Tests :: Backward Compatibility :: Test upgrade between 4.1.0 and current version SKIPPED
2018-11-18T14:14:21.191 [INFO] Apache BookKeeper :: Tests :: Backward Compatibility :: Test compat between old version and new version of hierarchical ledger manager SKIPPED
2018-11-18T14:14:21.191 [INFO] Apache BookKeeper :: Tests :: Backward Compatibility :: Test upgrade between 4.1.0 and current version (with hostname bookie ID) SKIPPED
2018-11-18T14:14:21.191 [INFO] Apache BookKeeper :: Tests :: Backward Compatibility :: Test recovery does not work when password no in metadata SKIPPED
2018-11-18T14:14:21.191 [INFO] Apache BookKeeper :: Tests :: Backward Compatibility :: Test upgrade 4.1.0 to current in cluster with cookies SKIPPED
2018-11-18T14:14:21.191 [INFO] Apache BookKeeper :: Tests :: Backward Compatibility :: Test old clients working on current server SKIPPED
2018-11-18T14:14:21.191 [INFO] Apache BookKeeper :: Tests :: Backward Compatibility :: Test upgrade between yahoo custom version and current SKIPPED
2018-11-18T14:14:21.191 [INFO] Apache BookKeeper :: Tests :: Integration .......... SKIPPED
2018-11-18T14:14:21.191 [INFO] Apache BookKeeper :: Tests :: Integration :: Smoke test SKIPPED
2018-11-18T14:14:21.191 [INFO] Apache BookKeeper :: Tests :: Integration :: Standalone test SKIPPED
2018-11-18T14:14:21.191 [INFO] Apache BookKeeper :: Tests :: Integration :: Cluster test SKIPPED
2018-11-18T14:14:21.191 [INFO] Apache BookKeeper :: Tests :: Bash Scripts Test .... SKIPPED
2018-11-18T14:14:21.191 [INFO] Apache BookKeeper :: Dist (All) .................... SKIPPED
2018-11-18T14:14:21.191 [INFO] Apache BookKeeper :: microbenchmarks ............... SKIPPED
2018-11-18T14:14:21.191 [INFO] Apache BookKeeper :: DistributedLog :: IO :: FileSystem SKIPPED
2018-11-18T14:14:21.191 [INFO] Apache BookKeeper :: DistributedLog :: IO .......... SKIPPED
2018-11-18T14:14:21.191 [INFO] ------------------------------------------------------------------------
2018-11-18T14:14:21.192 [INFO] BUILD FAILURE
2018-11-18T14:14:21.192 [INFO] ------------------------------------------------------------------------
2018-11-18T14:14:21.192 [INFO] Total time: 01:58 h
2018-11-18T14:14:21.192 [INFO] Finished at: 2018-11-18T14:14:21Z
2018-11-18T14:14:22.427 [INFO] Final Memory: 137M/2048M
2018-11-18T14:14:22.427 [INFO] ------------------------------------------------------------------------
Waiting for Jenkins to finish collecting data
2018-11-18T14:14:23.476 [ERROR] Failed to execute goal on project twitter-science-provider: Could not resolve dependencies for project org.apache.bookkeeper.stats:twitter-science-provider:jar:4.8.1-SNAPSHOT: Failed to collect dependencies at com.twitter.common:stats-jvm:jar:0.0.33 -> com.twitter.common:stats:jar:0.0.57 -> com.twitter.common:application-action:jar:0.0.39: Failed to read artifact descriptor for com.twitter.common:application-action:jar:0.0.39: Could not transfer artifact com.twitter.common:application-action:pom:0.0.39 from/to twitter (http://maven.twttr.com): Failed to transfer file: http://maven.twttr.com/com/twitter/common/application-action/0.0.39/application-action-0.0.39.pom. Return code is: 503 , ReasonPhrase:Service Temporarily Unavailable. -> [Help 1]
2018-11-18T14:14:23.476 [ERROR]
2018-11-18T14:14:23.476 [ERROR] To see the full stack trace of the errors, re-run Maven with the -e switch.
2018-11-18T14:14:23.476 [ERROR] Re-run Maven using the -X switch to enable full debug logging.
2018-11-18T14:14:23.476 [ERROR]
2018-11-18T14:14:23.476 [ERROR] For more information about the errors and possible solutions, please read the following articles:
2018-11-18T14:14:23.476 [ERROR] [Help 1] http://cwiki.apache.org/confluence/display/MAVEN/DependencyResolutionException
2018-11-18T14:14:23.477 [ERROR]
2018-11-18T14:14:23.477 [ERROR] After correcting the problems, you can resume the build with the command
2018-11-18T14:14:23.477 [ERROR] mvn <goals> -rf :twitter-science-provider
channel stopped
Not sending mail to unregistered user noreply@github.com
Jenkins build is still unstable: bookkeeper_release_branch_48_java9
#94
Posted by Apache Jenkins Server <je...@builds.apache.org>.
See <https://builds.apache.org/job/bookkeeper_release_branch_48_java9/94/display/redirect?page=changes>
Jenkins build is still unstable: bookkeeper_release_branch_48_java9
#93
Posted by Apache Jenkins Server <je...@builds.apache.org>.
See <https://builds.apache.org/job/bookkeeper_release_branch_48_java9/93/display/redirect?page=changes>
Jenkins build is still unstable: bookkeeper_release_branch_48_java9
#92
Posted by Apache Jenkins Server <je...@builds.apache.org>.
See <https://builds.apache.org/job/bookkeeper_release_branch_48_java9/92/display/redirect?page=changes>
Jenkins build is unstable: bookkeeper_release_branch_48_java9 #91
Posted by Apache Jenkins Server <je...@builds.apache.org>.
See <https://builds.apache.org/job/bookkeeper_release_branch_48_java9/91/display/redirect?page=changes>
Build failed in Jenkins: bookkeeper_release_branch_48_java9 #90
Posted by Apache Jenkins Server <je...@builds.apache.org>.
See <https://builds.apache.org/job/bookkeeper_release_branch_48_java9/90/display/redirect>
------------------------------------------
[...truncated 507.25 KB...]
2018-11-13T12:19:49.615 [INFO] Downloading: https://repo.maven.apache.org/maven2/org/apache/directory/server/apacheds-jdbm-partition/2.0.0-M15/apacheds-jdbm-partition-2.0.0-M15.jar
2018-11-13T12:19:49.618 [INFO] Downloaded: https://repo.maven.apache.org/maven2/org/apache/directory/server/apacheds-kerberos-codec/2.0.0-M15/apacheds-kerberos-codec-2.0.0-M15.jar (691 kB at 1.3 MB/s)
2018-11-13T12:19:49.618 [INFO] Downloading: https://repo.maven.apache.org/maven2/org/apache/directory/jdbm/apacheds-jdbm1/2.0.0-M2/apacheds-jdbm1-2.0.0-M2.jar
2018-11-13T12:19:49.634 [INFO] Downloaded: https://repo.maven.apache.org/maven2/org/apache/directory/server/apacheds-jdbm-partition/2.0.0-M15/apacheds-jdbm-partition-2.0.0-M15.jar (72 kB at 137 kB/s)
2018-11-13T12:19:49.634 [INFO] Downloading: https://repo.maven.apache.org/maven2/org/apache/directory/server/apacheds-protocol-ldap/2.0.0-M15/apacheds-protocol-ldap-2.0.0-M15.jar
2018-11-13T12:19:49.640 [INFO] Downloaded: https://repo.maven.apache.org/maven2/org/apache/directory/jdbm/apacheds-jdbm1/2.0.0-M2/apacheds-jdbm1-2.0.0-M2.jar (105 kB at 196 kB/s)
2018-11-13T12:19:49.640 [INFO] Downloading: https://repo.maven.apache.org/maven2/org/apache/directory/api/api-asn1-ber/1.0.0-M20/api-asn1-ber-1.0.0-M20.jar
2018-11-13T12:19:49.645 [INFO] Downloaded: https://repo.maven.apache.org/maven2/antlr/antlr/2.7.7/antlr-2.7.7.jar (445 kB at 825 kB/s)
2018-11-13T12:19:49.646 [INFO] Downloading: https://repo.maven.apache.org/maven2/org/apache/directory/api/api-ldap-extras-codec-api/1.0.0-M20/api-ldap-extras-codec-api-1.0.0-M20.jar
2018-11-13T12:19:49.657 [INFO] Downloaded: https://repo.maven.apache.org/maven2/org/apache/directory/api/api-asn1-ber/1.0.0-M20/api-asn1-ber-1.0.0-M20.jar (42 kB at 76 kB/s)
2018-11-13T12:19:49.657 [INFO] Downloading: https://repo.maven.apache.org/maven2/org/apache/directory/api/api-ldap-extras-codec/1.0.0-M20/api-ldap-extras-codec-1.0.0-M20.jar
2018-11-13T12:19:49.661 [INFO] Downloaded: https://repo.maven.apache.org/maven2/org/apache/directory/api/api-ldap-extras-codec-api/1.0.0-M20/api-ldap-extras-codec-api-1.0.0-M20.jar (55 kB at 99 kB/s)
2018-11-13T12:19:49.662 [INFO] Downloading: https://repo.maven.apache.org/maven2/org/apache/directory/api/api-ldap-extras-sp/1.0.0-M20/api-ldap-extras-sp-1.0.0-M20.jar
2018-11-13T12:19:49.669 [INFO] Downloaded: https://repo.maven.apache.org/maven2/org/apache/directory/server/apacheds-protocol-ldap/2.0.0-M15/apacheds-protocol-ldap-2.0.0-M15.jar (228 kB at 405 kB/s)
2018-11-13T12:19:49.669 [INFO] Downloading: https://repo.maven.apache.org/maven2/bouncycastle/bcprov-jdk15/140/bcprov-jdk15-140.jar
2018-11-13T12:19:49.674 [INFO] Downloaded: https://repo.maven.apache.org/maven2/org/apache/directory/api/api-ldap-extras-sp/1.0.0-M20/api-ldap-extras-sp-1.0.0-M20.jar (13 kB at 23 kB/s)
2018-11-13T12:19:49.674 [INFO] Downloading: https://repo.maven.apache.org/maven2/org/apache/zookeeper/zookeeper/3.4.13/zookeeper-3.4.13-tests.jar
2018-11-13T12:19:49.690 [INFO] Downloaded: https://repo.maven.apache.org/maven2/org/apache/directory/api/api-ldap-extras-codec/1.0.0-M20/api-ldap-extras-codec-1.0.0-M20.jar (208 kB at 356 kB/s)
2018-11-13T12:19:49.762 [INFO] Downloaded: https://repo.maven.apache.org/maven2/org/apache/zookeeper/zookeeper/3.4.13/zookeeper-3.4.13-tests.jar (727 kB at 1.1 MB/s)
2018-11-13T12:19:49.838 [INFO] Downloaded: https://repo.maven.apache.org/maven2/bouncycastle/bcprov-jdk15/140/bcprov-jdk15-140.jar (1.6 MB at 2.2 MB/s)
2018-11-13T12:19:49.843 [INFO] Downloaded: https://repo.maven.apache.org/maven2/org/apache/directory/api/api-all/1.0.0-M20/api-all-1.0.0-M20.jar (2.8 MB at 3.8 MB/s)
2018-11-13T12:19:50.378 [INFO] Downloaded: https://repo.maven.apache.org/maven2/org/rocksdb/rocksdbjni/5.13.1/rocksdbjni-5.13.1.jar (14 MB at 11 MB/s)
2018-11-13T12:19:50.401 [INFO]
2018-11-13T12:19:50.401 [INFO] --- maven-clean-plugin:3.0.0:clean (default-clean) @ bookkeeper-server ---
2018-11-13T12:19:50.584 [INFO]
2018-11-13T12:19:50.584 [INFO] --- apache-rat-plugin:0.12:check (default-cli) @ bookkeeper-server ---
2018-11-13T12:19:50.690 [INFO] Enabled default license matchers.
2018-11-13T12:19:50.693 [INFO] Will parse SCM ignores for exclusions...
2018-11-13T12:19:50.694 [INFO] Finished adding exclusions from SCM ignore files.
2018-11-13T12:19:50.694 [INFO] 61 implicit excludes (use -debug for more details).
2018-11-13T12:19:50.694 [INFO] Exclude: **/target/**/*
2018-11-13T12:19:50.694 [INFO] Exclude: **/.classpath
2018-11-13T12:19:50.694 [INFO] Exclude: **/.gitignore
2018-11-13T12:19:50.694 [INFO] Exclude: **/.project
2018-11-13T12:19:50.695 [INFO] Exclude: **/.checkstyle
2018-11-13T12:19:50.695 [INFO] Exclude: **/.settings/*
2018-11-13T12:19:50.695 [INFO] Exclude: src/test/resources/server-key.pem
2018-11-13T12:19:50.695 [INFO] Exclude: src/test/resources/server-key.p12
2018-11-13T12:19:50.695 [INFO] Exclude: src/test/resources/server-key.jks
2018-11-13T12:19:50.695 [INFO] Exclude: src/test/resources/server-cert.pem
2018-11-13T12:19:50.695 [INFO] Exclude: src/test/resources/client-key.pem
2018-11-13T12:19:50.695 [INFO] Exclude: src/test/resources/client-key.p12
2018-11-13T12:19:50.695 [INFO] Exclude: src/test/resources/client-key.jks
2018-11-13T12:19:50.695 [INFO] Exclude: src/test/resources/client-cert.pem
2018-11-13T12:19:50.695 [INFO] Exclude: src/test/resources/keyStoreClientPassword.txt
2018-11-13T12:19:50.695 [INFO] Exclude: src/test/resources/keyStoreServerPassword.txt
2018-11-13T12:19:50.717 [INFO] 665 resources included (use -debug for more details)
2018-11-13T12:19:51.210 [INFO] Rat check: Summary over all files. Unapproved: 0, unknown: 0, generated: 0, approved: 665 licenses.
2018-11-13T12:19:51.367 [INFO]
2018-11-13T12:19:51.367 [INFO] --- maven-remote-resources-plugin:1.5:process (process-resource-bundles) @ bookkeeper-server ---
2018-11-13T12:19:55.201 [INFO]
2018-11-13T12:19:55.201 [INFO] --- maven-resources-plugin:2.7:resources (default-resources) @ bookkeeper-server ---
2018-11-13T12:19:55.252 [INFO] Using 'UTF-8' encoding to copy filtered resources.
2018-11-13T12:19:55.252 [INFO] skip non existing resourceDirectory <https://builds.apache.org/job/bookkeeper_release_branch_48_java9/ws/bookkeeper-server/src/main/resources>
2018-11-13T12:19:55.257 [INFO] Copying 3 resources
2018-11-13T12:19:55.421 [INFO]
2018-11-13T12:19:55.421 [INFO] --- maven-compiler-plugin:3.7.0:compile (default-compile) @ bookkeeper-server ---
2018-11-13T12:19:55.634 [INFO] Changes detected - recompiling the module!
2018-11-13T12:19:55.639 [INFO] Compiling 431 source files to <https://builds.apache.org/job/bookkeeper_release_branch_48_java9/ws/bookkeeper-server/target/classes>
2018-11-13T12:20:07.031 [INFO] -------------------------------------------------------------
2018-11-13T12:20:07.031 [ERROR] COMPILATION ERROR :
2018-11-13T12:20:07.031 [INFO] -------------------------------------------------------------
2018-11-13T12:20:07.031 [ERROR] <https://builds.apache.org/job/bookkeeper_release_branch_48_java9/ws/bookkeeper-server/src/main/java/org/apache/bookkeeper/client/LedgerHandle.java>:[920,17] cannot find symbol
symbol: method isHandleWritable()
location: class org.apache.bookkeeper.client.LedgerHandle
2018-11-13T12:20:07.031 [INFO] 1 error
2018-11-13T12:20:07.031 [INFO] -------------------------------------------------------------
[JENKINS] Archiving disabled
[JENKINS] Archiving disabled
[JENKINS] Archiving disabled
[JENKINS] Archiving disabled
[JENKINS] Archiving disabled
[JENKINS] Archiving disabled
[JENKINS] Archiving disabled
[JENKINS] Archiving disabled
[JENKINS] Archiving disabled
[JENKINS] Archiving disabled
[JENKINS] Archiving disabled
[JENKINS] Archiving disabled
[JENKINS] Archiving disabled
[JENKINS] Archiving disabled
[JENKINS] Archiving disabled
[JENKINS] Archiving disabled
[JENKINS] Archiving disabled
[JENKINS] Archiving disabled
[JENKINS] Archiving disabled
[JENKINS] Archiving disabled
[JENKINS] Archiving disabled
[JENKINS] Archiving disabled
[JENKINS] Archiving disabled
[JENKINS] Archiving disabled
[JENKINS] Archiving disabled
[JENKINS] Archiving disabled
[JENKINS] Archiving disabled
[JENKINS] Archiving disabled
[JENKINS] Archiving disabled
[JENKINS] Archiving disabled
[JENKINS] Archiving disabled
[JENKINS] Archiving disabled
[JENKINS] Archiving disabled
[JENKINS] Archiving disabled
[JENKINS] Archiving disabled
[JENKINS] Archiving disabled
[JENKINS] Archiving disabled
[JENKINS] Archiving disabled
[JENKINS] Archiving disabled
[JENKINS] Archiving disabled
[JENKINS] Archiving disabled
[JENKINS] Archiving disabled
[JENKINS] Archiving disabled
[JENKINS] Archiving disabled
[JENKINS] Archiving disabled
[JENKINS] Archiving disabled
[JENKINS] Archiving disabled
[JENKINS] Archiving disabled
[JENKINS] Archiving disabled
[JENKINS] Archiving disabled
[JENKINS] Archiving disabled
[JENKINS] Archiving disabled
[JENKINS] Archiving disabled
[JENKINS] Archiving disabled
[JENKINS] Archiving disabled
[JENKINS] Archiving disabled
[JENKINS] Archiving disabled
[JENKINS] Archiving disabled
[JENKINS] Archiving disabled
[JENKINS] Archiving disabled
[JENKINS] Archiving disabled
[JENKINS] Archiving disabled
[JENKINS] Archiving disabled
[JENKINS] Archiving disabled
[JENKINS] Archiving disabled
[JENKINS] Archiving disabled
[JENKINS] Archiving disabled
[JENKINS] Archiving disabled
[JENKINS] Archiving disabled
[JENKINS] Archiving disabled
[JENKINS] Archiving disabled
[JENKINS] Archiving disabled
[JENKINS] Archiving disabled
[JENKINS] Archiving disabled
[JENKINS] Archiving disabled
[JENKINS] Archiving disabled
[JENKINS] Archiving disabled
[JENKINS] Archiving disabled
[JENKINS] Archiving disabled
2018-11-13T12:20:53.127 [INFO] ------------------------------------------------------------------------
2018-11-13T12:20:53.128 [INFO] Reactor Summary:
2018-11-13T12:20:53.128 [INFO]
2018-11-13T12:20:53.129 [INFO] Apache BookKeeper :: Parent ........................ SUCCESS [ 13.789 s]
2018-11-13T12:20:53.129 [INFO] Apache BookKeeper :: Build Tools ................... SUCCESS [ 5.671 s]
2018-11-13T12:20:53.129 [INFO] Apache BookKeeper :: Circe Checksum Library ........ SUCCESS [01:31 min]
2018-11-13T12:20:53.129 [INFO] Apache BookKeeper :: Stats API ..................... SUCCESS [ 12.556 s]
2018-11-13T12:20:53.129 [INFO] Apache BookKeeper :: Common ........................ SUCCESS [ 31.424 s]
2018-11-13T12:20:53.129 [INFO] Apache BookKeeper :: Protocols ..................... SUCCESS [ 24.631 s]
2018-11-13T12:20:53.129 [INFO] Apache BookKeeper :: Tools :: Parent ............... SUCCESS [ 2.195 s]
2018-11-13T12:20:53.129 [INFO] Apache BookKeeper :: Tools :: Framework ............ SUCCESS [ 12.512 s]
2018-11-13T12:20:53.129 [INFO] Apache BookKeeper :: Http :: Http Server ........... SUCCESS [ 8.600 s]
2018-11-13T12:20:53.129 [INFO] Apache BookKeeper :: Server ........................ FAILURE [ 20.594 s]
2018-11-13T12:20:53.130 [INFO] Apache BookKeeper :: Benchmark ..................... SKIPPED
2018-11-13T12:20:53.130 [INFO] Apache BookKeeper :: Stats Providers :: Twitter Finagle Stats SKIPPED
2018-11-13T12:20:53.130 [INFO] Apache BookKeeper :: Stats Providers :: Twitter Science Stats SKIPPED
2018-11-13T12:20:53.130 [INFO] Apache BookKeeper :: Stats Providers :: Twitter Ostrich Stats SKIPPED
2018-11-13T12:20:53.130 [INFO] Apache BookKeeper :: Stats Providers :: Codahale Metrics SKIPPED
2018-11-13T12:20:53.130 [INFO] Apache BookKeeper :: Stats Providers :: Prometheus . SKIPPED
2018-11-13T12:20:53.130 [INFO] Apache BookKeeper :: Stats Providers ............... SKIPPED
2018-11-13T12:20:53.130 [INFO] Apache BookKeeper :: Bookkeeper Http :: Twitter Http Server SKIPPED
2018-11-13T12:20:53.130 [INFO] Apache BookKeeper :: Bookkeeper Http :: Vertx Http Server SKIPPED
2018-11-13T12:20:53.130 [INFO] Apache BookKeeper :: Http .......................... SKIPPED
2018-11-13T12:20:53.130 [INFO] Apache BookKeeper :: Shaded :: Parent .............. SKIPPED
2018-11-13T12:20:53.130 [INFO] Apache BookKeeper :: Shaded :: bookkeeper-server-shaded SKIPPED
2018-11-13T12:20:53.130 [INFO] Apache BookKeeper :: Shaded :: bookkeeper-server-tests-shaded SKIPPED
2018-11-13T12:20:53.130 [INFO] Apache BookKeeper :: DistributedLog :: Parent ...... SKIPPED
2018-11-13T12:20:53.130 [INFO] Apache BookKeeper :: DistributedLog :: Common ...... SKIPPED
2018-11-13T12:20:53.130 [INFO] Apache BookKeeper :: DistributedLog :: Protocol .... SKIPPED
2018-11-13T12:20:53.130 [INFO] Apache BookKeeper :: DistributedLog :: Core Library SKIPPED
2018-11-13T12:20:53.130 [INFO] Apache BookKeeper :: Shaded :: distributedlog-core-shaded SKIPPED
2018-11-13T12:20:53.130 [INFO] Apache BookKeeper :: Tests ......................... SKIPPED
2018-11-13T12:20:53.130 [INFO] Apache BookKeeper :: Tests :: Test Shaded Jars ..... SKIPPED
2018-11-13T12:20:53.130 [INFO] Apache BookKeeper :: Tests :: bookkeeper-server-shaded test SKIPPED
2018-11-13T12:20:53.130 [INFO] Apache BookKeeper :: Tests :: bookkeeper-server-tests-shaded test SKIPPED
2018-11-13T12:20:53.130 [INFO] Apache BookKeeper :: Tests :: distributedlog-core-shaded test SKIPPED
2018-11-13T12:20:53.130 [INFO] Apache BookKeeper :: Tests :: Docker Images ........ SKIPPED
2018-11-13T12:20:53.130 [INFO] Apache BookKeeper :: Tests :: Docker Images :: All Released Versions SKIPPED
2018-11-13T12:20:53.130 [INFO] Apache BookKeeper :: Stream Storage :: Parent ...... SKIPPED
2018-11-13T12:20:53.130 [INFO] Apache BookKeeper :: Stream Storage :: Common Classes for Tests SKIPPED
2018-11-13T12:20:53.131 [INFO] Apache BookKeeper :: Stream Storage :: Common ...... SKIPPED
2018-11-13T12:20:53.131 [INFO] Apache BookKeeper :: Stream Storage :: API ......... SKIPPED
2018-11-13T12:20:53.131 [INFO] Apache BookKeeper :: Stream Storage :: Proto ....... SKIPPED
2018-11-13T12:20:53.131 [INFO] Apache BookKeeper :: Stream Storage :: Clients :: Parent SKIPPED
2018-11-13T12:20:53.131 [INFO] Apache BookKeeper :: Stream Storage :: Clients :: Java Client :: Parent SKIPPED
2018-11-13T12:20:53.131 [INFO] Apache BookKeeper :: Stream Storage :: Clients :: Java Client :: Base SKIPPED
2018-11-13T12:20:53.131 [INFO] Apache BookKeeper :: Stream Storage :: Clients :: Java Client :: KV SKIPPED
2018-11-13T12:20:53.131 [INFO] Apache BookKeeper :: Stream Storage :: Clients :: Java Client SKIPPED
2018-11-13T12:20:53.131 [INFO] Apache BookKeeper :: Stream Storage :: Storage :: Parent SKIPPED
2018-11-13T12:20:53.131 [INFO] Apache BookKeeper :: Stream Storage :: Storage :: Api SKIPPED
2018-11-13T12:20:53.131 [INFO] Apache BookKeeper :: Stream Storage :: State Library SKIPPED
2018-11-13T12:20:53.131 [INFO] Apache BookKeeper :: Stream Storage :: Storage :: Impl SKIPPED
2018-11-13T12:20:53.131 [INFO] Apache BookKeeper :: Tools :: Stream ............... SKIPPED
2018-11-13T12:20:53.131 [INFO] Apache BookKeeper :: Tools ......................... SKIPPED
2018-11-13T12:20:53.131 [INFO] Apache BookKeeper :: Stream Storage :: Server ...... SKIPPED
2018-11-13T12:20:53.131 [INFO] Apache BookKeeper :: Dist (Parent) ................. SKIPPED
2018-11-13T12:20:53.131 [INFO] Apache BookKeeper :: Dist (Server) ................. SKIPPED
2018-11-13T12:20:53.131 [INFO] Apache BookKeeper :: Tests :: Docker Images :: All Versions SKIPPED
2018-11-13T12:20:53.131 [INFO] Apache BookKeeper :: Tests :: Docker Images :: Current Version SKIPPED
2018-11-13T12:20:53.131 [INFO] Apache BookKeeper :: Tests :: Utility module for Arquillian based integration tests SKIPPED
2018-11-13T12:20:53.131 [INFO] Apache BookKeeper :: Tests :: Common topologies for Docker based integration tests SKIPPED
2018-11-13T12:20:53.131 [INFO] Apache BookKeeper :: Tests :: Base module for Arquillian based integration tests SKIPPED
2018-11-13T12:20:53.131 [INFO] Apache BookKeeper :: Tests :: Base module for Arquillian based integration tests using groovy SKIPPED
2018-11-13T12:20:53.131 [INFO] Apache BookKeeper :: Tests :: Backward Compatibility SKIPPED
2018-11-13T12:20:53.131 [INFO] Apache BookKeeper :: Tests :: Backward Compatibility :: Test upgrade between all released versions and current version SKIPPED
2018-11-13T12:20:53.131 [INFO] Apache BookKeeper :: Tests :: Backward Compatibility :: Test upgrade between 4.1.0 and current version SKIPPED
2018-11-13T12:20:53.131 [INFO] Apache BookKeeper :: Tests :: Backward Compatibility :: Test compat between old version and new version of hierarchical ledger manager SKIPPED
2018-11-13T12:20:53.132 [INFO] Apache BookKeeper :: Tests :: Backward Compatibility :: Test upgrade between 4.1.0 and current version (with hostname bookie ID) SKIPPED
2018-11-13T12:20:53.132 [INFO] Apache BookKeeper :: Tests :: Backward Compatibility :: Test recovery does not work when password no in metadata SKIPPED
2018-11-13T12:20:53.132 [INFO] Apache BookKeeper :: Tests :: Backward Compatibility :: Test upgrade 4.1.0 to current in cluster with cookies SKIPPED
2018-11-13T12:20:53.132 [INFO] Apache BookKeeper :: Tests :: Backward Compatibility :: Test old clients working on current server SKIPPED
2018-11-13T12:20:53.132 [INFO] Apache BookKeeper :: Tests :: Backward Compatibility :: Test upgrade between yahoo custom version and current SKIPPED
2018-11-13T12:20:53.132 [INFO] Apache BookKeeper :: Tests :: Integration .......... SKIPPED
2018-11-13T12:20:53.132 [INFO] Apache BookKeeper :: Tests :: Integration :: Smoke test SKIPPED
2018-11-13T12:20:53.132 [INFO] Apache BookKeeper :: Tests :: Integration :: Standalone test SKIPPED
2018-11-13T12:20:53.132 [INFO] Apache BookKeeper :: Tests :: Integration :: Cluster test SKIPPED
2018-11-13T12:20:53.132 [INFO] Apache BookKeeper :: Tests :: Bash Scripts Test .... SKIPPED
2018-11-13T12:20:53.132 [INFO] Apache BookKeeper :: Dist (All) .................... SKIPPED
2018-11-13T12:20:53.132 [INFO] Apache BookKeeper :: microbenchmarks ............... SKIPPED
2018-11-13T12:20:53.132 [INFO] Apache BookKeeper :: DistributedLog :: IO :: FileSystem SKIPPED
2018-11-13T12:20:53.132 [INFO] Apache BookKeeper :: DistributedLog :: IO .......... SKIPPED
2018-11-13T12:20:53.132 [INFO] ------------------------------------------------------------------------
2018-11-13T12:20:53.132 [INFO] BUILD FAILURE
2018-11-13T12:20:53.132 [INFO] ------------------------------------------------------------------------
2018-11-13T12:20:53.132 [INFO] Total time: 05:22 min
2018-11-13T12:20:53.133 [INFO] Finished at: 2018-11-13T12:20:53Z
2018-11-13T12:20:54.240 [INFO] Final Memory: 101M/2048M
2018-11-13T12:20:54.240 [INFO] ------------------------------------------------------------------------
2018-11-13T12:20:54.246 [ERROR] Failed to execute goal org.apache.maven.plugins:maven-compiler-plugin:3.7.0:compile (default-compile) on project bookkeeper-server: Compilation failure
2018-11-13T12:20:54.246 [ERROR] <https://builds.apache.org/job/bookkeeper_release_branch_48_java9/ws/bookkeeper-server/src/main/java/org/apache/bookkeeper/client/LedgerHandle.java>:[920,17] cannot find symbol
2018-11-13T12:20:54.246 [ERROR] symbol: method isHandleWritable()
2018-11-13T12:20:54.246 [ERROR] location: class org.apache.bookkeeper.client.LedgerHandle
2018-11-13T12:20:54.246 [ERROR] -> [Help 1]
2018-11-13T12:20:54.247 [ERROR]
2018-11-13T12:20:54.247 [ERROR] To see the full stack trace of the errors, re-run Maven with the -e switch.
2018-11-13T12:20:54.247 [ERROR] Re-run Maven using the -X switch to enable full debug logging.
2018-11-13T12:20:54.247 [ERROR]
2018-11-13T12:20:54.247 [ERROR] For more information about the errors and possible solutions, please read the following articles:
2018-11-13T12:20:54.247 [ERROR] [Help 1] http://cwiki.apache.org/confluence/display/MAVEN/MojoFailureException
2018-11-13T12:20:54.247 [ERROR]
2018-11-13T12:20:54.247 [ERROR] After correcting the problems, you can resume the build with the command
2018-11-13T12:20:54.247 [ERROR] mvn <goals> -rf :bookkeeper-server
channel stopped
Build failed in Jenkins: bookkeeper_release_branch_48_java9 #89
Posted by Apache Jenkins Server <je...@builds.apache.org>.
See <https://builds.apache.org/job/bookkeeper_release_branch_48_java9/89/display/redirect?page=changes>
Changes:
[sijie] Fixed Auth with v2 protocol
[sijie] Fix bugs in DefaultEnsemblePlacementPolicy
------------------------------------------
[...truncated 507.23 KB...]
2018-11-12T12:20:21.563 [INFO] Downloading: https://repo.maven.apache.org/maven2/org/apache/directory/server/apacheds-jdbm-partition/2.0.0-M15/apacheds-jdbm-partition-2.0.0-M15.jar
2018-11-12T12:20:21.566 [INFO] Downloaded: https://repo.maven.apache.org/maven2/commons-pool/commons-pool/1.6/commons-pool-1.6.jar (111 kB at 201 kB/s)
2018-11-12T12:20:21.566 [INFO] Downloading: https://repo.maven.apache.org/maven2/org/apache/directory/jdbm/apacheds-jdbm1/2.0.0-M2/apacheds-jdbm1-2.0.0-M2.jar
2018-11-12T12:20:21.585 [INFO] Downloaded: https://repo.maven.apache.org/maven2/org/apache/directory/server/apacheds-jdbm-partition/2.0.0-M15/apacheds-jdbm-partition-2.0.0-M15.jar (72 kB at 127 kB/s)
2018-11-12T12:20:21.585 [INFO] Downloading: https://repo.maven.apache.org/maven2/org/apache/directory/server/apacheds-protocol-ldap/2.0.0-M15/apacheds-protocol-ldap-2.0.0-M15.jar
2018-11-12T12:20:21.590 [INFO] Downloaded: https://repo.maven.apache.org/maven2/org/apache/directory/jdbm/apacheds-jdbm1/2.0.0-M2/apacheds-jdbm1-2.0.0-M2.jar (105 kB at 182 kB/s)
2018-11-12T12:20:21.590 [INFO] Downloading: https://repo.maven.apache.org/maven2/org/apache/directory/api/api-asn1-ber/1.0.0-M20/api-asn1-ber-1.0.0-M20.jar
2018-11-12T12:20:21.607 [INFO] Downloaded: https://repo.maven.apache.org/maven2/org/apache/directory/api/api-asn1-ber/1.0.0-M20/api-asn1-ber-1.0.0-M20.jar (42 kB at 71 kB/s)
2018-11-12T12:20:21.607 [INFO] Downloading: https://repo.maven.apache.org/maven2/org/apache/directory/api/api-ldap-extras-codec-api/1.0.0-M20/api-ldap-extras-codec-api-1.0.0-M20.jar
2018-11-12T12:20:21.615 [INFO] Downloaded: https://repo.maven.apache.org/maven2/antlr/antlr/2.7.7/antlr-2.7.7.jar (445 kB at 741 kB/s)
2018-11-12T12:20:21.615 [INFO] Downloading: https://repo.maven.apache.org/maven2/org/apache/directory/api/api-ldap-extras-codec/1.0.0-M20/api-ldap-extras-codec-1.0.0-M20.jar
2018-11-12T12:20:21.623 [INFO] Downloaded: https://repo.maven.apache.org/maven2/org/apache/directory/server/apacheds-protocol-ldap/2.0.0-M15/apacheds-protocol-ldap-2.0.0-M15.jar (228 kB at 375 kB/s)
2018-11-12T12:20:21.624 [INFO] Downloading: https://repo.maven.apache.org/maven2/org/apache/directory/api/api-ldap-extras-sp/1.0.0-M20/api-ldap-extras-sp-1.0.0-M20.jar
2018-11-12T12:20:21.624 [INFO] Downloaded: https://repo.maven.apache.org/maven2/org/apache/directory/api/api-ldap-extras-codec-api/1.0.0-M20/api-ldap-extras-codec-api-1.0.0-M20.jar (55 kB at 90 kB/s)
2018-11-12T12:20:21.624 [INFO] Downloading: https://repo.maven.apache.org/maven2/bouncycastle/bcprov-jdk15/140/bcprov-jdk15-140.jar
2018-11-12T12:20:21.636 [INFO] Downloaded: https://repo.maven.apache.org/maven2/org/apache/directory/api/api-ldap-extras-sp/1.0.0-M20/api-ldap-extras-sp-1.0.0-M20.jar (13 kB at 21 kB/s)
2018-11-12T12:20:21.636 [INFO] Downloading: https://repo.maven.apache.org/maven2/org/apache/zookeeper/zookeeper/3.4.13/zookeeper-3.4.13-tests.jar
2018-11-12T12:20:21.656 [INFO] Downloaded: https://repo.maven.apache.org/maven2/org/apache/directory/api/api-ldap-extras-codec/1.0.0-M20/api-ldap-extras-codec-1.0.0-M20.jar (208 kB at 324 kB/s)
2018-11-12T12:20:21.743 [INFO] Downloaded: https://repo.maven.apache.org/maven2/org/apache/zookeeper/zookeeper/3.4.13/zookeeper-3.4.13-tests.jar (727 kB at 998 kB/s)
2018-11-12T12:20:21.816 [INFO] Downloaded: https://repo.maven.apache.org/maven2/bouncycastle/bcprov-jdk15/140/bcprov-jdk15-140.jar (1.6 MB at 2.0 MB/s)
2018-11-12T12:20:21.881 [INFO] Downloaded: https://repo.maven.apache.org/maven2/org/apache/directory/api/api-all/1.0.0-M20/api-all-1.0.0-M20.jar (2.8 MB at 3.2 MB/s)
2018-11-12T12:20:22.516 [INFO] Downloaded: https://repo.maven.apache.org/maven2/org/rocksdb/rocksdbjni/5.13.1/rocksdbjni-5.13.1.jar (14 MB at 9.2 MB/s)
2018-11-12T12:20:22.560 [INFO]
2018-11-12T12:20:22.560 [INFO] --- maven-clean-plugin:3.0.0:clean (default-clean) @ bookkeeper-server ---
2018-11-12T12:20:22.762 [INFO]
2018-11-12T12:20:22.762 [INFO] --- apache-rat-plugin:0.12:check (default-cli) @ bookkeeper-server ---
2018-11-12T12:20:22.938 [INFO] Enabled default license matchers.
2018-11-12T12:20:22.943 [INFO] Will parse SCM ignores for exclusions...
2018-11-12T12:20:22.945 [INFO] Finished adding exclusions from SCM ignore files.
2018-11-12T12:20:22.945 [INFO] 61 implicit excludes (use -debug for more details).
2018-11-12T12:20:22.945 [INFO] Exclude: **/target/**/*
2018-11-12T12:20:22.945 [INFO] Exclude: **/.classpath
2018-11-12T12:20:22.945 [INFO] Exclude: **/.gitignore
2018-11-12T12:20:22.945 [INFO] Exclude: **/.project
2018-11-12T12:20:22.945 [INFO] Exclude: **/.checkstyle
2018-11-12T12:20:22.945 [INFO] Exclude: **/.settings/*
2018-11-12T12:20:22.945 [INFO] Exclude: src/test/resources/server-key.pem
2018-11-12T12:20:22.945 [INFO] Exclude: src/test/resources/server-key.p12
2018-11-12T12:20:22.945 [INFO] Exclude: src/test/resources/server-key.jks
2018-11-12T12:20:22.945 [INFO] Exclude: src/test/resources/server-cert.pem
2018-11-12T12:20:22.945 [INFO] Exclude: src/test/resources/client-key.pem
2018-11-12T12:20:22.945 [INFO] Exclude: src/test/resources/client-key.p12
2018-11-12T12:20:22.945 [INFO] Exclude: src/test/resources/client-key.jks
2018-11-12T12:20:22.945 [INFO] Exclude: src/test/resources/client-cert.pem
2018-11-12T12:20:22.945 [INFO] Exclude: src/test/resources/keyStoreClientPassword.txt
2018-11-12T12:20:22.945 [INFO] Exclude: src/test/resources/keyStoreServerPassword.txt
2018-11-12T12:20:22.983 [INFO] 665 resources included (use -debug for more details)
2018-11-12T12:20:23.606 [INFO] Rat check: Summary over all files. Unapproved: 0, unknown: 0, generated: 0, approved: 665 licenses.
2018-11-12T12:20:23.765 [INFO]
2018-11-12T12:20:23.765 [INFO] --- maven-remote-resources-plugin:1.5:process (process-resource-bundles) @ bookkeeper-server ---
2018-11-12T12:20:27.991 [INFO]
2018-11-12T12:20:27.992 [INFO] --- maven-resources-plugin:2.7:resources (default-resources) @ bookkeeper-server ---
2018-11-12T12:20:28.076 [INFO] Using 'UTF-8' encoding to copy filtered resources.
2018-11-12T12:20:28.076 [INFO] skip non existing resourceDirectory <https://builds.apache.org/job/bookkeeper_release_branch_48_java9/ws/bookkeeper-server/src/main/resources>
2018-11-12T12:20:28.082 [INFO] Copying 3 resources
2018-11-12T12:20:28.249 [INFO]
2018-11-12T12:20:28.249 [INFO] --- maven-compiler-plugin:3.7.0:compile (default-compile) @ bookkeeper-server ---
2018-11-12T12:20:28.460 [INFO] Changes detected - recompiling the module!
2018-11-12T12:20:28.467 [INFO] Compiling 431 source files to <https://builds.apache.org/job/bookkeeper_release_branch_48_java9/ws/bookkeeper-server/target/classes>
2018-11-12T12:20:42.798 [INFO] -------------------------------------------------------------
2018-11-12T12:20:42.798 [ERROR] COMPILATION ERROR :
2018-11-12T12:20:42.798 [INFO] -------------------------------------------------------------
2018-11-12T12:20:42.798 [ERROR] <https://builds.apache.org/job/bookkeeper_release_branch_48_java9/ws/bookkeeper-server/src/main/java/org/apache/bookkeeper/client/LedgerHandle.java>:[920,17] cannot find symbol
symbol: method isHandleWritable()
location: class org.apache.bookkeeper.client.LedgerHandle
2018-11-12T12:20:42.798 [INFO] 1 error
2018-11-12T12:20:42.798 [INFO] -------------------------------------------------------------
[JENKINS] Archiving disabled
[JENKINS] Archiving disabled
[JENKINS] Archiving disabled
[JENKINS] Archiving disabled
[JENKINS] Archiving disabled
[JENKINS] Archiving disabled
[JENKINS] Archiving disabled
[JENKINS] Archiving disabled
[JENKINS] Archiving disabled
[JENKINS] Archiving disabled
[JENKINS] Archiving disabled
[JENKINS] Archiving disabled
[JENKINS] Archiving disabled
[JENKINS] Archiving disabled
[JENKINS] Archiving disabled
[JENKINS] Archiving disabled
[JENKINS] Archiving disabled
[JENKINS] Archiving disabled
[JENKINS] Archiving disabled
[JENKINS] Archiving disabled
[JENKINS] Archiving disabled
[JENKINS] Archiving disabled
[JENKINS] Archiving disabled
[JENKINS] Archiving disabled
[JENKINS] Archiving disabled
[JENKINS] Archiving disabled
[JENKINS] Archiving disabled
[JENKINS] Archiving disabled
[JENKINS] Archiving disabled
[JENKINS] Archiving disabled
[JENKINS] Archiving disabled
[JENKINS] Archiving disabled
[JENKINS] Archiving disabled
[JENKINS] Archiving disabled
[JENKINS] Archiving disabled
[JENKINS] Archiving disabled
[JENKINS] Archiving disabled
[JENKINS] Archiving disabled
[JENKINS] Archiving disabled
[JENKINS] Archiving disabled
[JENKINS] Archiving disabled
[JENKINS] Archiving disabled
[JENKINS] Archiving disabled
[JENKINS] Archiving disabled
[JENKINS] Archiving disabled
[JENKINS] Archiving disabled
[JENKINS] Archiving disabled
[JENKINS] Archiving disabled
[JENKINS] Archiving disabled
[JENKINS] Archiving disabled
[JENKINS] Archiving disabled
[JENKINS] Archiving disabled
[JENKINS] Archiving disabled
[JENKINS] Archiving disabled
[JENKINS] Archiving disabled
[JENKINS] Archiving disabled
[JENKINS] Archiving disabled
[JENKINS] Archiving disabled
[JENKINS] Archiving disabled
[JENKINS] Archiving disabled
[JENKINS] Archiving disabled
[JENKINS] Archiving disabled
[JENKINS] Archiving disabled
[JENKINS] Archiving disabled
[JENKINS] Archiving disabled
[JENKINS] Archiving disabled
[JENKINS] Archiving disabled
[JENKINS] Archiving disabled
[JENKINS] Archiving disabled
[JENKINS] Archiving disabled
[JENKINS] Archiving disabled
[JENKINS] Archiving disabled
[JENKINS] Archiving disabled
[JENKINS] Archiving disabled
[JENKINS] Archiving disabled
[JENKINS] Archiving disabled
[JENKINS] Archiving disabled
[JENKINS] Archiving disabled
[JENKINS] Archiving disabled
2018-11-12T12:21:29.852 [INFO] ------------------------------------------------------------------------
2018-11-12T12:21:29.852 [INFO] Reactor Summary:
2018-11-12T12:21:29.852 [INFO]
2018-11-12T12:21:29.853 [INFO] Apache BookKeeper :: Parent ........................ SUCCESS [ 15.561 s]
2018-11-12T12:21:29.854 [INFO] Apache BookKeeper :: Build Tools ................... SUCCESS [ 6.062 s]
2018-11-12T12:21:29.854 [INFO] Apache BookKeeper :: Circe Checksum Library ........ SUCCESS [01:40 min]
2018-11-12T12:21:29.854 [INFO] Apache BookKeeper :: Stats API ..................... SUCCESS [ 14.887 s]
2018-11-12T12:21:29.854 [INFO] Apache BookKeeper :: Common ........................ SUCCESS [ 39.270 s]
2018-11-12T12:21:29.854 [INFO] Apache BookKeeper :: Protocols ..................... SUCCESS [ 28.643 s]
2018-11-12T12:21:29.854 [INFO] Apache BookKeeper :: Tools :: Parent ............... SUCCESS [ 2.243 s]
2018-11-12T12:21:29.854 [INFO] Apache BookKeeper :: Tools :: Framework ............ SUCCESS [ 14.246 s]
2018-11-12T12:21:29.854 [INFO] Apache BookKeeper :: Http :: Http Server ........... SUCCESS [ 9.909 s]
2018-11-12T12:21:29.855 [INFO] Apache BookKeeper :: Server ........................ FAILURE [ 24.763 s]
2018-11-12T12:21:29.855 [INFO] Apache BookKeeper :: Benchmark ..................... SKIPPED
2018-11-12T12:21:29.855 [INFO] Apache BookKeeper :: Stats Providers :: Twitter Finagle Stats SKIPPED
2018-11-12T12:21:29.855 [INFO] Apache BookKeeper :: Stats Providers :: Twitter Science Stats SKIPPED
2018-11-12T12:21:29.855 [INFO] Apache BookKeeper :: Stats Providers :: Twitter Ostrich Stats SKIPPED
2018-11-12T12:21:29.855 [INFO] Apache BookKeeper :: Stats Providers :: Codahale Metrics SKIPPED
2018-11-12T12:21:29.855 [INFO] Apache BookKeeper :: Stats Providers :: Prometheus . SKIPPED
2018-11-12T12:21:29.855 [INFO] Apache BookKeeper :: Stats Providers ............... SKIPPED
2018-11-12T12:21:29.855 [INFO] Apache BookKeeper :: Bookkeeper Http :: Twitter Http Server SKIPPED
2018-11-12T12:21:29.855 [INFO] Apache BookKeeper :: Bookkeeper Http :: Vertx Http Server SKIPPED
2018-11-12T12:21:29.855 [INFO] Apache BookKeeper :: Http .......................... SKIPPED
2018-11-12T12:21:29.855 [INFO] Apache BookKeeper :: Shaded :: Parent .............. SKIPPED
2018-11-12T12:21:29.855 [INFO] Apache BookKeeper :: Shaded :: bookkeeper-server-shaded SKIPPED
2018-11-12T12:21:29.856 [INFO] Apache BookKeeper :: Shaded :: bookkeeper-server-tests-shaded SKIPPED
2018-11-12T12:21:29.856 [INFO] Apache BookKeeper :: DistributedLog :: Parent ...... SKIPPED
2018-11-12T12:21:29.856 [INFO] Apache BookKeeper :: DistributedLog :: Common ...... SKIPPED
2018-11-12T12:21:29.856 [INFO] Apache BookKeeper :: DistributedLog :: Protocol .... SKIPPED
2018-11-12T12:21:29.856 [INFO] Apache BookKeeper :: DistributedLog :: Core Library SKIPPED
2018-11-12T12:21:29.856 [INFO] Apache BookKeeper :: Shaded :: distributedlog-core-shaded SKIPPED
2018-11-12T12:21:29.856 [INFO] Apache BookKeeper :: Tests ......................... SKIPPED
2018-11-12T12:21:29.856 [INFO] Apache BookKeeper :: Tests :: Test Shaded Jars ..... SKIPPED
2018-11-12T12:21:29.856 [INFO] Apache BookKeeper :: Tests :: bookkeeper-server-shaded test SKIPPED
2018-11-12T12:21:29.856 [INFO] Apache BookKeeper :: Tests :: bookkeeper-server-tests-shaded test SKIPPED
2018-11-12T12:21:29.856 [INFO] Apache BookKeeper :: Tests :: distributedlog-core-shaded test SKIPPED
2018-11-12T12:21:29.856 [INFO] Apache BookKeeper :: Tests :: Docker Images ........ SKIPPED
2018-11-12T12:21:29.856 [INFO] Apache BookKeeper :: Tests :: Docker Images :: All Released Versions SKIPPED
2018-11-12T12:21:29.856 [INFO] Apache BookKeeper :: Stream Storage :: Parent ...... SKIPPED
2018-11-12T12:21:29.856 [INFO] Apache BookKeeper :: Stream Storage :: Common Classes for Tests SKIPPED
2018-11-12T12:21:29.856 [INFO] Apache BookKeeper :: Stream Storage :: Common ...... SKIPPED
2018-11-12T12:21:29.856 [INFO] Apache BookKeeper :: Stream Storage :: API ......... SKIPPED
2018-11-12T12:21:29.856 [INFO] Apache BookKeeper :: Stream Storage :: Proto ....... SKIPPED
2018-11-12T12:21:29.856 [INFO] Apache BookKeeper :: Stream Storage :: Clients :: Parent SKIPPED
2018-11-12T12:21:29.856 [INFO] Apache BookKeeper :: Stream Storage :: Clients :: Java Client :: Parent SKIPPED
2018-11-12T12:21:29.856 [INFO] Apache BookKeeper :: Stream Storage :: Clients :: Java Client :: Base SKIPPED
2018-11-12T12:21:29.856 [INFO] Apache BookKeeper :: Stream Storage :: Clients :: Java Client :: KV SKIPPED
2018-11-12T12:21:29.856 [INFO] Apache BookKeeper :: Stream Storage :: Clients :: Java Client SKIPPED
2018-11-12T12:21:29.857 [INFO] Apache BookKeeper :: Stream Storage :: Storage :: Parent SKIPPED
2018-11-12T12:21:29.857 [INFO] Apache BookKeeper :: Stream Storage :: Storage :: Api SKIPPED
2018-11-12T12:21:29.857 [INFO] Apache BookKeeper :: Stream Storage :: State Library SKIPPED
2018-11-12T12:21:29.857 [INFO] Apache BookKeeper :: Stream Storage :: Storage :: Impl SKIPPED
2018-11-12T12:21:29.857 [INFO] Apache BookKeeper :: Tools :: Stream ............... SKIPPED
2018-11-12T12:21:29.857 [INFO] Apache BookKeeper :: Tools ......................... SKIPPED
2018-11-12T12:21:29.857 [INFO] Apache BookKeeper :: Stream Storage :: Server ...... SKIPPED
2018-11-12T12:21:29.857 [INFO] Apache BookKeeper :: Dist (Parent) ................. SKIPPED
2018-11-12T12:21:29.857 [INFO] Apache BookKeeper :: Dist (Server) ................. SKIPPED
2018-11-12T12:21:29.857 [INFO] Apache BookKeeper :: Tests :: Docker Images :: All Versions SKIPPED
2018-11-12T12:21:29.857 [INFO] Apache BookKeeper :: Tests :: Docker Images :: Current Version SKIPPED
2018-11-12T12:21:29.857 [INFO] Apache BookKeeper :: Tests :: Utility module for Arquillian based integration tests SKIPPED
2018-11-12T12:21:29.857 [INFO] Apache BookKeeper :: Tests :: Common topologies for Docker based integration tests SKIPPED
2018-11-12T12:21:29.857 [INFO] Apache BookKeeper :: Tests :: Base module for Arquillian based integration tests SKIPPED
2018-11-12T12:21:29.857 [INFO] Apache BookKeeper :: Tests :: Base module for Arquillian based integration tests using groovy SKIPPED
2018-11-12T12:21:29.857 [INFO] Apache BookKeeper :: Tests :: Backward Compatibility SKIPPED
2018-11-12T12:21:29.857 [INFO] Apache BookKeeper :: Tests :: Backward Compatibility :: Test upgrade between all released versions and current version SKIPPED
2018-11-12T12:21:29.857 [INFO] Apache BookKeeper :: Tests :: Backward Compatibility :: Test upgrade between 4.1.0 and current version SKIPPED
2018-11-12T12:21:29.857 [INFO] Apache BookKeeper :: Tests :: Backward Compatibility :: Test compat between old version and new version of hierarchical ledger manager SKIPPED
2018-11-12T12:21:29.857 [INFO] Apache BookKeeper :: Tests :: Backward Compatibility :: Test upgrade between 4.1.0 and current version (with hostname bookie ID) SKIPPED
2018-11-12T12:21:29.857 [INFO] Apache BookKeeper :: Tests :: Backward Compatibility :: Test recovery does not work when password no in metadata SKIPPED
2018-11-12T12:21:29.857 [INFO] Apache BookKeeper :: Tests :: Backward Compatibility :: Test upgrade 4.1.0 to current in cluster with cookies SKIPPED
2018-11-12T12:21:29.857 [INFO] Apache BookKeeper :: Tests :: Backward Compatibility :: Test old clients working on current server SKIPPED
2018-11-12T12:21:29.857 [INFO] Apache BookKeeper :: Tests :: Backward Compatibility :: Test upgrade between yahoo custom version and current SKIPPED
2018-11-12T12:21:29.857 [INFO] Apache BookKeeper :: Tests :: Integration .......... SKIPPED
2018-11-12T12:21:29.858 [INFO] Apache BookKeeper :: Tests :: Integration :: Smoke test SKIPPED
2018-11-12T12:21:29.858 [INFO] Apache BookKeeper :: Tests :: Integration :: Standalone test SKIPPED
2018-11-12T12:21:29.858 [INFO] Apache BookKeeper :: Tests :: Integration :: Cluster test SKIPPED
2018-11-12T12:21:29.858 [INFO] Apache BookKeeper :: Tests :: Bash Scripts Test .... SKIPPED
2018-11-12T12:21:29.858 [INFO] Apache BookKeeper :: Dist (All) .................... SKIPPED
2018-11-12T12:21:29.858 [INFO] Apache BookKeeper :: microbenchmarks ............... SKIPPED
2018-11-12T12:21:29.858 [INFO] Apache BookKeeper :: DistributedLog :: IO :: FileSystem SKIPPED
2018-11-12T12:21:29.858 [INFO] Apache BookKeeper :: DistributedLog :: IO .......... SKIPPED
2018-11-12T12:21:29.858 [INFO] ------------------------------------------------------------------------
2018-11-12T12:21:29.858 [INFO] BUILD FAILURE
2018-11-12T12:21:29.858 [INFO] ------------------------------------------------------------------------
2018-11-12T12:21:29.858 [INFO] Total time: 06:03 min
2018-11-12T12:21:29.859 [INFO] Finished at: 2018-11-12T12:21:29Z
2018-11-12T12:21:30.949 [INFO] Final Memory: 101M/2048M
2018-11-12T12:21:30.950 [INFO] ------------------------------------------------------------------------
2018-11-12T12:21:30.960 [ERROR] Failed to execute goal org.apache.maven.plugins:maven-compiler-plugin:3.7.0:compile (default-compile) on project bookkeeper-server: Compilation failure
2018-11-12T12:21:30.960 [ERROR] <https://builds.apache.org/job/bookkeeper_release_branch_48_java9/ws/bookkeeper-server/src/main/java/org/apache/bookkeeper/client/LedgerHandle.java>:[920,17] cannot find symbol
2018-11-12T12:21:30.960 [ERROR] symbol: method isHandleWritable()
2018-11-12T12:21:30.960 [ERROR] location: class org.apache.bookkeeper.client.LedgerHandle
2018-11-12T12:21:30.960 [ERROR] -> [Help 1]
2018-11-12T12:21:30.961 [ERROR]
2018-11-12T12:21:30.961 [ERROR] To see the full stack trace of the errors, re-run Maven with the -e switch.
2018-11-12T12:21:30.961 [ERROR] Re-run Maven using the -X switch to enable full debug logging.
2018-11-12T12:21:30.961 [ERROR]
2018-11-12T12:21:30.961 [ERROR] For more information about the errors and possible solutions, please read the following articles:
2018-11-12T12:21:30.961 [ERROR] [Help 1] http://cwiki.apache.org/confluence/display/MAVEN/MojoFailureException
2018-11-12T12:21:30.961 [ERROR]
2018-11-12T12:21:30.961 [ERROR] After correcting the problems, you can resume the build with the command
2018-11-12T12:21:30.961 [ERROR] mvn <goals> -rf :bookkeeper-server
channel stopped
Build failed in Jenkins: bookkeeper_release_branch_48_java9 #88
Posted by Apache Jenkins Server <je...@builds.apache.org>.
See <https://builds.apache.org/job/bookkeeper_release_branch_48_java9/88/display/redirect>
------------------------------------------
[...truncated 507.39 KB...]
2018-11-11T12:19:42.892 [INFO] Downloaded: https://repo.maven.apache.org/maven2/org/apache/directory/server/apacheds-kerberos-codec/2.0.0-M15/apacheds-kerberos-codec-2.0.0-M15.jar (691 kB at 1.3 MB/s)
2018-11-11T12:19:42.892 [INFO] Downloading: https://repo.maven.apache.org/maven2/org/apache/directory/jdbm/apacheds-jdbm1/2.0.0-M2/apacheds-jdbm1-2.0.0-M2.jar
2018-11-11T12:19:42.903 [INFO] Downloaded: https://repo.maven.apache.org/maven2/org/apache/directory/server/apacheds-jdbm-partition/2.0.0-M15/apacheds-jdbm-partition-2.0.0-M15.jar (72 kB at 130 kB/s)
2018-11-11T12:19:42.903 [INFO] Downloading: https://repo.maven.apache.org/maven2/org/apache/directory/server/apacheds-protocol-ldap/2.0.0-M15/apacheds-protocol-ldap-2.0.0-M15.jar
2018-11-11T12:19:42.914 [INFO] Downloaded: https://repo.maven.apache.org/maven2/org/apache/directory/jdbm/apacheds-jdbm1/2.0.0-M2/apacheds-jdbm1-2.0.0-M2.jar (105 kB at 184 kB/s)
2018-11-11T12:19:42.914 [INFO] Downloading: https://repo.maven.apache.org/maven2/org/apache/directory/api/api-asn1-ber/1.0.0-M20/api-asn1-ber-1.0.0-M20.jar
2018-11-11T12:19:42.926 [INFO] Downloaded: https://repo.maven.apache.org/maven2/antlr/antlr/2.7.7/antlr-2.7.7.jar (445 kB at 765 kB/s)
2018-11-11T12:19:42.926 [INFO] Downloading: https://repo.maven.apache.org/maven2/org/apache/directory/api/api-ldap-extras-codec-api/1.0.0-M20/api-ldap-extras-codec-api-1.0.0-M20.jar
2018-11-11T12:19:42.931 [INFO] Downloaded: https://repo.maven.apache.org/maven2/org/apache/directory/api/api-asn1-ber/1.0.0-M20/api-asn1-ber-1.0.0-M20.jar (42 kB at 72 kB/s)
2018-11-11T12:19:42.931 [INFO] Downloading: https://repo.maven.apache.org/maven2/org/apache/directory/api/api-ldap-extras-codec/1.0.0-M20/api-ldap-extras-codec-1.0.0-M20.jar
2018-11-11T12:19:42.939 [INFO] Downloaded: https://repo.maven.apache.org/maven2/org/apache/directory/server/apacheds-protocol-ldap/2.0.0-M15/apacheds-protocol-ldap-2.0.0-M15.jar (228 kB at 384 kB/s)
2018-11-11T12:19:42.939 [INFO] Downloading: https://repo.maven.apache.org/maven2/org/apache/directory/api/api-ldap-extras-sp/1.0.0-M20/api-ldap-extras-sp-1.0.0-M20.jar
2018-11-11T12:19:42.944 [INFO] Downloaded: https://repo.maven.apache.org/maven2/org/apache/directory/api/api-ldap-extras-codec-api/1.0.0-M20/api-ldap-extras-codec-api-1.0.0-M20.jar (55 kB at 91 kB/s)
2018-11-11T12:19:42.944 [INFO] Downloading: https://repo.maven.apache.org/maven2/bouncycastle/bcprov-jdk15/140/bcprov-jdk15-140.jar
2018-11-11T12:19:42.951 [INFO] Downloaded: https://repo.maven.apache.org/maven2/org/apache/directory/api/api-ldap-extras-sp/1.0.0-M20/api-ldap-extras-sp-1.0.0-M20.jar (13 kB at 21 kB/s)
2018-11-11T12:19:42.951 [INFO] Downloading: https://repo.maven.apache.org/maven2/org/apache/zookeeper/zookeeper/3.4.13/zookeeper-3.4.13-tests.jar
2018-11-11T12:19:42.964 [INFO] Downloaded: https://repo.maven.apache.org/maven2/org/apache/directory/api/api-ldap-extras-codec/1.0.0-M20/api-ldap-extras-codec-1.0.0-M20.jar (208 kB at 336 kB/s)
2018-11-11T12:19:43.044 [INFO] Downloaded: https://repo.maven.apache.org/maven2/org/apache/zookeeper/zookeeper/3.4.13/zookeeper-3.4.13-tests.jar (727 kB at 1.0 MB/s)
2018-11-11T12:19:43.113 [INFO] Downloaded: https://repo.maven.apache.org/maven2/bouncycastle/bcprov-jdk15/140/bcprov-jdk15-140.jar (1.6 MB at 2.1 MB/s)
2018-11-11T12:19:43.140 [INFO] Downloaded: https://repo.maven.apache.org/maven2/org/apache/directory/api/api-all/1.0.0-M20/api-all-1.0.0-M20.jar (2.8 MB at 3.5 MB/s)
2018-11-11T12:19:43.669 [INFO] Downloaded: https://repo.maven.apache.org/maven2/org/rocksdb/rocksdbjni/5.13.1/rocksdbjni-5.13.1.jar (14 MB at 10 MB/s)
2018-11-11T12:19:43.719 [INFO]
2018-11-11T12:19:43.719 [INFO] --- maven-clean-plugin:3.0.0:clean (default-clean) @ bookkeeper-server ---
2018-11-11T12:19:43.916 [INFO]
2018-11-11T12:19:43.916 [INFO] --- apache-rat-plugin:0.12:check (default-cli) @ bookkeeper-server ---
2018-11-11T12:19:44.037 [INFO] Enabled default license matchers.
2018-11-11T12:19:44.040 [INFO] Will parse SCM ignores for exclusions...
2018-11-11T12:19:44.040 [INFO] Finished adding exclusions from SCM ignore files.
2018-11-11T12:19:44.041 [INFO] 61 implicit excludes (use -debug for more details).
2018-11-11T12:19:44.041 [INFO] Exclude: **/target/**/*
2018-11-11T12:19:44.041 [INFO] Exclude: **/.classpath
2018-11-11T12:19:44.041 [INFO] Exclude: **/.gitignore
2018-11-11T12:19:44.041 [INFO] Exclude: **/.project
2018-11-11T12:19:44.041 [INFO] Exclude: **/.checkstyle
2018-11-11T12:19:44.041 [INFO] Exclude: **/.settings/*
2018-11-11T12:19:44.041 [INFO] Exclude: src/test/resources/server-key.pem
2018-11-11T12:19:44.041 [INFO] Exclude: src/test/resources/server-key.p12
2018-11-11T12:19:44.041 [INFO] Exclude: src/test/resources/server-key.jks
2018-11-11T12:19:44.041 [INFO] Exclude: src/test/resources/server-cert.pem
2018-11-11T12:19:44.041 [INFO] Exclude: src/test/resources/client-key.pem
2018-11-11T12:19:44.041 [INFO] Exclude: src/test/resources/client-key.p12
2018-11-11T12:19:44.041 [INFO] Exclude: src/test/resources/client-key.jks
2018-11-11T12:19:44.041 [INFO] Exclude: src/test/resources/client-cert.pem
2018-11-11T12:19:44.041 [INFO] Exclude: src/test/resources/keyStoreClientPassword.txt
2018-11-11T12:19:44.041 [INFO] Exclude: src/test/resources/keyStoreServerPassword.txt
2018-11-11T12:19:44.063 [INFO] 665 resources included (use -debug for more details)
2018-11-11T12:19:44.459 [INFO] Rat check: Summary over all files. Unapproved: 0, unknown: 0, generated: 0, approved: 665 licenses.
2018-11-11T12:19:44.618 [INFO]
2018-11-11T12:19:44.618 [INFO] --- maven-remote-resources-plugin:1.5:process (process-resource-bundles) @ bookkeeper-server ---
2018-11-11T12:19:48.340 [INFO]
2018-11-11T12:19:48.340 [INFO] --- maven-resources-plugin:2.7:resources (default-resources) @ bookkeeper-server ---
2018-11-11T12:19:48.395 [INFO] Using 'UTF-8' encoding to copy filtered resources.
2018-11-11T12:19:48.395 [INFO] skip non existing resourceDirectory <https://builds.apache.org/job/bookkeeper_release_branch_48_java9/ws/bookkeeper-server/src/main/resources>
2018-11-11T12:19:48.400 [INFO] Copying 3 resources
2018-11-11T12:19:48.564 [INFO]
2018-11-11T12:19:48.565 [INFO] --- maven-compiler-plugin:3.7.0:compile (default-compile) @ bookkeeper-server ---
2018-11-11T12:19:48.732 [INFO] Changes detected - recompiling the module!
2018-11-11T12:19:48.737 [INFO] Compiling 431 source files to <https://builds.apache.org/job/bookkeeper_release_branch_48_java9/ws/bookkeeper-server/target/classes>
2018-11-11T12:20:01.033 [INFO] -------------------------------------------------------------
2018-11-11T12:20:01.033 [ERROR] COMPILATION ERROR :
2018-11-11T12:20:01.033 [INFO] -------------------------------------------------------------
2018-11-11T12:20:01.033 [ERROR] <https://builds.apache.org/job/bookkeeper_release_branch_48_java9/ws/bookkeeper-server/src/main/java/org/apache/bookkeeper/client/LedgerHandle.java>:[920,17] cannot find symbol
symbol: method isHandleWritable()
location: class org.apache.bookkeeper.client.LedgerHandle
2018-11-11T12:20:01.033 [INFO] 1 error
2018-11-11T12:20:01.033 [INFO] -------------------------------------------------------------
[JENKINS] Archiving disabled
[JENKINS] Archiving disabled
[JENKINS] Archiving disabled
[JENKINS] Archiving disabled
[JENKINS] Archiving disabled
[JENKINS] Archiving disabled
[JENKINS] Archiving disabled
[JENKINS] Archiving disabled
[JENKINS] Archiving disabled
[JENKINS] Archiving disabled
[JENKINS] Archiving disabled
[JENKINS] Archiving disabled
[JENKINS] Archiving disabled
[JENKINS] Archiving disabled
[JENKINS] Archiving disabled
[JENKINS] Archiving disabled
[JENKINS] Archiving disabled
[JENKINS] Archiving disabled
[JENKINS] Archiving disabled
[JENKINS] Archiving disabled
[JENKINS] Archiving disabled
[JENKINS] Archiving disabled
[JENKINS] Archiving disabled
[JENKINS] Archiving disabled
[JENKINS] Archiving disabled
[JENKINS] Archiving disabled
[JENKINS] Archiving disabled
[JENKINS] Archiving disabled
[JENKINS] Archiving disabled
[JENKINS] Archiving disabled
[JENKINS] Archiving disabled
[JENKINS] Archiving disabled
[JENKINS] Archiving disabled
[JENKINS] Archiving disabled
[JENKINS] Archiving disabled
[JENKINS] Archiving disabled
[JENKINS] Archiving disabled
[JENKINS] Archiving disabled
[JENKINS] Archiving disabled
[JENKINS] Archiving disabled
[JENKINS] Archiving disabled
[JENKINS] Archiving disabled
[JENKINS] Archiving disabled
[JENKINS] Archiving disabled
[JENKINS] Archiving disabled
[JENKINS] Archiving disabled
[JENKINS] Archiving disabled
[JENKINS] Archiving disabled
[JENKINS] Archiving disabled
[JENKINS] Archiving disabled
[JENKINS] Archiving disabled
[JENKINS] Archiving disabled
[JENKINS] Archiving disabled
[JENKINS] Archiving disabled
[JENKINS] Archiving disabled
[JENKINS] Archiving disabled
[JENKINS] Archiving disabled
[JENKINS] Archiving disabled
[JENKINS] Archiving disabled
[JENKINS] Archiving disabled
[JENKINS] Archiving disabled
[JENKINS] Archiving disabled
[JENKINS] Archiving disabled
[JENKINS] Archiving disabled
[JENKINS] Archiving disabled
[JENKINS] Archiving disabled
[JENKINS] Archiving disabled
[JENKINS] Archiving disabled
[JENKINS] Archiving disabled
[JENKINS] Archiving disabled
[JENKINS] Archiving disabled
[JENKINS] Archiving disabled
[JENKINS] Archiving disabled
[JENKINS] Archiving disabled
[JENKINS] Archiving disabled
[JENKINS] Archiving disabled
[JENKINS] Archiving disabled
[JENKINS] Archiving disabled
[JENKINS] Archiving disabled
2018-11-11T12:20:47.086 [INFO] ------------------------------------------------------------------------
2018-11-11T12:20:47.086 [INFO] Reactor Summary:
2018-11-11T12:20:47.086 [INFO]
2018-11-11T12:20:47.088 [INFO] Apache BookKeeper :: Parent ........................ SUCCESS [ 14.148 s]
2018-11-11T12:20:47.088 [INFO] Apache BookKeeper :: Build Tools ................... SUCCESS [ 5.903 s]
2018-11-11T12:20:47.088 [INFO] Apache BookKeeper :: Circe Checksum Library ........ SUCCESS [01:33 min]
2018-11-11T12:20:47.088 [INFO] Apache BookKeeper :: Stats API ..................... SUCCESS [ 13.166 s]
2018-11-11T12:20:47.088 [INFO] Apache BookKeeper :: Common ........................ SUCCESS [ 31.689 s]
2018-11-11T12:20:47.088 [INFO] Apache BookKeeper :: Protocols ..................... SUCCESS [ 23.798 s]
2018-11-11T12:20:47.088 [INFO] Apache BookKeeper :: Tools :: Parent ............... SUCCESS [ 2.199 s]
2018-11-11T12:20:47.088 [INFO] Apache BookKeeper :: Tools :: Framework ............ SUCCESS [ 12.359 s]
2018-11-11T12:20:47.088 [INFO] Apache BookKeeper :: Http :: Http Server ........... SUCCESS [ 8.577 s]
2018-11-11T12:20:47.088 [INFO] Apache BookKeeper :: Server ........................ FAILURE [ 21.751 s]
2018-11-11T12:20:47.088 [INFO] Apache BookKeeper :: Benchmark ..................... SKIPPED
2018-11-11T12:20:47.089 [INFO] Apache BookKeeper :: Stats Providers :: Twitter Finagle Stats SKIPPED
2018-11-11T12:20:47.089 [INFO] Apache BookKeeper :: Stats Providers :: Twitter Science Stats SKIPPED
2018-11-11T12:20:47.089 [INFO] Apache BookKeeper :: Stats Providers :: Twitter Ostrich Stats SKIPPED
2018-11-11T12:20:47.089 [INFO] Apache BookKeeper :: Stats Providers :: Codahale Metrics SKIPPED
2018-11-11T12:20:47.089 [INFO] Apache BookKeeper :: Stats Providers :: Prometheus . SKIPPED
2018-11-11T12:20:47.089 [INFO] Apache BookKeeper :: Stats Providers ............... SKIPPED
2018-11-11T12:20:47.089 [INFO] Apache BookKeeper :: Bookkeeper Http :: Twitter Http Server SKIPPED
2018-11-11T12:20:47.089 [INFO] Apache BookKeeper :: Bookkeeper Http :: Vertx Http Server SKIPPED
2018-11-11T12:20:47.089 [INFO] Apache BookKeeper :: Http .......................... SKIPPED
2018-11-11T12:20:47.089 [INFO] Apache BookKeeper :: Shaded :: Parent .............. SKIPPED
2018-11-11T12:20:47.089 [INFO] Apache BookKeeper :: Shaded :: bookkeeper-server-shaded SKIPPED
2018-11-11T12:20:47.089 [INFO] Apache BookKeeper :: Shaded :: bookkeeper-server-tests-shaded SKIPPED
2018-11-11T12:20:47.089 [INFO] Apache BookKeeper :: DistributedLog :: Parent ...... SKIPPED
2018-11-11T12:20:47.089 [INFO] Apache BookKeeper :: DistributedLog :: Common ...... SKIPPED
2018-11-11T12:20:47.089 [INFO] Apache BookKeeper :: DistributedLog :: Protocol .... SKIPPED
2018-11-11T12:20:47.089 [INFO] Apache BookKeeper :: DistributedLog :: Core Library SKIPPED
2018-11-11T12:20:47.089 [INFO] Apache BookKeeper :: Shaded :: distributedlog-core-shaded SKIPPED
2018-11-11T12:20:47.089 [INFO] Apache BookKeeper :: Tests ......................... SKIPPED
2018-11-11T12:20:47.089 [INFO] Apache BookKeeper :: Tests :: Test Shaded Jars ..... SKIPPED
2018-11-11T12:20:47.089 [INFO] Apache BookKeeper :: Tests :: bookkeeper-server-shaded test SKIPPED
2018-11-11T12:20:47.089 [INFO] Apache BookKeeper :: Tests :: bookkeeper-server-tests-shaded test SKIPPED
2018-11-11T12:20:47.089 [INFO] Apache BookKeeper :: Tests :: distributedlog-core-shaded test SKIPPED
2018-11-11T12:20:47.089 [INFO] Apache BookKeeper :: Tests :: Docker Images ........ SKIPPED
2018-11-11T12:20:47.089 [INFO] Apache BookKeeper :: Tests :: Docker Images :: All Released Versions SKIPPED
2018-11-11T12:20:47.089 [INFO] Apache BookKeeper :: Stream Storage :: Parent ...... SKIPPED
2018-11-11T12:20:47.089 [INFO] Apache BookKeeper :: Stream Storage :: Common Classes for Tests SKIPPED
2018-11-11T12:20:47.090 [INFO] Apache BookKeeper :: Stream Storage :: Common ...... SKIPPED
2018-11-11T12:20:47.090 [INFO] Apache BookKeeper :: Stream Storage :: API ......... SKIPPED
2018-11-11T12:20:47.090 [INFO] Apache BookKeeper :: Stream Storage :: Proto ....... SKIPPED
2018-11-11T12:20:47.090 [INFO] Apache BookKeeper :: Stream Storage :: Clients :: Parent SKIPPED
2018-11-11T12:20:47.090 [INFO] Apache BookKeeper :: Stream Storage :: Clients :: Java Client :: Parent SKIPPED
2018-11-11T12:20:47.090 [INFO] Apache BookKeeper :: Stream Storage :: Clients :: Java Client :: Base SKIPPED
2018-11-11T12:20:47.090 [INFO] Apache BookKeeper :: Stream Storage :: Clients :: Java Client :: KV SKIPPED
2018-11-11T12:20:47.090 [INFO] Apache BookKeeper :: Stream Storage :: Clients :: Java Client SKIPPED
2018-11-11T12:20:47.090 [INFO] Apache BookKeeper :: Stream Storage :: Storage :: Parent SKIPPED
2018-11-11T12:20:47.090 [INFO] Apache BookKeeper :: Stream Storage :: Storage :: Api SKIPPED
2018-11-11T12:20:47.090 [INFO] Apache BookKeeper :: Stream Storage :: State Library SKIPPED
2018-11-11T12:20:47.090 [INFO] Apache BookKeeper :: Stream Storage :: Storage :: Impl SKIPPED
2018-11-11T12:20:47.090 [INFO] Apache BookKeeper :: Tools :: Stream ............... SKIPPED
2018-11-11T12:20:47.090 [INFO] Apache BookKeeper :: Tools ......................... SKIPPED
2018-11-11T12:20:47.090 [INFO] Apache BookKeeper :: Stream Storage :: Server ...... SKIPPED
2018-11-11T12:20:47.090 [INFO] Apache BookKeeper :: Dist (Parent) ................. SKIPPED
2018-11-11T12:20:47.090 [INFO] Apache BookKeeper :: Dist (Server) ................. SKIPPED
2018-11-11T12:20:47.090 [INFO] Apache BookKeeper :: Tests :: Docker Images :: All Versions SKIPPED
2018-11-11T12:20:47.090 [INFO] Apache BookKeeper :: Tests :: Docker Images :: Current Version SKIPPED
2018-11-11T12:20:47.090 [INFO] Apache BookKeeper :: Tests :: Utility module for Arquillian based integration tests SKIPPED
2018-11-11T12:20:47.090 [INFO] Apache BookKeeper :: Tests :: Common topologies for Docker based integration tests SKIPPED
2018-11-11T12:20:47.090 [INFO] Apache BookKeeper :: Tests :: Base module for Arquillian based integration tests SKIPPED
2018-11-11T12:20:47.090 [INFO] Apache BookKeeper :: Tests :: Base module for Arquillian based integration tests using groovy SKIPPED
2018-11-11T12:20:47.090 [INFO] Apache BookKeeper :: Tests :: Backward Compatibility SKIPPED
2018-11-11T12:20:47.090 [INFO] Apache BookKeeper :: Tests :: Backward Compatibility :: Test upgrade between all released versions and current version SKIPPED
2018-11-11T12:20:47.091 [INFO] Apache BookKeeper :: Tests :: Backward Compatibility :: Test upgrade between 4.1.0 and current version SKIPPED
2018-11-11T12:20:47.091 [INFO] Apache BookKeeper :: Tests :: Backward Compatibility :: Test compat between old version and new version of hierarchical ledger manager SKIPPED
2018-11-11T12:20:47.091 [INFO] Apache BookKeeper :: Tests :: Backward Compatibility :: Test upgrade between 4.1.0 and current version (with hostname bookie ID) SKIPPED
2018-11-11T12:20:47.091 [INFO] Apache BookKeeper :: Tests :: Backward Compatibility :: Test recovery does not work when password no in metadata SKIPPED
2018-11-11T12:20:47.091 [INFO] Apache BookKeeper :: Tests :: Backward Compatibility :: Test upgrade 4.1.0 to current in cluster with cookies SKIPPED
2018-11-11T12:20:47.091 [INFO] Apache BookKeeper :: Tests :: Backward Compatibility :: Test old clients working on current server SKIPPED
2018-11-11T12:20:47.091 [INFO] Apache BookKeeper :: Tests :: Backward Compatibility :: Test upgrade between yahoo custom version and current SKIPPED
2018-11-11T12:20:47.091 [INFO] Apache BookKeeper :: Tests :: Integration .......... SKIPPED
2018-11-11T12:20:47.091 [INFO] Apache BookKeeper :: Tests :: Integration :: Smoke test SKIPPED
2018-11-11T12:20:47.091 [INFO] Apache BookKeeper :: Tests :: Integration :: Standalone test SKIPPED
2018-11-11T12:20:47.091 [INFO] Apache BookKeeper :: Tests :: Integration :: Cluster test SKIPPED
2018-11-11T12:20:47.091 [INFO] Apache BookKeeper :: Tests :: Bash Scripts Test .... SKIPPED
2018-11-11T12:20:47.091 [INFO] Apache BookKeeper :: Dist (All) .................... SKIPPED
2018-11-11T12:20:47.091 [INFO] Apache BookKeeper :: microbenchmarks ............... SKIPPED
2018-11-11T12:20:47.091 [INFO] Apache BookKeeper :: DistributedLog :: IO :: FileSystem SKIPPED
2018-11-11T12:20:47.091 [INFO] Apache BookKeeper :: DistributedLog :: IO .......... SKIPPED
2018-11-11T12:20:47.091 [INFO] ------------------------------------------------------------------------
2018-11-11T12:20:47.091 [INFO] BUILD FAILURE
2018-11-11T12:20:47.091 [INFO] ------------------------------------------------------------------------
2018-11-11T12:20:47.091 [INFO] Total time: 05:23 min
2018-11-11T12:20:47.092 [INFO] Finished at: 2018-11-11T12:20:47Z
2018-11-11T12:20:48.177 [INFO] Final Memory: 101M/2048M
2018-11-11T12:20:48.177 [INFO] ------------------------------------------------------------------------
Waiting for Jenkins to finish collecting data
2018-11-11T12:20:48.651 [ERROR] Failed to execute goal org.apache.maven.plugins:maven-compiler-plugin:3.7.0:compile (default-compile) on project bookkeeper-server: Compilation failure
2018-11-11T12:20:48.651 [ERROR] <https://builds.apache.org/job/bookkeeper_release_branch_48_java9/ws/bookkeeper-server/src/main/java/org/apache/bookkeeper/client/LedgerHandle.java>:[920,17] cannot find symbol
2018-11-11T12:20:48.651 [ERROR] symbol: method isHandleWritable()
2018-11-11T12:20:48.651 [ERROR] location: class org.apache.bookkeeper.client.LedgerHandle
2018-11-11T12:20:48.652 [ERROR] -> [Help 1]
2018-11-11T12:20:48.652 [ERROR]
2018-11-11T12:20:48.652 [ERROR] To see the full stack trace of the errors, re-run Maven with the -e switch.
2018-11-11T12:20:48.652 [ERROR] Re-run Maven using the -X switch to enable full debug logging.
2018-11-11T12:20:48.652 [ERROR]
2018-11-11T12:20:48.652 [ERROR] For more information about the errors and possible solutions, please read the following articles:
2018-11-11T12:20:48.652 [ERROR] [Help 1] http://cwiki.apache.org/confluence/display/MAVEN/MojoFailureException
2018-11-11T12:20:48.652 [ERROR]
2018-11-11T12:20:48.652 [ERROR] After correcting the problems, you can resume the build with the command
2018-11-11T12:20:48.652 [ERROR] mvn <goals> -rf :bookkeeper-server
channel stopped
Build failed in Jenkins: bookkeeper_release_branch_48_java9 #87
Posted by Apache Jenkins Server <je...@builds.apache.org>.
See <https://builds.apache.org/job/bookkeeper_release_branch_48_java9/87/display/redirect?page=changes>
Changes:
[sijie] [TOOLS] improve bkctl help message
------------------------------------------
[...truncated 507.38 KB...]
2018-11-10T12:19:41.953 [INFO] Downloaded: https://repo.maven.apache.org/maven2/org/apache/directory/server/apacheds-kerberos-codec/2.0.0-M15/apacheds-kerberos-codec-2.0.0-M15.jar (691 kB at 1.3 MB/s)
2018-11-10T12:19:41.953 [INFO] Downloading: https://repo.maven.apache.org/maven2/org/apache/directory/jdbm/apacheds-jdbm1/2.0.0-M2/apacheds-jdbm1-2.0.0-M2.jar
2018-11-10T12:19:41.964 [INFO] Downloaded: https://repo.maven.apache.org/maven2/org/apache/directory/server/apacheds-jdbm-partition/2.0.0-M15/apacheds-jdbm-partition-2.0.0-M15.jar (72 kB at 130 kB/s)
2018-11-10T12:19:41.964 [INFO] Downloading: https://repo.maven.apache.org/maven2/org/apache/directory/server/apacheds-protocol-ldap/2.0.0-M15/apacheds-protocol-ldap-2.0.0-M15.jar
2018-11-10T12:19:41.976 [INFO] Downloaded: https://repo.maven.apache.org/maven2/org/apache/directory/jdbm/apacheds-jdbm1/2.0.0-M2/apacheds-jdbm1-2.0.0-M2.jar (105 kB at 185 kB/s)
2018-11-10T12:19:41.976 [INFO] Downloading: https://repo.maven.apache.org/maven2/org/apache/directory/api/api-asn1-ber/1.0.0-M20/api-asn1-ber-1.0.0-M20.jar
2018-11-10T12:19:41.980 [INFO] Downloaded: https://repo.maven.apache.org/maven2/antlr/antlr/2.7.7/antlr-2.7.7.jar (445 kB at 780 kB/s)
2018-11-10T12:19:41.980 [INFO] Downloading: https://repo.maven.apache.org/maven2/org/apache/directory/api/api-ldap-extras-codec-api/1.0.0-M20/api-ldap-extras-codec-api-1.0.0-M20.jar
2018-11-10T12:19:41.991 [INFO] Downloaded: https://repo.maven.apache.org/maven2/org/apache/directory/api/api-asn1-ber/1.0.0-M20/api-asn1-ber-1.0.0-M20.jar (42 kB at 72 kB/s)
2018-11-10T12:19:41.991 [INFO] Downloading: https://repo.maven.apache.org/maven2/org/apache/directory/api/api-ldap-extras-codec/1.0.0-M20/api-ldap-extras-codec-1.0.0-M20.jar
2018-11-10T12:19:41.998 [INFO] Downloaded: https://repo.maven.apache.org/maven2/org/apache/directory/server/apacheds-protocol-ldap/2.0.0-M15/apacheds-protocol-ldap-2.0.0-M15.jar (228 kB at 388 kB/s)
2018-11-10T12:19:41.998 [INFO] Downloading: https://repo.maven.apache.org/maven2/org/apache/directory/api/api-ldap-extras-sp/1.0.0-M20/api-ldap-extras-sp-1.0.0-M20.jar
2018-11-10T12:19:41.998 [INFO] Downloaded: https://repo.maven.apache.org/maven2/org/apache/directory/api/api-ldap-extras-codec-api/1.0.0-M20/api-ldap-extras-codec-api-1.0.0-M20.jar (55 kB at 93 kB/s)
2018-11-10T12:19:41.998 [INFO] Downloading: https://repo.maven.apache.org/maven2/bouncycastle/bcprov-jdk15/140/bcprov-jdk15-140.jar
2018-11-10T12:19:42.010 [INFO] Downloaded: https://repo.maven.apache.org/maven2/org/apache/directory/api/api-ldap-extras-sp/1.0.0-M20/api-ldap-extras-sp-1.0.0-M20.jar (13 kB at 21 kB/s)
2018-11-10T12:19:42.010 [INFO] Downloading: https://repo.maven.apache.org/maven2/org/apache/zookeeper/zookeeper/3.4.13/zookeeper-3.4.13-tests.jar
2018-11-10T12:19:42.024 [INFO] Downloaded: https://repo.maven.apache.org/maven2/org/apache/directory/api/api-ldap-extras-codec/1.0.0-M20/api-ldap-extras-codec-1.0.0-M20.jar (208 kB at 338 kB/s)
2018-11-10T12:19:42.096 [INFO] Downloaded: https://repo.maven.apache.org/maven2/org/apache/zookeeper/zookeeper/3.4.13/zookeeper-3.4.13-tests.jar (727 kB at 1.1 MB/s)
2018-11-10T12:19:42.167 [INFO] Downloaded: https://repo.maven.apache.org/maven2/bouncycastle/bcprov-jdk15/140/bcprov-jdk15-140.jar (1.6 MB at 2.1 MB/s)
2018-11-10T12:19:42.203 [INFO] Downloaded: https://repo.maven.apache.org/maven2/org/apache/directory/api/api-all/1.0.0-M20/api-all-1.0.0-M20.jar (2.8 MB at 3.5 MB/s)
2018-11-10T12:19:42.850 [INFO] Downloaded: https://repo.maven.apache.org/maven2/org/rocksdb/rocksdbjni/5.13.1/rocksdbjni-5.13.1.jar (14 MB at 9.6 MB/s)
2018-11-10T12:19:42.885 [INFO]
2018-11-10T12:19:42.885 [INFO] --- maven-clean-plugin:3.0.0:clean (default-clean) @ bookkeeper-server ---
2018-11-10T12:19:43.084 [INFO]
2018-11-10T12:19:43.085 [INFO] --- apache-rat-plugin:0.12:check (default-cli) @ bookkeeper-server ---
2018-11-10T12:19:43.244 [INFO] Enabled default license matchers.
2018-11-10T12:19:43.247 [INFO] Will parse SCM ignores for exclusions...
2018-11-10T12:19:43.248 [INFO] Finished adding exclusions from SCM ignore files.
2018-11-10T12:19:43.248 [INFO] 61 implicit excludes (use -debug for more details).
2018-11-10T12:19:43.249 [INFO] Exclude: **/target/**/*
2018-11-10T12:19:43.249 [INFO] Exclude: **/.classpath
2018-11-10T12:19:43.249 [INFO] Exclude: **/.gitignore
2018-11-10T12:19:43.249 [INFO] Exclude: **/.project
2018-11-10T12:19:43.249 [INFO] Exclude: **/.checkstyle
2018-11-10T12:19:43.249 [INFO] Exclude: **/.settings/*
2018-11-10T12:19:43.249 [INFO] Exclude: src/test/resources/server-key.pem
2018-11-10T12:19:43.249 [INFO] Exclude: src/test/resources/server-key.p12
2018-11-10T12:19:43.249 [INFO] Exclude: src/test/resources/server-key.jks
2018-11-10T12:19:43.249 [INFO] Exclude: src/test/resources/server-cert.pem
2018-11-10T12:19:43.249 [INFO] Exclude: src/test/resources/client-key.pem
2018-11-10T12:19:43.249 [INFO] Exclude: src/test/resources/client-key.p12
2018-11-10T12:19:43.249 [INFO] Exclude: src/test/resources/client-key.jks
2018-11-10T12:19:43.249 [INFO] Exclude: src/test/resources/client-cert.pem
2018-11-10T12:19:43.249 [INFO] Exclude: src/test/resources/keyStoreClientPassword.txt
2018-11-10T12:19:43.249 [INFO] Exclude: src/test/resources/keyStoreServerPassword.txt
2018-11-10T12:19:43.275 [INFO] 665 resources included (use -debug for more details)
2018-11-10T12:19:43.676 [INFO] Rat check: Summary over all files. Unapproved: 0, unknown: 0, generated: 0, approved: 665 licenses.
2018-11-10T12:19:43.836 [INFO]
2018-11-10T12:19:43.836 [INFO] --- maven-remote-resources-plugin:1.5:process (process-resource-bundles) @ bookkeeper-server ---
2018-11-10T12:19:48.145 [INFO]
2018-11-10T12:19:48.145 [INFO] --- maven-resources-plugin:2.7:resources (default-resources) @ bookkeeper-server ---
2018-11-10T12:19:48.231 [INFO] Using 'UTF-8' encoding to copy filtered resources.
2018-11-10T12:19:48.231 [INFO] skip non existing resourceDirectory <https://builds.apache.org/job/bookkeeper_release_branch_48_java9/ws/bookkeeper-server/src/main/resources>
2018-11-10T12:19:48.237 [INFO] Copying 3 resources
2018-11-10T12:19:48.405 [INFO]
2018-11-10T12:19:48.405 [INFO] --- maven-compiler-plugin:3.7.0:compile (default-compile) @ bookkeeper-server ---
2018-11-10T12:19:48.614 [INFO] Changes detected - recompiling the module!
2018-11-10T12:19:48.621 [INFO] Compiling 431 source files to <https://builds.apache.org/job/bookkeeper_release_branch_48_java9/ws/bookkeeper-server/target/classes>
2018-11-10T12:20:01.464 [INFO] -------------------------------------------------------------
2018-11-10T12:20:01.464 [ERROR] COMPILATION ERROR :
2018-11-10T12:20:01.465 [INFO] -------------------------------------------------------------
2018-11-10T12:20:01.465 [ERROR] <https://builds.apache.org/job/bookkeeper_release_branch_48_java9/ws/bookkeeper-server/src/main/java/org/apache/bookkeeper/client/LedgerHandle.java>:[920,17] cannot find symbol
symbol: method isHandleWritable()
location: class org.apache.bookkeeper.client.LedgerHandle
2018-11-10T12:20:01.465 [INFO] 1 error
2018-11-10T12:20:01.465 [INFO] -------------------------------------------------------------
[JENKINS] Archiving disabled
[JENKINS] Archiving disabled
[JENKINS] Archiving disabled
[JENKINS] Archiving disabled
[JENKINS] Archiving disabled
[JENKINS] Archiving disabled
[JENKINS] Archiving disabled
[JENKINS] Archiving disabled
[JENKINS] Archiving disabled
[JENKINS] Archiving disabled
[JENKINS] Archiving disabled
[JENKINS] Archiving disabled
[JENKINS] Archiving disabled
[JENKINS] Archiving disabled
[JENKINS] Archiving disabled
[JENKINS] Archiving disabled
[JENKINS] Archiving disabled
[JENKINS] Archiving disabled
[JENKINS] Archiving disabled
[JENKINS] Archiving disabled
[JENKINS] Archiving disabled
[JENKINS] Archiving disabled
[JENKINS] Archiving disabled
[JENKINS] Archiving disabled
[JENKINS] Archiving disabled
[JENKINS] Archiving disabled
[JENKINS] Archiving disabled
[JENKINS] Archiving disabled
[JENKINS] Archiving disabled
[JENKINS] Archiving disabled
[JENKINS] Archiving disabled
[JENKINS] Archiving disabled
[JENKINS] Archiving disabled
[JENKINS] Archiving disabled
[JENKINS] Archiving disabled
[JENKINS] Archiving disabled
[JENKINS] Archiving disabled
[JENKINS] Archiving disabled
[JENKINS] Archiving disabled
[JENKINS] Archiving disabled
[JENKINS] Archiving disabled
[JENKINS] Archiving disabled
[JENKINS] Archiving disabled
[JENKINS] Archiving disabled
[JENKINS] Archiving disabled
[JENKINS] Archiving disabled
[JENKINS] Archiving disabled
[JENKINS] Archiving disabled
[JENKINS] Archiving disabled
[JENKINS] Archiving disabled
[JENKINS] Archiving disabled
[JENKINS] Archiving disabled
[JENKINS] Archiving disabled
[JENKINS] Archiving disabled
[JENKINS] Archiving disabled
[JENKINS] Archiving disabled
[JENKINS] Archiving disabled
[JENKINS] Archiving disabled
[JENKINS] Archiving disabled
[JENKINS] Archiving disabled
[JENKINS] Archiving disabled
[JENKINS] Archiving disabled
[JENKINS] Archiving disabled
[JENKINS] Archiving disabled
[JENKINS] Archiving disabled
[JENKINS] Archiving disabled
[JENKINS] Archiving disabled
[JENKINS] Archiving disabled
[JENKINS] Archiving disabled
[JENKINS] Archiving disabled
[JENKINS] Archiving disabled
[JENKINS] Archiving disabled
[JENKINS] Archiving disabled
[JENKINS] Archiving disabled
[JENKINS] Archiving disabled
[JENKINS] Archiving disabled
[JENKINS] Archiving disabled
[JENKINS] Archiving disabled
[JENKINS] Archiving disabled
2018-11-10T12:20:47.430 [INFO] ------------------------------------------------------------------------
2018-11-10T12:20:47.430 [INFO] Reactor Summary:
2018-11-10T12:20:47.430 [INFO]
2018-11-10T12:20:47.431 [INFO] Apache BookKeeper :: Parent ........................ SUCCESS [ 14.604 s]
2018-11-10T12:20:47.431 [INFO] Apache BookKeeper :: Build Tools ................... SUCCESS [ 5.945 s]
2018-11-10T12:20:47.432 [INFO] Apache BookKeeper :: Circe Checksum Library ........ SUCCESS [01:34 min]
2018-11-10T12:20:47.432 [INFO] Apache BookKeeper :: Stats API ..................... SUCCESS [ 12.745 s]
2018-11-10T12:20:47.432 [INFO] Apache BookKeeper :: Common ........................ SUCCESS [ 32.321 s]
2018-11-10T12:20:47.432 [INFO] Apache BookKeeper :: Protocols ..................... SUCCESS [ 24.111 s]
2018-11-10T12:20:47.432 [INFO] Apache BookKeeper :: Tools :: Parent ............... SUCCESS [ 2.114 s]
2018-11-10T12:20:47.432 [INFO] Apache BookKeeper :: Tools :: Framework ............ SUCCESS [ 12.697 s]
2018-11-10T12:20:47.432 [INFO] Apache BookKeeper :: Http :: Http Server ........... SUCCESS [ 8.516 s]
2018-11-10T12:20:47.432 [INFO] Apache BookKeeper :: Server ........................ FAILURE [ 22.905 s]
2018-11-10T12:20:47.433 [INFO] Apache BookKeeper :: Benchmark ..................... SKIPPED
2018-11-10T12:20:47.433 [INFO] Apache BookKeeper :: Stats Providers :: Twitter Finagle Stats SKIPPED
2018-11-10T12:20:47.433 [INFO] Apache BookKeeper :: Stats Providers :: Twitter Science Stats SKIPPED
2018-11-10T12:20:47.433 [INFO] Apache BookKeeper :: Stats Providers :: Twitter Ostrich Stats SKIPPED
2018-11-10T12:20:47.433 [INFO] Apache BookKeeper :: Stats Providers :: Codahale Metrics SKIPPED
2018-11-10T12:20:47.433 [INFO] Apache BookKeeper :: Stats Providers :: Prometheus . SKIPPED
2018-11-10T12:20:47.433 [INFO] Apache BookKeeper :: Stats Providers ............... SKIPPED
2018-11-10T12:20:47.433 [INFO] Apache BookKeeper :: Bookkeeper Http :: Twitter Http Server SKIPPED
2018-11-10T12:20:47.433 [INFO] Apache BookKeeper :: Bookkeeper Http :: Vertx Http Server SKIPPED
2018-11-10T12:20:47.433 [INFO] Apache BookKeeper :: Http .......................... SKIPPED
2018-11-10T12:20:47.433 [INFO] Apache BookKeeper :: Shaded :: Parent .............. SKIPPED
2018-11-10T12:20:47.433 [INFO] Apache BookKeeper :: Shaded :: bookkeeper-server-shaded SKIPPED
2018-11-10T12:20:47.433 [INFO] Apache BookKeeper :: Shaded :: bookkeeper-server-tests-shaded SKIPPED
2018-11-10T12:20:47.433 [INFO] Apache BookKeeper :: DistributedLog :: Parent ...... SKIPPED
2018-11-10T12:20:47.433 [INFO] Apache BookKeeper :: DistributedLog :: Common ...... SKIPPED
2018-11-10T12:20:47.433 [INFO] Apache BookKeeper :: DistributedLog :: Protocol .... SKIPPED
2018-11-10T12:20:47.434 [INFO] Apache BookKeeper :: DistributedLog :: Core Library SKIPPED
2018-11-10T12:20:47.434 [INFO] Apache BookKeeper :: Shaded :: distributedlog-core-shaded SKIPPED
2018-11-10T12:20:47.434 [INFO] Apache BookKeeper :: Tests ......................... SKIPPED
2018-11-10T12:20:47.434 [INFO] Apache BookKeeper :: Tests :: Test Shaded Jars ..... SKIPPED
2018-11-10T12:20:47.434 [INFO] Apache BookKeeper :: Tests :: bookkeeper-server-shaded test SKIPPED
2018-11-10T12:20:47.434 [INFO] Apache BookKeeper :: Tests :: bookkeeper-server-tests-shaded test SKIPPED
2018-11-10T12:20:47.434 [INFO] Apache BookKeeper :: Tests :: distributedlog-core-shaded test SKIPPED
2018-11-10T12:20:47.434 [INFO] Apache BookKeeper :: Tests :: Docker Images ........ SKIPPED
2018-11-10T12:20:47.434 [INFO] Apache BookKeeper :: Tests :: Docker Images :: All Released Versions SKIPPED
2018-11-10T12:20:47.434 [INFO] Apache BookKeeper :: Stream Storage :: Parent ...... SKIPPED
2018-11-10T12:20:47.434 [INFO] Apache BookKeeper :: Stream Storage :: Common Classes for Tests SKIPPED
2018-11-10T12:20:47.434 [INFO] Apache BookKeeper :: Stream Storage :: Common ...... SKIPPED
2018-11-10T12:20:47.434 [INFO] Apache BookKeeper :: Stream Storage :: API ......... SKIPPED
2018-11-10T12:20:47.434 [INFO] Apache BookKeeper :: Stream Storage :: Proto ....... SKIPPED
2018-11-10T12:20:47.434 [INFO] Apache BookKeeper :: Stream Storage :: Clients :: Parent SKIPPED
2018-11-10T12:20:47.434 [INFO] Apache BookKeeper :: Stream Storage :: Clients :: Java Client :: Parent SKIPPED
2018-11-10T12:20:47.434 [INFO] Apache BookKeeper :: Stream Storage :: Clients :: Java Client :: Base SKIPPED
2018-11-10T12:20:47.434 [INFO] Apache BookKeeper :: Stream Storage :: Clients :: Java Client :: KV SKIPPED
2018-11-10T12:20:47.434 [INFO] Apache BookKeeper :: Stream Storage :: Clients :: Java Client SKIPPED
2018-11-10T12:20:47.434 [INFO] Apache BookKeeper :: Stream Storage :: Storage :: Parent SKIPPED
2018-11-10T12:20:47.434 [INFO] Apache BookKeeper :: Stream Storage :: Storage :: Api SKIPPED
2018-11-10T12:20:47.434 [INFO] Apache BookKeeper :: Stream Storage :: State Library SKIPPED
2018-11-10T12:20:47.434 [INFO] Apache BookKeeper :: Stream Storage :: Storage :: Impl SKIPPED
2018-11-10T12:20:47.435 [INFO] Apache BookKeeper :: Tools :: Stream ............... SKIPPED
2018-11-10T12:20:47.435 [INFO] Apache BookKeeper :: Tools ......................... SKIPPED
2018-11-10T12:20:47.435 [INFO] Apache BookKeeper :: Stream Storage :: Server ...... SKIPPED
2018-11-10T12:20:47.435 [INFO] Apache BookKeeper :: Dist (Parent) ................. SKIPPED
2018-11-10T12:20:47.435 [INFO] Apache BookKeeper :: Dist (Server) ................. SKIPPED
2018-11-10T12:20:47.435 [INFO] Apache BookKeeper :: Tests :: Docker Images :: All Versions SKIPPED
2018-11-10T12:20:47.435 [INFO] Apache BookKeeper :: Tests :: Docker Images :: Current Version SKIPPED
2018-11-10T12:20:47.435 [INFO] Apache BookKeeper :: Tests :: Utility module for Arquillian based integration tests SKIPPED
2018-11-10T12:20:47.435 [INFO] Apache BookKeeper :: Tests :: Common topologies for Docker based integration tests SKIPPED
2018-11-10T12:20:47.435 [INFO] Apache BookKeeper :: Tests :: Base module for Arquillian based integration tests SKIPPED
2018-11-10T12:20:47.435 [INFO] Apache BookKeeper :: Tests :: Base module for Arquillian based integration tests using groovy SKIPPED
2018-11-10T12:20:47.435 [INFO] Apache BookKeeper :: Tests :: Backward Compatibility SKIPPED
2018-11-10T12:20:47.435 [INFO] Apache BookKeeper :: Tests :: Backward Compatibility :: Test upgrade between all released versions and current version SKIPPED
2018-11-10T12:20:47.435 [INFO] Apache BookKeeper :: Tests :: Backward Compatibility :: Test upgrade between 4.1.0 and current version SKIPPED
2018-11-10T12:20:47.435 [INFO] Apache BookKeeper :: Tests :: Backward Compatibility :: Test compat between old version and new version of hierarchical ledger manager SKIPPED
2018-11-10T12:20:47.435 [INFO] Apache BookKeeper :: Tests :: Backward Compatibility :: Test upgrade between 4.1.0 and current version (with hostname bookie ID) SKIPPED
2018-11-10T12:20:47.435 [INFO] Apache BookKeeper :: Tests :: Backward Compatibility :: Test recovery does not work when password no in metadata SKIPPED
2018-11-10T12:20:47.435 [INFO] Apache BookKeeper :: Tests :: Backward Compatibility :: Test upgrade 4.1.0 to current in cluster with cookies SKIPPED
2018-11-10T12:20:47.435 [INFO] Apache BookKeeper :: Tests :: Backward Compatibility :: Test old clients working on current server SKIPPED
2018-11-10T12:20:47.435 [INFO] Apache BookKeeper :: Tests :: Backward Compatibility :: Test upgrade between yahoo custom version and current SKIPPED
2018-11-10T12:20:47.435 [INFO] Apache BookKeeper :: Tests :: Integration .......... SKIPPED
2018-11-10T12:20:47.435 [INFO] Apache BookKeeper :: Tests :: Integration :: Smoke test SKIPPED
2018-11-10T12:20:47.435 [INFO] Apache BookKeeper :: Tests :: Integration :: Standalone test SKIPPED
2018-11-10T12:20:47.436 [INFO] Apache BookKeeper :: Tests :: Integration :: Cluster test SKIPPED
2018-11-10T12:20:47.436 [INFO] Apache BookKeeper :: Tests :: Bash Scripts Test .... SKIPPED
2018-11-10T12:20:47.436 [INFO] Apache BookKeeper :: Dist (All) .................... SKIPPED
2018-11-10T12:20:47.436 [INFO] Apache BookKeeper :: microbenchmarks ............... SKIPPED
2018-11-10T12:20:47.436 [INFO] Apache BookKeeper :: DistributedLog :: IO :: FileSystem SKIPPED
2018-11-10T12:20:47.436 [INFO] Apache BookKeeper :: DistributedLog :: IO .......... SKIPPED
2018-11-10T12:20:47.436 [INFO] ------------------------------------------------------------------------
2018-11-10T12:20:47.436 [INFO] BUILD FAILURE
2018-11-10T12:20:47.436 [INFO] ------------------------------------------------------------------------
2018-11-10T12:20:47.436 [INFO] Total time: 05:24 min
2018-11-10T12:20:47.437 [INFO] Finished at: 2018-11-10T12:20:47Z
2018-11-10T12:20:48.471 [INFO] Final Memory: 101M/2048M
2018-11-10T12:20:48.471 [INFO] ------------------------------------------------------------------------
Waiting for Jenkins to finish collecting data
2018-11-10T12:20:48.949 [ERROR] Failed to execute goal org.apache.maven.plugins:maven-compiler-plugin:3.7.0:compile (default-compile) on project bookkeeper-server: Compilation failure
2018-11-10T12:20:48.949 [ERROR] <https://builds.apache.org/job/bookkeeper_release_branch_48_java9/ws/bookkeeper-server/src/main/java/org/apache/bookkeeper/client/LedgerHandle.java>:[920,17] cannot find symbol
2018-11-10T12:20:48.949 [ERROR] symbol: method isHandleWritable()
2018-11-10T12:20:48.949 [ERROR] location: class org.apache.bookkeeper.client.LedgerHandle
2018-11-10T12:20:48.950 [ERROR] -> [Help 1]
2018-11-10T12:20:48.950 [ERROR]
2018-11-10T12:20:48.950 [ERROR] To see the full stack trace of the errors, re-run Maven with the -e switch.
2018-11-10T12:20:48.950 [ERROR] Re-run Maven using the -X switch to enable full debug logging.
2018-11-10T12:20:48.950 [ERROR]
2018-11-10T12:20:48.950 [ERROR] For more information about the errors and possible solutions, please read the following articles:
2018-11-10T12:20:48.950 [ERROR] [Help 1] http://cwiki.apache.org/confluence/display/MAVEN/MojoFailureException
2018-11-10T12:20:48.950 [ERROR]
2018-11-10T12:20:48.950 [ERROR] After correcting the problems, you can resume the build with the command
2018-11-10T12:20:48.950 [ERROR] mvn <goals> -rf :bookkeeper-server
channel stopped
Build failed in Jenkins: bookkeeper_release_branch_48_java9 #86
Posted by Apache Jenkins Server <je...@builds.apache.org>.
See <https://builds.apache.org/job/bookkeeper_release_branch_48_java9/86/display/redirect?page=changes>
Changes:
[sijie] Cache InetSocketAddress if hostname is IPAddress
[sijie] Issue #1791: Read Submission should bypass OSE Threads
[sijie] [TOOLS] add cookie related commands
------------------------------------------
[...truncated 507.44 KB...]
2018-11-09T12:19:52.272 [INFO] Downloaded: https://repo.maven.apache.org/maven2/commons-pool/commons-pool/1.6/commons-pool-1.6.jar (111 kB at 209 kB/s)
2018-11-09T12:19:52.272 [INFO] Downloading: https://repo.maven.apache.org/maven2/org/apache/directory/jdbm/apacheds-jdbm1/2.0.0-M2/apacheds-jdbm1-2.0.0-M2.jar
2018-11-09T12:19:52.286 [INFO] Downloaded: https://repo.maven.apache.org/maven2/org/apache/directory/server/apacheds-jdbm-partition/2.0.0-M15/apacheds-jdbm-partition-2.0.0-M15.jar (72 kB at 133 kB/s)
2018-11-09T12:19:52.287 [INFO] Downloading: https://repo.maven.apache.org/maven2/org/apache/directory/server/apacheds-protocol-ldap/2.0.0-M15/apacheds-protocol-ldap-2.0.0-M15.jar
2018-11-09T12:19:52.294 [INFO] Downloaded: https://repo.maven.apache.org/maven2/org/apache/directory/jdbm/apacheds-jdbm1/2.0.0-M2/apacheds-jdbm1-2.0.0-M2.jar (105 kB at 189 kB/s)
2018-11-09T12:19:52.294 [INFO] Downloading: https://repo.maven.apache.org/maven2/org/apache/directory/api/api-asn1-ber/1.0.0-M20/api-asn1-ber-1.0.0-M20.jar
2018-11-09T12:19:52.309 [INFO] Downloaded: https://repo.maven.apache.org/maven2/antlr/antlr/2.7.7/antlr-2.7.7.jar (445 kB at 784 kB/s)
2018-11-09T12:19:52.309 [INFO] Downloading: https://repo.maven.apache.org/maven2/org/apache/directory/api/api-ldap-extras-codec-api/1.0.0-M20/api-ldap-extras-codec-api-1.0.0-M20.jar
2018-11-09T12:19:52.309 [INFO] Downloaded: https://repo.maven.apache.org/maven2/org/apache/directory/api/api-asn1-ber/1.0.0-M20/api-asn1-ber-1.0.0-M20.jar (42 kB at 74 kB/s)
2018-11-09T12:19:52.309 [INFO] Downloading: https://repo.maven.apache.org/maven2/org/apache/directory/api/api-ldap-extras-codec/1.0.0-M20/api-ldap-extras-codec-1.0.0-M20.jar
2018-11-09T12:19:52.318 [INFO] Downloaded: https://repo.maven.apache.org/maven2/org/apache/directory/server/apacheds-protocol-ldap/2.0.0-M15/apacheds-protocol-ldap-2.0.0-M15.jar (228 kB at 396 kB/s)
2018-11-09T12:19:52.319 [INFO] Downloading: https://repo.maven.apache.org/maven2/org/apache/directory/api/api-ldap-extras-sp/1.0.0-M20/api-ldap-extras-sp-1.0.0-M20.jar
2018-11-09T12:19:52.326 [INFO] Downloaded: https://repo.maven.apache.org/maven2/org/apache/directory/api/api-ldap-extras-codec-api/1.0.0-M20/api-ldap-extras-codec-api-1.0.0-M20.jar (55 kB at 94 kB/s)
2018-11-09T12:19:52.326 [INFO] Downloading: https://repo.maven.apache.org/maven2/bouncycastle/bcprov-jdk15/140/bcprov-jdk15-140.jar
2018-11-09T12:19:52.331 [INFO] Downloaded: https://repo.maven.apache.org/maven2/org/apache/directory/api/api-ldap-extras-sp/1.0.0-M20/api-ldap-extras-sp-1.0.0-M20.jar (13 kB at 22 kB/s)
2018-11-09T12:19:52.331 [INFO] Downloading: https://repo.maven.apache.org/maven2/org/apache/zookeeper/zookeeper/3.4.13/zookeeper-3.4.13-tests.jar
2018-11-09T12:19:52.338 [INFO] Downloaded: https://repo.maven.apache.org/maven2/org/apache/directory/api/api-ldap-extras-codec/1.0.0-M20/api-ldap-extras-codec-1.0.0-M20.jar (208 kB at 349 kB/s)
2018-11-09T12:19:52.412 [INFO] Downloaded: https://repo.maven.apache.org/maven2/org/apache/zookeeper/zookeeper/3.4.13/zookeeper-3.4.13-tests.jar (727 kB at 1.1 MB/s)
2018-11-09T12:19:52.475 [INFO] Downloaded: https://repo.maven.apache.org/maven2/bouncycastle/bcprov-jdk15/140/bcprov-jdk15-140.jar (1.6 MB at 2.2 MB/s)
2018-11-09T12:19:52.509 [INFO] Downloaded: https://repo.maven.apache.org/maven2/org/apache/directory/api/api-all/1.0.0-M20/api-all-1.0.0-M20.jar (2.8 MB at 3.6 MB/s)
2018-11-09T12:19:53.092 [INFO] Downloaded: https://repo.maven.apache.org/maven2/org/rocksdb/rocksdbjni/5.13.1/rocksdbjni-5.13.1.jar (14 MB at 10 MB/s)
2018-11-09T12:19:53.129 [INFO]
2018-11-09T12:19:53.129 [INFO] --- maven-clean-plugin:3.0.0:clean (default-clean) @ bookkeeper-server ---
2018-11-09T12:19:53.319 [INFO]
2018-11-09T12:19:53.319 [INFO] --- apache-rat-plugin:0.12:check (default-cli) @ bookkeeper-server ---
2018-11-09T12:19:53.423 [INFO] Enabled default license matchers.
2018-11-09T12:19:53.426 [INFO] Will parse SCM ignores for exclusions...
2018-11-09T12:19:53.427 [INFO] Finished adding exclusions from SCM ignore files.
2018-11-09T12:19:53.427 [INFO] 61 implicit excludes (use -debug for more details).
2018-11-09T12:19:53.427 [INFO] Exclude: **/target/**/*
2018-11-09T12:19:53.427 [INFO] Exclude: **/.classpath
2018-11-09T12:19:53.427 [INFO] Exclude: **/.gitignore
2018-11-09T12:19:53.427 [INFO] Exclude: **/.project
2018-11-09T12:19:53.427 [INFO] Exclude: **/.checkstyle
2018-11-09T12:19:53.427 [INFO] Exclude: **/.settings/*
2018-11-09T12:19:53.427 [INFO] Exclude: src/test/resources/server-key.pem
2018-11-09T12:19:53.427 [INFO] Exclude: src/test/resources/server-key.p12
2018-11-09T12:19:53.427 [INFO] Exclude: src/test/resources/server-key.jks
2018-11-09T12:19:53.427 [INFO] Exclude: src/test/resources/server-cert.pem
2018-11-09T12:19:53.427 [INFO] Exclude: src/test/resources/client-key.pem
2018-11-09T12:19:53.427 [INFO] Exclude: src/test/resources/client-key.p12
2018-11-09T12:19:53.427 [INFO] Exclude: src/test/resources/client-key.jks
2018-11-09T12:19:53.427 [INFO] Exclude: src/test/resources/client-cert.pem
2018-11-09T12:19:53.427 [INFO] Exclude: src/test/resources/keyStoreClientPassword.txt
2018-11-09T12:19:53.427 [INFO] Exclude: src/test/resources/keyStoreServerPassword.txt
2018-11-09T12:19:53.448 [INFO] 665 resources included (use -debug for more details)
2018-11-09T12:19:53.940 [INFO] Rat check: Summary over all files. Unapproved: 0, unknown: 0, generated: 0, approved: 665 licenses.
2018-11-09T12:19:54.100 [INFO]
2018-11-09T12:19:54.100 [INFO] --- maven-remote-resources-plugin:1.5:process (process-resource-bundles) @ bookkeeper-server ---
2018-11-09T12:19:58.249 [INFO]
2018-11-09T12:19:58.249 [INFO] --- maven-resources-plugin:2.7:resources (default-resources) @ bookkeeper-server ---
2018-11-09T12:19:58.309 [INFO] Using 'UTF-8' encoding to copy filtered resources.
2018-11-09T12:19:58.309 [INFO] skip non existing resourceDirectory <https://builds.apache.org/job/bookkeeper_release_branch_48_java9/ws/bookkeeper-server/src/main/resources>
2018-11-09T12:19:58.314 [INFO] Copying 3 resources
2018-11-09T12:19:58.484 [INFO]
2018-11-09T12:19:58.484 [INFO] --- maven-compiler-plugin:3.7.0:compile (default-compile) @ bookkeeper-server ---
2018-11-09T12:19:58.641 [INFO] Changes detected - recompiling the module!
2018-11-09T12:19:58.646 [INFO] Compiling 431 source files to <https://builds.apache.org/job/bookkeeper_release_branch_48_java9/ws/bookkeeper-server/target/classes>
2018-11-09T12:20:11.845 [INFO] -------------------------------------------------------------
2018-11-09T12:20:11.845 [ERROR] COMPILATION ERROR :
2018-11-09T12:20:11.845 [INFO] -------------------------------------------------------------
2018-11-09T12:20:11.845 [ERROR] <https://builds.apache.org/job/bookkeeper_release_branch_48_java9/ws/bookkeeper-server/src/main/java/org/apache/bookkeeper/client/LedgerHandle.java>:[920,17] cannot find symbol
symbol: method isHandleWritable()
location: class org.apache.bookkeeper.client.LedgerHandle
2018-11-09T12:20:11.845 [INFO] 1 error
2018-11-09T12:20:11.846 [INFO] -------------------------------------------------------------
[JENKINS] Archiving disabled
[JENKINS] Archiving disabled
[JENKINS] Archiving disabled
[JENKINS] Archiving disabled
[JENKINS] Archiving disabled
[JENKINS] Archiving disabled
[JENKINS] Archiving disabled
[JENKINS] Archiving disabled
[JENKINS] Archiving disabled
[JENKINS] Archiving disabled
[JENKINS] Archiving disabled
[JENKINS] Archiving disabled
[JENKINS] Archiving disabled
[JENKINS] Archiving disabled
[JENKINS] Archiving disabled
[JENKINS] Archiving disabled
[JENKINS] Archiving disabled
[JENKINS] Archiving disabled
[JENKINS] Archiving disabled
[JENKINS] Archiving disabled
[JENKINS] Archiving disabled
[JENKINS] Archiving disabled
[JENKINS] Archiving disabled
[JENKINS] Archiving disabled
[JENKINS] Archiving disabled
[JENKINS] Archiving disabled
[JENKINS] Archiving disabled
[JENKINS] Archiving disabled
[JENKINS] Archiving disabled
[JENKINS] Archiving disabled
[JENKINS] Archiving disabled
[JENKINS] Archiving disabled
[JENKINS] Archiving disabled
[JENKINS] Archiving disabled
[JENKINS] Archiving disabled
[JENKINS] Archiving disabled
[JENKINS] Archiving disabled
[JENKINS] Archiving disabled
[JENKINS] Archiving disabled
[JENKINS] Archiving disabled
[JENKINS] Archiving disabled
[JENKINS] Archiving disabled
[JENKINS] Archiving disabled
[JENKINS] Archiving disabled
[JENKINS] Archiving disabled
[JENKINS] Archiving disabled
[JENKINS] Archiving disabled
[JENKINS] Archiving disabled
[JENKINS] Archiving disabled
[JENKINS] Archiving disabled
[JENKINS] Archiving disabled
[JENKINS] Archiving disabled
[JENKINS] Archiving disabled
[JENKINS] Archiving disabled
[JENKINS] Archiving disabled
[JENKINS] Archiving disabled
[JENKINS] Archiving disabled
[JENKINS] Archiving disabled
[JENKINS] Archiving disabled
[JENKINS] Archiving disabled
[JENKINS] Archiving disabled
[JENKINS] Archiving disabled
[JENKINS] Archiving disabled
[JENKINS] Archiving disabled
[JENKINS] Archiving disabled
[JENKINS] Archiving disabled
[JENKINS] Archiving disabled
[JENKINS] Archiving disabled
[JENKINS] Archiving disabled
[JENKINS] Archiving disabled
[JENKINS] Archiving disabled
[JENKINS] Archiving disabled
[JENKINS] Archiving disabled
[JENKINS] Archiving disabled
[JENKINS] Archiving disabled
[JENKINS] Archiving disabled
[JENKINS] Archiving disabled
[JENKINS] Archiving disabled
[JENKINS] Archiving disabled
2018-11-09T12:20:57.355 [INFO] ------------------------------------------------------------------------
2018-11-09T12:20:57.355 [INFO] Reactor Summary:
2018-11-09T12:20:57.355 [INFO]
2018-11-09T12:20:57.355 [INFO] Apache BookKeeper :: Parent ........................ SUCCESS [ 14.534 s]
2018-11-09T12:20:57.356 [INFO] Apache BookKeeper :: Build Tools ................... SUCCESS [ 5.822 s]
2018-11-09T12:20:57.356 [INFO] Apache BookKeeper :: Circe Checksum Library ........ SUCCESS [01:33 min]
2018-11-09T12:20:57.356 [INFO] Apache BookKeeper :: Stats API ..................... SUCCESS [ 13.338 s]
2018-11-09T12:20:57.356 [INFO] Apache BookKeeper :: Common ........................ SUCCESS [ 32.661 s]
2018-11-09T12:20:57.356 [INFO] Apache BookKeeper :: Protocols ..................... SUCCESS [ 23.931 s]
2018-11-09T12:20:57.356 [INFO] Apache BookKeeper :: Tools :: Parent ............... SUCCESS [ 2.204 s]
2018-11-09T12:20:57.356 [INFO] Apache BookKeeper :: Tools :: Framework ............ SUCCESS [ 12.514 s]
2018-11-09T12:20:57.356 [INFO] Apache BookKeeper :: Http :: Http Server ........... SUCCESS [ 8.463 s]
2018-11-09T12:20:57.356 [INFO] Apache BookKeeper :: Server ........................ FAILURE [ 22.734 s]
2018-11-09T12:20:57.356 [INFO] Apache BookKeeper :: Benchmark ..................... SKIPPED
2018-11-09T12:20:57.356 [INFO] Apache BookKeeper :: Stats Providers :: Twitter Finagle Stats SKIPPED
2018-11-09T12:20:57.356 [INFO] Apache BookKeeper :: Stats Providers :: Twitter Science Stats SKIPPED
2018-11-09T12:20:57.356 [INFO] Apache BookKeeper :: Stats Providers :: Twitter Ostrich Stats SKIPPED
2018-11-09T12:20:57.356 [INFO] Apache BookKeeper :: Stats Providers :: Codahale Metrics SKIPPED
2018-11-09T12:20:57.357 [INFO] Apache BookKeeper :: Stats Providers :: Prometheus . SKIPPED
2018-11-09T12:20:57.357 [INFO] Apache BookKeeper :: Stats Providers ............... SKIPPED
2018-11-09T12:20:57.357 [INFO] Apache BookKeeper :: Bookkeeper Http :: Twitter Http Server SKIPPED
2018-11-09T12:20:57.357 [INFO] Apache BookKeeper :: Bookkeeper Http :: Vertx Http Server SKIPPED
2018-11-09T12:20:57.357 [INFO] Apache BookKeeper :: Http .......................... SKIPPED
2018-11-09T12:20:57.357 [INFO] Apache BookKeeper :: Shaded :: Parent .............. SKIPPED
2018-11-09T12:20:57.357 [INFO] Apache BookKeeper :: Shaded :: bookkeeper-server-shaded SKIPPED
2018-11-09T12:20:57.357 [INFO] Apache BookKeeper :: Shaded :: bookkeeper-server-tests-shaded SKIPPED
2018-11-09T12:20:57.357 [INFO] Apache BookKeeper :: DistributedLog :: Parent ...... SKIPPED
2018-11-09T12:20:57.357 [INFO] Apache BookKeeper :: DistributedLog :: Common ...... SKIPPED
2018-11-09T12:20:57.357 [INFO] Apache BookKeeper :: DistributedLog :: Protocol .... SKIPPED
2018-11-09T12:20:57.357 [INFO] Apache BookKeeper :: DistributedLog :: Core Library SKIPPED
2018-11-09T12:20:57.357 [INFO] Apache BookKeeper :: Shaded :: distributedlog-core-shaded SKIPPED
2018-11-09T12:20:57.357 [INFO] Apache BookKeeper :: Tests ......................... SKIPPED
2018-11-09T12:20:57.357 [INFO] Apache BookKeeper :: Tests :: Test Shaded Jars ..... SKIPPED
2018-11-09T12:20:57.357 [INFO] Apache BookKeeper :: Tests :: bookkeeper-server-shaded test SKIPPED
2018-11-09T12:20:57.357 [INFO] Apache BookKeeper :: Tests :: bookkeeper-server-tests-shaded test SKIPPED
2018-11-09T12:20:57.357 [INFO] Apache BookKeeper :: Tests :: distributedlog-core-shaded test SKIPPED
2018-11-09T12:20:57.357 [INFO] Apache BookKeeper :: Tests :: Docker Images ........ SKIPPED
2018-11-09T12:20:57.357 [INFO] Apache BookKeeper :: Tests :: Docker Images :: All Released Versions SKIPPED
2018-11-09T12:20:57.357 [INFO] Apache BookKeeper :: Stream Storage :: Parent ...... SKIPPED
2018-11-09T12:20:57.357 [INFO] Apache BookKeeper :: Stream Storage :: Common Classes for Tests SKIPPED
2018-11-09T12:20:57.357 [INFO] Apache BookKeeper :: Stream Storage :: Common ...... SKIPPED
2018-11-09T12:20:57.357 [INFO] Apache BookKeeper :: Stream Storage :: API ......... SKIPPED
2018-11-09T12:20:57.357 [INFO] Apache BookKeeper :: Stream Storage :: Proto ....... SKIPPED
2018-11-09T12:20:57.357 [INFO] Apache BookKeeper :: Stream Storage :: Clients :: Parent SKIPPED
2018-11-09T12:20:57.357 [INFO] Apache BookKeeper :: Stream Storage :: Clients :: Java Client :: Parent SKIPPED
2018-11-09T12:20:57.357 [INFO] Apache BookKeeper :: Stream Storage :: Clients :: Java Client :: Base SKIPPED
2018-11-09T12:20:57.357 [INFO] Apache BookKeeper :: Stream Storage :: Clients :: Java Client :: KV SKIPPED
2018-11-09T12:20:57.357 [INFO] Apache BookKeeper :: Stream Storage :: Clients :: Java Client SKIPPED
2018-11-09T12:20:57.357 [INFO] Apache BookKeeper :: Stream Storage :: Storage :: Parent SKIPPED
2018-11-09T12:20:57.358 [INFO] Apache BookKeeper :: Stream Storage :: Storage :: Api SKIPPED
2018-11-09T12:20:57.358 [INFO] Apache BookKeeper :: Stream Storage :: State Library SKIPPED
2018-11-09T12:20:57.358 [INFO] Apache BookKeeper :: Stream Storage :: Storage :: Impl SKIPPED
2018-11-09T12:20:57.358 [INFO] Apache BookKeeper :: Tools :: Stream ............... SKIPPED
2018-11-09T12:20:57.358 [INFO] Apache BookKeeper :: Tools ......................... SKIPPED
2018-11-09T12:20:57.358 [INFO] Apache BookKeeper :: Stream Storage :: Server ...... SKIPPED
2018-11-09T12:20:57.358 [INFO] Apache BookKeeper :: Dist (Parent) ................. SKIPPED
2018-11-09T12:20:57.358 [INFO] Apache BookKeeper :: Dist (Server) ................. SKIPPED
2018-11-09T12:20:57.358 [INFO] Apache BookKeeper :: Tests :: Docker Images :: All Versions SKIPPED
2018-11-09T12:20:57.358 [INFO] Apache BookKeeper :: Tests :: Docker Images :: Current Version SKIPPED
2018-11-09T12:20:57.358 [INFO] Apache BookKeeper :: Tests :: Utility module for Arquillian based integration tests SKIPPED
2018-11-09T12:20:57.358 [INFO] Apache BookKeeper :: Tests :: Common topologies for Docker based integration tests SKIPPED
2018-11-09T12:20:57.358 [INFO] Apache BookKeeper :: Tests :: Base module for Arquillian based integration tests SKIPPED
2018-11-09T12:20:57.358 [INFO] Apache BookKeeper :: Tests :: Base module for Arquillian based integration tests using groovy SKIPPED
2018-11-09T12:20:57.358 [INFO] Apache BookKeeper :: Tests :: Backward Compatibility SKIPPED
2018-11-09T12:20:57.358 [INFO] Apache BookKeeper :: Tests :: Backward Compatibility :: Test upgrade between all released versions and current version SKIPPED
2018-11-09T12:20:57.358 [INFO] Apache BookKeeper :: Tests :: Backward Compatibility :: Test upgrade between 4.1.0 and current version SKIPPED
2018-11-09T12:20:57.358 [INFO] Apache BookKeeper :: Tests :: Backward Compatibility :: Test compat between old version and new version of hierarchical ledger manager SKIPPED
2018-11-09T12:20:57.358 [INFO] Apache BookKeeper :: Tests :: Backward Compatibility :: Test upgrade between 4.1.0 and current version (with hostname bookie ID) SKIPPED
2018-11-09T12:20:57.358 [INFO] Apache BookKeeper :: Tests :: Backward Compatibility :: Test recovery does not work when password no in metadata SKIPPED
2018-11-09T12:20:57.358 [INFO] Apache BookKeeper :: Tests :: Backward Compatibility :: Test upgrade 4.1.0 to current in cluster with cookies SKIPPED
2018-11-09T12:20:57.358 [INFO] Apache BookKeeper :: Tests :: Backward Compatibility :: Test old clients working on current server SKIPPED
2018-11-09T12:20:57.358 [INFO] Apache BookKeeper :: Tests :: Backward Compatibility :: Test upgrade between yahoo custom version and current SKIPPED
2018-11-09T12:20:57.358 [INFO] Apache BookKeeper :: Tests :: Integration .......... SKIPPED
2018-11-09T12:20:57.358 [INFO] Apache BookKeeper :: Tests :: Integration :: Smoke test SKIPPED
2018-11-09T12:20:57.358 [INFO] Apache BookKeeper :: Tests :: Integration :: Standalone test SKIPPED
2018-11-09T12:20:57.358 [INFO] Apache BookKeeper :: Tests :: Integration :: Cluster test SKIPPED
2018-11-09T12:20:57.358 [INFO] Apache BookKeeper :: Tests :: Bash Scripts Test .... SKIPPED
2018-11-09T12:20:57.358 [INFO] Apache BookKeeper :: Dist (All) .................... SKIPPED
2018-11-09T12:20:57.358 [INFO] Apache BookKeeper :: microbenchmarks ............... SKIPPED
2018-11-09T12:20:57.358 [INFO] Apache BookKeeper :: DistributedLog :: IO :: FileSystem SKIPPED
2018-11-09T12:20:57.358 [INFO] Apache BookKeeper :: DistributedLog :: IO .......... SKIPPED
2018-11-09T12:20:57.358 [INFO] ------------------------------------------------------------------------
2018-11-09T12:20:57.358 [INFO] BUILD FAILURE
2018-11-09T12:20:57.359 [INFO] ------------------------------------------------------------------------
2018-11-09T12:20:57.359 [INFO] Total time: 05:28 min
2018-11-09T12:20:57.359 [INFO] Finished at: 2018-11-09T12:20:57Z
2018-11-09T12:20:58.182 [INFO] Final Memory: 101M/2048M
2018-11-09T12:20:58.183 [INFO] ------------------------------------------------------------------------
Waiting for Jenkins to finish collecting data
2018-11-09T12:20:58.671 [ERROR] Failed to execute goal org.apache.maven.plugins:maven-compiler-plugin:3.7.0:compile (default-compile) on project bookkeeper-server: Compilation failure
2018-11-09T12:20:58.671 [ERROR] <https://builds.apache.org/job/bookkeeper_release_branch_48_java9/ws/bookkeeper-server/src/main/java/org/apache/bookkeeper/client/LedgerHandle.java>:[920,17] cannot find symbol
2018-11-09T12:20:58.671 [ERROR] symbol: method isHandleWritable()
2018-11-09T12:20:58.671 [ERROR] location: class org.apache.bookkeeper.client.LedgerHandle
2018-11-09T12:20:58.671 [ERROR] -> [Help 1]
2018-11-09T12:20:58.671 [ERROR]
2018-11-09T12:20:58.671 [ERROR] To see the full stack trace of the errors, re-run Maven with the -e switch.
2018-11-09T12:20:58.671 [ERROR] Re-run Maven using the -X switch to enable full debug logging.
2018-11-09T12:20:58.671 [ERROR]
2018-11-09T12:20:58.671 [ERROR] For more information about the errors and possible solutions, please read the following articles:
2018-11-09T12:20:58.671 [ERROR] [Help 1] http://cwiki.apache.org/confluence/display/MAVEN/MojoFailureException
2018-11-09T12:20:58.672 [ERROR]
2018-11-09T12:20:58.672 [ERROR] After correcting the problems, you can resume the build with the command
2018-11-09T12:20:58.672 [ERROR] mvn <goals> -rf :bookkeeper-server
channel stopped
Jenkins build is still unstable: bookkeeper_release_branch_48_java9
#85
Posted by Apache Jenkins Server <je...@builds.apache.org>.
See <https://builds.apache.org/job/bookkeeper_release_branch_48_java9/85/display/redirect?page=changes>