You are viewing a plain text version of this content. The canonical link for it is here.
Posted to builds@solr.apache.org by Policeman Jenkins Server <je...@thetaphi.de> on 2022/08/05 21:10:25 UTC

[JENKINS-EA] Solr-main-Linux (64bit/jdk-19-ea+32) - Build # 6327 - Unstable!

Build: https://jenkins.thetaphi.de/job/Solr-main-Linux/6327/
Java: 64bit/jdk-19-ea+32 -XX:-UseCompressedOops -XX:+UseG1GC

1 tests failed.
FAILED:  org.apache.solr.cloud.MissingSegmentRecoveryTest.testLeaderRecovery

Error Message:
java.lang.AssertionError: Expected a collection with one shard and two replicas
Timeout waiting to see state for collection=MissingSegmentRecoveryTest :DocCollection(MissingSegmentRecoveryTest//collections/MissingSegmentRecoveryTest/state.json/9 )={
  "pullReplicas":"0",
  "configName":"conf",
  "replicationFactor":"2",
  "shards":{"shard1":{
      "range":"80000000-7fffffff",
      "replicas":{
        "core_node3":{
          "core":"MissingSegmentRecoveryTest_shard1_replica_n1",
          "leader":"true",
          "core_node_name":"core_node3",
          "node_name":"127.0.0.1:36037_solr",
          "base_url":"https://127.0.0.1:36037/solr",
          "state":"active",
          "collection":"MissingSegmentRecoveryTest",
          "shard":"shard1",
          "type":"NRT",
          "force_set_state":"false"},
        "core_node4":{
          "core":"MissingSegmentRecoveryTest_shard1_replica_n2",
          "core_node_name":"core_node4",
          "node_name":"127.0.0.1:43977_solr",
          "base_url":"https://127.0.0.1:43977/solr",
          "state":"down",
          "collection":"MissingSegmentRecoveryTest",
          "shard":"shard1",
          "type":"NRT",
          "force_set_state":"false"}},
      "state":"active"}},
  "router":{"name":"compositeId"},
  "nrtReplicas":"2",
  "tlogReplicas":"0"}
Live Nodes: [127.0.0.1:36037_solr, 127.0.0.1:43977_solr]
Last available state: DocCollection(MissingSegmentRecoveryTest//collections/MissingSegmentRecoveryTest/state.json/9 )={
  "pullReplicas":"0",
  "configName":"conf",
  "replicationFactor":"2",
  "shards":{"shard1":{
      "range":"80000000-7fffffff",
      "replicas":{
        "core_node3":{
          "core":"MissingSegmentRecoveryTest_shard1_replica_n1",
          "leader":"true",
          "core_node_name":"core_node3",
          "node_name":"127.0.0.1:36037_solr",
          "base_url":"https://127.0.0.1:36037/solr",
          "state":"active",
          "collection":"MissingSegmentRecoveryTest",
          "shard":"shard1",
          "type":"NRT",
          "force_set_state":"false"},
        "core_node4":{
          "core":"MissingSegmentRecoveryTest_shard1_replica_n2",
          "core_node_name":"core_node4",
          "node_name":"127.0.0.1:43977_solr",
          "base_url":"https://127.0.0.1:43977/solr",
          "state":"down",
          "collection":"MissingSegmentRecoveryTest",
          "shard":"shard1",
          "type":"NRT",
          "force_set_state":"false"}},
      "state":"active"}},
  "router":{"name":"compositeId"},
  "nrtReplicas":"2",
  "tlogReplicas":"0"}

Stack Trace:
java.lang.AssertionError: Expected a collection with one shard and two replicas
Timeout waiting to see state for collection=MissingSegmentRecoveryTest :DocCollection(MissingSegmentRecoveryTest//collections/MissingSegmentRecoveryTest/state.json/9 )={
  "pullReplicas":"0",
  "configName":"conf",
  "replicationFactor":"2",
  "shards":{"shard1":{
      "range":"80000000-7fffffff",
      "replicas":{
        "core_node3":{
          "core":"MissingSegmentRecoveryTest_shard1_replica_n1",
          "leader":"true",
          "core_node_name":"core_node3",
          "node_name":"127.0.0.1:36037_solr",
          "base_url":"https://127.0.0.1:36037/solr",
          "state":"active",
          "collection":"MissingSegmentRecoveryTest",
          "shard":"shard1",
          "type":"NRT",
          "force_set_state":"false"},
        "core_node4":{
          "core":"MissingSegmentRecoveryTest_shard1_replica_n2",
          "core_node_name":"core_node4",
          "node_name":"127.0.0.1:43977_solr",
          "base_url":"https://127.0.0.1:43977/solr",
          "state":"down",
          "collection":"MissingSegmentRecoveryTest",
          "shard":"shard1",
          "type":"NRT",
          "force_set_state":"false"}},
      "state":"active"}},
  "router":{"name":"compositeId"},
  "nrtReplicas":"2",
  "tlogReplicas":"0"}
Live Nodes: [127.0.0.1:36037_solr, 127.0.0.1:43977_solr]
Last available state: DocCollection(MissingSegmentRecoveryTest//collections/MissingSegmentRecoveryTest/state.json/9 )={
  "pullReplicas":"0",
  "configName":"conf",
  "replicationFactor":"2",
  "shards":{"shard1":{
      "range":"80000000-7fffffff",
      "replicas":{
        "core_node3":{
          "core":"MissingSegmentRecoveryTest_shard1_replica_n1",
          "leader":"true",
          "core_node_name":"core_node3",
          "node_name":"127.0.0.1:36037_solr",
          "base_url":"https://127.0.0.1:36037/solr",
          "state":"active",
          "collection":"MissingSegmentRecoveryTest",
          "shard":"shard1",
          "type":"NRT",
          "force_set_state":"false"},
        "core_node4":{
          "core":"MissingSegmentRecoveryTest_shard1_replica_n2",
          "core_node_name":"core_node4",
          "node_name":"127.0.0.1:43977_solr",
          "base_url":"https://127.0.0.1:43977/solr",
          "state":"down",
          "collection":"MissingSegmentRecoveryTest",
          "shard":"shard1",
          "type":"NRT",
          "force_set_state":"false"}},
      "state":"active"}},
  "router":{"name":"compositeId"},
  "nrtReplicas":"2",
  "tlogReplicas":"0"}
	at __randomizedtesting.SeedInfo.seed([BA8F2A6AF2E70396:EADAB269ABC6B58B]:0)
	at org.junit.Assert.fail(Assert.java:89)
	at org.apache.solr.cloud.SolrCloudTestCase.waitForState(SolrCloudTestCase.java:170)
	at org.apache.solr.cloud.SolrCloudTestCase.waitForState(SolrCloudTestCase.java:136)
	at org.apache.solr.cloud.MissingSegmentRecoveryTest.testLeaderRecovery(MissingSegmentRecoveryTest.java:105)
	at java.base/jdk.internal.reflect.DirectMethodHandleAccessor.invoke(DirectMethodHandleAccessor.java:104)
	at java.base/java.lang.reflect.Method.invoke(Method.java:578)
	at com.carrotsearch.randomizedtesting.RandomizedRunner.invoke(RandomizedRunner.java:1758)
	at com.carrotsearch.randomizedtesting.RandomizedRunner$8.evaluate(RandomizedRunner.java:946)
	at com.carrotsearch.randomizedtesting.RandomizedRunner$9.evaluate(RandomizedRunner.java:982)
	at com.carrotsearch.randomizedtesting.RandomizedRunner$10.evaluate(RandomizedRunner.java:996)
	at com.carrotsearch.randomizedtesting.rules.SystemPropertiesRestoreRule$1.evaluate(SystemPropertiesRestoreRule.java:57)
	at org.junit.rules.RunRules.evaluate(RunRules.java:20)
	at org.apache.lucene.tests.util.TestRuleSetupTeardownChained$1.evaluate(TestRuleSetupTeardownChained.java:44)
	at org.apache.lucene.tests.util.AbstractBeforeAfterRule$1.evaluate(AbstractBeforeAfterRule.java:43)
	at org.apache.lucene.tests.util.TestRuleThreadAndTestName$1.evaluate(TestRuleThreadAndTestName.java:45)
	at org.apache.lucene.tests.util.TestRuleIgnoreAfterMaxFailures$1.evaluate(TestRuleIgnoreAfterMaxFailures.java:60)
	at org.apache.lucene.tests.util.TestRuleMarkFailure$1.evaluate(TestRuleMarkFailure.java:44)
	at org.junit.rules.RunRules.evaluate(RunRules.java:20)
	at com.carrotsearch.randomizedtesting.rules.StatementAdapter.evaluate(StatementAdapter.java:36)
	at com.carrotsearch.randomizedtesting.ThreadLeakControl$StatementRunner.run(ThreadLeakControl.java:375)
	at com.carrotsearch.randomizedtesting.ThreadLeakControl.forkTimeoutingTask(ThreadLeakControl.java:824)
	at com.carrotsearch.randomizedtesting.ThreadLeakControl$3.evaluate(ThreadLeakControl.java:475)
	at com.carrotsearch.randomizedtesting.RandomizedRunner.runSingleTest(RandomizedRunner.java:955)
	at com.carrotsearch.randomizedtesting.RandomizedRunner$5.evaluate(RandomizedRunner.java:840)
	at com.carrotsearch.randomizedtesting.RandomizedRunner$6.evaluate(RandomizedRunner.java:891)
	at com.carrotsearch.randomizedtesting.RandomizedRunner$7.evaluate(RandomizedRunner.java:902)
	at com.carrotsearch.randomizedtesting.rules.StatementAdapter.evaluate(StatementAdapter.java:36)
	at org.apache.lucene.tests.util.AbstractBeforeAfterRule$1.evaluate(AbstractBeforeAfterRule.java:43)
	at org.apache.lucene.tests.util.AbstractBeforeAfterRule$1.evaluate(AbstractBeforeAfterRule.java:43)
	at com.carrotsearch.randomizedtesting.rules.SystemPropertiesRestoreRule$1.evaluate(SystemPropertiesRestoreRule.java:57)
	at org.junit.rules.RunRules.evaluate(RunRules.java:20)
	at org.apache.lucene.tests.util.AbstractBeforeAfterRule$1.evaluate(AbstractBeforeAfterRule.java:43)
	at com.carrotsearch.randomizedtesting.rules.StatementAdapter.evaluate(StatementAdapter.java:36)
	at org.apache.lucene.tests.util.TestRuleStoreClassName$1.evaluate(TestRuleStoreClassName.java:38)
	at com.carrotsearch.randomizedtesting.rules.NoShadowingOrOverridesOnMethodsRule$1.evaluate(NoShadowingOrOverridesOnMethodsRule.java:40)
	at com.carrotsearch.randomizedtesting.rules.NoShadowingOrOverridesOnMethodsRule$1.evaluate(NoShadowingOrOverridesOnMethodsRule.java:40)
	at com.carrotsearch.randomizedtesting.rules.StatementAdapter.evaluate(StatementAdapter.java:36)
	at com.carrotsearch.randomizedtesting.rules.StatementAdapter.evaluate(StatementAdapter.java:36)
	at org.apache.lucene.tests.util.TestRuleAssertionsRequired$1.evaluate(TestRuleAssertionsRequired.java:53)
	at org.apache.lucene.tests.util.AbstractBeforeAfterRule$1.evaluate(AbstractBeforeAfterRule.java:43)
	at org.apache.lucene.tests.util.TestRuleMarkFailure$1.evaluate(TestRuleMarkFailure.java:44)
	at org.apache.lucene.tests.util.TestRuleIgnoreAfterMaxFailures$1.evaluate(TestRuleIgnoreAfterMaxFailures.java:60)
	at org.apache.lucene.tests.util.TestRuleIgnoreTestSuites$1.evaluate(TestRuleIgnoreTestSuites.java:47)
	at org.junit.rules.RunRules.evaluate(RunRules.java:20)
	at com.carrotsearch.randomizedtesting.rules.StatementAdapter.evaluate(StatementAdapter.java:36)
	at com.carrotsearch.randomizedtesting.ThreadLeakControl$StatementRunner.run(ThreadLeakControl.java:375)
	at com.carrotsearch.randomizedtesting.ThreadLeakControl.lambda$forkTimeoutingTask$0(ThreadLeakControl.java:831)
	at java.base/java.lang.Thread.run(Thread.java:1589)

[JENKINS] Solr-main-Linux (64bit/jdk-16.0.2) - Build # 6329 - Still Unstable!

Posted by Policeman Jenkins Server <je...@thetaphi.de>.
Build: https://jenkins.thetaphi.de/job/Solr-main-Linux/6329/
Java: 64bit/jdk-16.0.2 -XX:+UseCompressedOops -XX:+UseShenandoahGC

2 tests failed.
FAILED:  org.apache.solr.cloud.overseer.ZkStateReaderTest.testNodeVersion

Error Message:
java.lang.NullPointerException: Cannot invoke "org.apache.solr.common.cloud.ClusterState$CollectionRef.get()" because the return value of "org.apache.solr.common.cloud.ClusterState.getCollectionRef(String)" is null

Stack Trace:
java.lang.NullPointerException: Cannot invoke "org.apache.solr.common.cloud.ClusterState$CollectionRef.get()" because the return value of "org.apache.solr.common.cloud.ClusterState.getCollectionRef(String)" is null
	at __randomizedtesting.SeedInfo.seed([700669533F1A30C6:745ABA8CC691A25E]:0)
	at org.apache.solr.cloud.overseer.ZkStateReaderTest.lambda$testNodeVersion$5(ZkStateReaderTest.java:301)
	at org.apache.solr.util.TimeOut.waitFor(TimeOut.java:64)
	at org.apache.solr.cloud.overseer.ZkStateReaderTest.testNodeVersion(ZkStateReaderTest.java:299)
	at java.base/jdk.internal.reflect.NativeMethodAccessorImpl.invoke0(Native Method)
	at java.base/jdk.internal.reflect.NativeMethodAccessorImpl.invoke(NativeMethodAccessorImpl.java:78)
	at java.base/jdk.internal.reflect.DelegatingMethodAccessorImpl.invoke(DelegatingMethodAccessorImpl.java:43)
	at java.base/java.lang.reflect.Method.invoke(Method.java:567)
	at com.carrotsearch.randomizedtesting.RandomizedRunner.invoke(RandomizedRunner.java:1758)
	at com.carrotsearch.randomizedtesting.RandomizedRunner$8.evaluate(RandomizedRunner.java:946)
	at com.carrotsearch.randomizedtesting.RandomizedRunner$9.evaluate(RandomizedRunner.java:982)
	at com.carrotsearch.randomizedtesting.RandomizedRunner$10.evaluate(RandomizedRunner.java:996)
	at com.carrotsearch.randomizedtesting.rules.SystemPropertiesRestoreRule$1.evaluate(SystemPropertiesRestoreRule.java:57)
	at org.junit.rules.RunRules.evaluate(RunRules.java:20)
	at org.apache.lucene.tests.util.TestRuleSetupTeardownChained$1.evaluate(TestRuleSetupTeardownChained.java:44)
	at org.apache.lucene.tests.util.AbstractBeforeAfterRule$1.evaluate(AbstractBeforeAfterRule.java:43)
	at org.apache.lucene.tests.util.TestRuleThreadAndTestName$1.evaluate(TestRuleThreadAndTestName.java:45)
	at org.apache.lucene.tests.util.TestRuleIgnoreAfterMaxFailures$1.evaluate(TestRuleIgnoreAfterMaxFailures.java:60)
	at org.apache.lucene.tests.util.TestRuleMarkFailure$1.evaluate(TestRuleMarkFailure.java:44)
	at org.junit.rules.RunRules.evaluate(RunRules.java:20)
	at com.carrotsearch.randomizedtesting.rules.StatementAdapter.evaluate(StatementAdapter.java:36)
	at com.carrotsearch.randomizedtesting.ThreadLeakControl$StatementRunner.run(ThreadLeakControl.java:375)
	at com.carrotsearch.randomizedtesting.ThreadLeakControl.forkTimeoutingTask(ThreadLeakControl.java:824)
	at com.carrotsearch.randomizedtesting.ThreadLeakControl$3.evaluate(ThreadLeakControl.java:475)
	at com.carrotsearch.randomizedtesting.RandomizedRunner.runSingleTest(RandomizedRunner.java:955)
	at com.carrotsearch.randomizedtesting.RandomizedRunner$5.evaluate(RandomizedRunner.java:840)
	at com.carrotsearch.randomizedtesting.RandomizedRunner$6.evaluate(RandomizedRunner.java:891)
	at com.carrotsearch.randomizedtesting.RandomizedRunner$7.evaluate(RandomizedRunner.java:902)
	at com.carrotsearch.randomizedtesting.rules.StatementAdapter.evaluate(StatementAdapter.java:36)
	at org.apache.lucene.tests.util.AbstractBeforeAfterRule$1.evaluate(AbstractBeforeAfterRule.java:43)
	at org.apache.lucene.tests.util.AbstractBeforeAfterRule$1.evaluate(AbstractBeforeAfterRule.java:43)
	at com.carrotsearch.randomizedtesting.rules.SystemPropertiesRestoreRule$1.evaluate(SystemPropertiesRestoreRule.java:57)
	at org.junit.rules.RunRules.evaluate(RunRules.java:20)
	at org.apache.lucene.tests.util.AbstractBeforeAfterRule$1.evaluate(AbstractBeforeAfterRule.java:43)
	at com.carrotsearch.randomizedtesting.rules.StatementAdapter.evaluate(StatementAdapter.java:36)
	at org.apache.lucene.tests.util.TestRuleStoreClassName$1.evaluate(TestRuleStoreClassName.java:38)
	at com.carrotsearch.randomizedtesting.rules.NoShadowingOrOverridesOnMethodsRule$1.evaluate(NoShadowingOrOverridesOnMethodsRule.java:40)
	at com.carrotsearch.randomizedtesting.rules.NoShadowingOrOverridesOnMethodsRule$1.evaluate(NoShadowingOrOverridesOnMethodsRule.java:40)
	at com.carrotsearch.randomizedtesting.rules.StatementAdapter.evaluate(StatementAdapter.java:36)
	at com.carrotsearch.randomizedtesting.rules.StatementAdapter.evaluate(StatementAdapter.java:36)
	at org.apache.lucene.tests.util.TestRuleAssertionsRequired$1.evaluate(TestRuleAssertionsRequired.java:53)
	at org.apache.lucene.tests.util.AbstractBeforeAfterRule$1.evaluate(AbstractBeforeAfterRule.java:43)
	at org.apache.lucene.tests.util.TestRuleMarkFailure$1.evaluate(TestRuleMarkFailure.java:44)
	at org.apache.lucene.tests.util.TestRuleIgnoreAfterMaxFailures$1.evaluate(TestRuleIgnoreAfterMaxFailures.java:60)
	at org.apache.lucene.tests.util.TestRuleIgnoreTestSuites$1.evaluate(TestRuleIgnoreTestSuites.java:47)
	at org.junit.rules.RunRules.evaluate(RunRules.java:20)
	at com.carrotsearch.randomizedtesting.rules.StatementAdapter.evaluate(StatementAdapter.java:36)
	at com.carrotsearch.randomizedtesting.ThreadLeakControl$StatementRunner.run(ThreadLeakControl.java:375)
	at com.carrotsearch.randomizedtesting.ThreadLeakControl.lambda$forkTimeoutingTask$0(ThreadLeakControl.java:831)
	at java.base/java.lang.Thread.run(Thread.java:831)


FAILED:  org.apache.solr.util.TestCircuitBreaker.testResponseWithCBTiming

Error Message:
java.lang.RuntimeException: Exception during query

Stack Trace:
java.lang.RuntimeException: Exception during query
	at __randomizedtesting.SeedInfo.seed([700669533F1A30C6:98DAC4B1CCF22AE6]:0)
	at org.apache.solr.SolrTestCaseJ4.assertQ(SolrTestCaseJ4.java:1042)
	at org.apache.solr.SolrTestCaseJ4.assertQ(SolrTestCaseJ4.java:1000)
	at org.apache.solr.util.TestCircuitBreaker.testResponseWithCBTiming(TestCircuitBreaker.java:262)
	at java.base/jdk.internal.reflect.NativeMethodAccessorImpl.invoke0(Native Method)
	at java.base/jdk.internal.reflect.NativeMethodAccessorImpl.invoke(NativeMethodAccessorImpl.java:78)
	at java.base/jdk.internal.reflect.DelegatingMethodAccessorImpl.invoke(DelegatingMethodAccessorImpl.java:43)
	at java.base/java.lang.reflect.Method.invoke(Method.java:567)
	at com.carrotsearch.randomizedtesting.RandomizedRunner.invoke(RandomizedRunner.java:1758)
	at com.carrotsearch.randomizedtesting.RandomizedRunner$8.evaluate(RandomizedRunner.java:946)
	at com.carrotsearch.randomizedtesting.RandomizedRunner$9.evaluate(RandomizedRunner.java:982)
	at com.carrotsearch.randomizedtesting.RandomizedRunner$10.evaluate(RandomizedRunner.java:996)
	at com.carrotsearch.randomizedtesting.rules.SystemPropertiesRestoreRule$1.evaluate(SystemPropertiesRestoreRule.java:57)
	at org.junit.rules.RunRules.evaluate(RunRules.java:20)
	at org.apache.lucene.tests.util.TestRuleSetupTeardownChained$1.evaluate(TestRuleSetupTeardownChained.java:44)
	at org.apache.lucene.tests.util.AbstractBeforeAfterRule$1.evaluate(AbstractBeforeAfterRule.java:43)
	at org.apache.lucene.tests.util.TestRuleThreadAndTestName$1.evaluate(TestRuleThreadAndTestName.java:45)
	at org.apache.lucene.tests.util.TestRuleIgnoreAfterMaxFailures$1.evaluate(TestRuleIgnoreAfterMaxFailures.java:60)
	at org.apache.lucene.tests.util.TestRuleMarkFailure$1.evaluate(TestRuleMarkFailure.java:44)
	at org.junit.rules.RunRules.evaluate(RunRules.java:20)
	at com.carrotsearch.randomizedtesting.rules.StatementAdapter.evaluate(StatementAdapter.java:36)
	at com.carrotsearch.randomizedtesting.ThreadLeakControl$StatementRunner.run(ThreadLeakControl.java:375)
	at com.carrotsearch.randomizedtesting.ThreadLeakControl.forkTimeoutingTask(ThreadLeakControl.java:824)
	at com.carrotsearch.randomizedtesting.ThreadLeakControl$3.evaluate(ThreadLeakControl.java:475)
	at com.carrotsearch.randomizedtesting.RandomizedRunner.runSingleTest(RandomizedRunner.java:955)
	at com.carrotsearch.randomizedtesting.RandomizedRunner$5.evaluate(RandomizedRunner.java:840)
	at com.carrotsearch.randomizedtesting.RandomizedRunner$6.evaluate(RandomizedRunner.java:891)
	at com.carrotsearch.randomizedtesting.RandomizedRunner$7.evaluate(RandomizedRunner.java:902)
	at com.carrotsearch.randomizedtesting.rules.StatementAdapter.evaluate(StatementAdapter.java:36)
	at org.apache.lucene.tests.util.AbstractBeforeAfterRule$1.evaluate(AbstractBeforeAfterRule.java:43)
	at org.apache.lucene.tests.util.AbstractBeforeAfterRule$1.evaluate(AbstractBeforeAfterRule.java:43)
	at com.carrotsearch.randomizedtesting.rules.SystemPropertiesRestoreRule$1.evaluate(SystemPropertiesRestoreRule.java:57)
	at org.junit.rules.RunRules.evaluate(RunRules.java:20)
	at org.apache.lucene.tests.util.AbstractBeforeAfterRule$1.evaluate(AbstractBeforeAfterRule.java:43)
	at com.carrotsearch.randomizedtesting.rules.StatementAdapter.evaluate(StatementAdapter.java:36)
	at org.apache.lucene.tests.util.TestRuleStoreClassName$1.evaluate(TestRuleStoreClassName.java:38)
	at com.carrotsearch.randomizedtesting.rules.NoShadowingOrOverridesOnMethodsRule$1.evaluate(NoShadowingOrOverridesOnMethodsRule.java:40)
	at com.carrotsearch.randomizedtesting.rules.NoShadowingOrOverridesOnMethodsRule$1.evaluate(NoShadowingOrOverridesOnMethodsRule.java:40)
	at com.carrotsearch.randomizedtesting.rules.StatementAdapter.evaluate(StatementAdapter.java:36)
	at com.carrotsearch.randomizedtesting.rules.StatementAdapter.evaluate(StatementAdapter.java:36)
	at org.apache.lucene.tests.util.TestRuleAssertionsRequired$1.evaluate(TestRuleAssertionsRequired.java:53)
	at org.apache.lucene.tests.util.AbstractBeforeAfterRule$1.evaluate(AbstractBeforeAfterRule.java:43)
	at org.apache.lucene.tests.util.TestRuleMarkFailure$1.evaluate(TestRuleMarkFailure.java:44)
	at org.apache.lucene.tests.util.TestRuleIgnoreAfterMaxFailures$1.evaluate(TestRuleIgnoreAfterMaxFailures.java:60)
	at org.apache.lucene.tests.util.TestRuleIgnoreTestSuites$1.evaluate(TestRuleIgnoreTestSuites.java:47)
	at org.junit.rules.RunRules.evaluate(RunRules.java:20)
	at com.carrotsearch.randomizedtesting.rules.StatementAdapter.evaluate(StatementAdapter.java:36)
	at com.carrotsearch.randomizedtesting.ThreadLeakControl$StatementRunner.run(ThreadLeakControl.java:375)
	at com.carrotsearch.randomizedtesting.ThreadLeakControl.lambda$forkTimeoutingTask$0(ThreadLeakControl.java:831)
	at java.base/java.lang.Thread.run(Thread.java:831)
Caused by: org.apache.solr.common.SolrException: Circuit Breakers tripped Memory Circuit Breaker triggered as JVM heap usage values are greater than allocated threshold.Seen JVM heap memory usage 446149384 and allocated threshold 402653184

	at app//org.apache.solr.handler.component.SearchHandler.handleRequestBody(SearchHandler.java:370)
	at app//org.apache.solr.handler.RequestHandlerBase.handleRequest(RequestHandlerBase.java:207)
	at app//org.apache.solr.core.SolrCore.execute(SolrCore.java:2866)
	at app//org.apache.solr.util.TestHarness.query(TestHarness.java:355)
	at app//org.apache.solr.util.TestHarness.query(TestHarness.java:335)
	at app//org.apache.solr.SolrTestCaseJ4.assertQ(SolrTestCaseJ4.java:1014)
	... 48 more

[JENKINS] Solr-main-Linux (64bit/jdk-11.0.15) - Build # 6328 - Still Unstable!

Posted by Policeman Jenkins Server <je...@thetaphi.de>.
Build: https://jenkins.thetaphi.de/job/Solr-main-Linux/6328/
Java: 64bit/jdk-11.0.15 -XX:-UseCompressedOops -XX:+UseSerialGC

1 tests failed.
FAILED:  org.apache.solr.client.solrj.impl.CloudHttp2SolrClientBuilderTest.classMethod

Error Message:
com.carrotsearch.randomizedtesting.ThreadLeakError: 1 thread leaked from SUITE scope at org.apache.solr.client.solrj.impl.CloudHttp2SolrClientBuilderTest: 
   1) Thread[id=2083, name=h2sc-1128-thread-1, state=RUNNABLE, group=TGRP-CloudHttp2SolrClientBuilderTest]
        at java.base@11.0.15/jdk.internal.misc.Unsafe.unpark(Native Method)
        at java.base@11.0.15/java.util.concurrent.locks.LockSupport.unpark(LockSupport.java:160)
        at java.base@11.0.15/java.util.concurrent.locks.AbstractQueuedSynchronizer.unparkSuccessor(AbstractQueuedSynchronizer.java:709)
        at java.base@11.0.15/java.util.concurrent.locks.AbstractQueuedSynchronizer.release(AbstractQueuedSynchronizer.java:1305)
        at java.base@11.0.15/java.util.concurrent.locks.ReentrantLock.unlock(ReentrantLock.java:439)
        at java.base@11.0.15/java.util.concurrent.ThreadPoolExecutor.tryTerminate(ThreadPoolExecutor.java:726)
        at java.base@11.0.15/java.util.concurrent.ThreadPoolExecutor.processWorkerExit(ThreadPoolExecutor.java:994)
        at java.base@11.0.15/java.util.concurrent.ThreadPoolExecutor.runWorker(ThreadPoolExecutor.java:1142)
        at java.base@11.0.15/java.util.concurrent.ThreadPoolExecutor$Worker.run(ThreadPoolExecutor.java:628)
        at java.base@11.0.15/java.lang.Thread.run(Thread.java:829)

Stack Trace:
com.carrotsearch.randomizedtesting.ThreadLeakError: 1 thread leaked from SUITE scope at org.apache.solr.client.solrj.impl.CloudHttp2SolrClientBuilderTest: 
   1) Thread[id=2083, name=h2sc-1128-thread-1, state=RUNNABLE, group=TGRP-CloudHttp2SolrClientBuilderTest]
        at java.base@11.0.15/jdk.internal.misc.Unsafe.unpark(Native Method)
        at java.base@11.0.15/java.util.concurrent.locks.LockSupport.unpark(LockSupport.java:160)
        at java.base@11.0.15/java.util.concurrent.locks.AbstractQueuedSynchronizer.unparkSuccessor(AbstractQueuedSynchronizer.java:709)
        at java.base@11.0.15/java.util.concurrent.locks.AbstractQueuedSynchronizer.release(AbstractQueuedSynchronizer.java:1305)
        at java.base@11.0.15/java.util.concurrent.locks.ReentrantLock.unlock(ReentrantLock.java:439)
        at java.base@11.0.15/java.util.concurrent.ThreadPoolExecutor.tryTerminate(ThreadPoolExecutor.java:726)
        at java.base@11.0.15/java.util.concurrent.ThreadPoolExecutor.processWorkerExit(ThreadPoolExecutor.java:994)
        at java.base@11.0.15/java.util.concurrent.ThreadPoolExecutor.runWorker(ThreadPoolExecutor.java:1142)
        at java.base@11.0.15/java.util.concurrent.ThreadPoolExecutor$Worker.run(ThreadPoolExecutor.java:628)
        at java.base@11.0.15/java.lang.Thread.run(Thread.java:829)
	at __randomizedtesting.SeedInfo.seed([A561F04D451DD8CE]:0)