You are viewing a plain text version of this content. The canonical link for it is here.
Posted to dev@zeppelin.apache.org by "Jongyoul Lee (JIRA)" <ji...@apache.org> on 2017/07/10 16:43:00 UTC

[jira] [Created] (ZEPPELIN-2759) Flaky Test: InterpreterOutputChangeWatcher.test

Jongyoul Lee created ZEPPELIN-2759:
--------------------------------------

             Summary: Flaky Test: InterpreterOutputChangeWatcher.test
                 Key: ZEPPELIN-2759
                 URL: https://issues.apache.org/jira/browse/ZEPPELIN-2759
             Project: Zeppelin
          Issue Type: Sub-task
            Reporter: Jongyoul Lee
            Assignee: Jongyoul Lee


{noformat}
Running org.apache.zeppelin.interpreter.InterpreterOutputChangeWatcherTest
15:12:09,215  INFO org.apache.zeppelin.interpreter.InterpreterOutputChangeWatcher:71 - watch /tmp/ZeppelinLTest_1498403528213
15:12:10,223  INFO org.apache.zeppelin.interpreter.InterpreterOutputChangeWatcher:125 - File change detected /tmp/ZeppelinLTest_1498403528213/test1
15:12:10,224  INFO org.apache.zeppelin.interpreter.InterpreterOutputChangeWatcher:125 - File change detected /tmp/ZeppelinLTest_1498403528213/test1
Tests run: 1, Failures: 1, Errors: 0, Skipped: 0, Time elapsed: 32.034 sec <<< FAILURE! - in org.apache.zeppelin.interpreter.InterpreterOutputChangeWatcherTest
test(org.apache.zeppelin.interpreter.InterpreterOutputChangeWatcherTest)  Time elapsed: 32.031 sec  <<< FAILURE!
java.lang.AssertionError: expected:<1> but was:<2>
	at org.junit.Assert.fail(Assert.java:88)
	at org.junit.Assert.failNotEquals(Assert.java:834)
	at org.junit.Assert.assertEquals(Assert.java:645)
	at org.junit.Assert.assertEquals(Assert.java:631)
	at org.apache.zeppelin.interpreter.InterpreterOutputChangeWatcherTest.test(InterpreterOutputChangeWatcherTest.java:95)
{noformat}

Test works as expected but we need to improve measuring method.



--
This message was sent by Atlassian JIRA
(v6.4.14#64029)